{"text_format":"3","workbook":"xlsx","n_sheets":6,"sheets":["Instructions","Orders","Styles","SKU","SKU_Unique","Customer"],"not_rendered":{"images":1,"macros":1,"defined_names":12},"read":"whole","date_system":"1900"}

{"sheet":"Instructions","index":0,"n_rows":33,"n_cols":4,"rows_kept":33,"merged":[[10,2,10,12],[13,1,13,12],[20,2,20,12],[26,1,26,5],[32,0,32,4]]}
["Forsake Order Form Instructions"]
["Below are instructions on how this form can be used to send in your Forsake orders."]
[]
["1.","Everything can be done from the Orders tab."]
[]
["2.","Start by entering in your billing and shipping information."]
[null,null,"- All green cells are required, yellow cells will be used to help build the order."]
[null,null,"- You must enter a Bill To, Ship Date & Cancel Date."]
[null,null,"- When entering Bill To and Ship To the customer name will be added for you."]
[null,null,"- After entering a Bill To a list of valid ship to numbers will display in the dropdown box."]
[null,null,"- All other cells on the sheet are not required to create an order, but can be used by you to identify the order you are sending in."]
[null,null,"- Click on the Hide Shipping and Show Shipping buttons to hide or show rows 5 to 17."]
[]
["3.","Next you need to select styles you would like to order."]
[null,null,"- To select by style."]
{"$rows_left_out":19}
{"sheet":"Orders","index":1,"n_rows":24,"n_cols":18,"rows_kept":24,"merged":[[0,0,2,10],[0,11,0,13],[1,11,1,13],[2,11,2,13],[3,0,3,5],[3,9,3,13],[4,3,4,4],[4,5,12,6],[4,7,4,12],[4,13,14,13],[5,1,5,4],[5,7,5,8],[5,9,5,12],[6,1,6,4],[6,7,6,8],[6,9,6,12],[7,1,7,2],[7,7,7,12],[8,1,8,4],[8,7,8,8],[8,9,8,12],[9,3,9,4],[9,7,9,8],[9,9,9,12],[10,1,10,4],[10,7,10,8],[10,9,10,12],[11,1,11,4],[11,7,11,8],[11,9,11,12],[12,1,12,2],[12,7,12,8],[12,9,12,12],[13,1,13,3],[13,4,13,6],[13,7,13,8],[13,9,13,12],[14,1,15,6],[14,7,14,8],[14,9,14,12],[15,7,17,8],[15,9,16,13],[16,0,16,6],[17,0,17,3],[17,4,17,6],[17,9,17,13],[18,0,18,4],[18,7,18,8],[18,11,18,12],[19,7,19,8],[19,11,19,12]]}
["FORSAKE",{"$nulls":10},"FORSAKE",{"$nulls":3},"Created","Terms based on customer","Price Level based on customer"]
[{"$nulls":11},"333 W. ESTABROOK BLVD",{"$nulls":3},"2022-05-05T13:47:15","CA – Cash in advance","1 – Regular wholesale"]
[{"$nulls":11},"GLENDALE, WI  53212",{"$nulls":3},"US","CC – Credit card","2 – 8% discount"]
["FS SS23",{"$nulls":5},"Version:",{"$f":"P15","v":"1.0.1"},null,"Phone: 1-833-685-2599  Fax: 1-414-908-1604",{"$nulls":5},"User","C1 – Credit card, one-time payment","3 – 4% discount"]
["Bill To:",null,"Name:",{"$f":"IFERROR(INDEX(Customer[Name], MATCH(B5, Customer[Customer],0)), \"Customer not found\")","v":"Customer not found"},{"$nulls":11},"JEFFB","0D – Net 30","5 – Closeout"]
["Address:",{"$nulls":6},"PO#:",{"$nulls":8},"0E – Net 45"]
[{"$nulls":7},"Date:",null,{"$f":"TODAY()","v":"2022-05-31"},{"$nulls":5},"Division","0G – Net 90"]
["City, St, Zip:",{"$nulls":6},"www.forsake.com",{"$nulls":7},"14"]
["Phone:",{"$nulls":6},"Ship Date:",{"$nulls":7},"Forsake"]
["Ship To:",null,"Name:",{"$f":"IFERROR(INDEX(Customer[Name], MATCH(CONCATENATE(B5, \"-\",B10), Customer[Customer],0)), D5)","v":"Customer not found"},{"$nulls":3},"Cancel Date:"]
["Address:",{"$nulls":6},"Terms:",null,"Terms based on customer",{"$nulls":5},"# of Lines"]
[{"$nulls":7},"Price Level:",null,"Price Level based on customer",{"$nulls":5},{"$f":"SUBTOTAL(103, Order[Stock])","v":0}]
["City, St, Zip:",{"$nulls":6},"Ship Via:"]
["Phone:",{"$nulls":3},"* Comments will be sent to customer service.",null,null,"Sales Rep:",{"$nulls":7},"Version"]
["Comments:",{"$nulls":6},"Buyer:",{"$nulls":7},"1.0.1"]
{"$rows_left_out":10}
{"sheet":"Styles","index":2,"n_rows":84,"n_cols":10,"rows_kept":84}
["Catalog Page","Stock","Color","Width","Style Desc","Color Desc","Carry Over","Cost","MSRP","MAP"]
[0,"M80002  ","009","M  ","M Cascade Trail Low","Blk Multi","          ",{"v":65,"d":"$65.00"},{"v":130,"d":"$130.00"},{"v":129.95,"d":"$129.95"}]
[0,"M80002  ","419","M  ","M Cascade Trail Low","Navy/Gray","          ",{"v":65,"d":"$65.00"},{"v":130,"d":"$130.00"},{"v":129.95,"d":"$129.95"}]
[0,"W80005  ","062","M  ","W Cascade Trail Low","Gray Multi","          ",{"v":65,"d":"$65.00"},{"v":130,"d":"$130.00"},{"v":129.95,"d":"$129.95"}]
[0,"W80005  ","450","M  ","W Cascade Trail Low","Sky Blue","          ",{"v":65,"d":"$65.00"},{"v":130,"d":"$130.00"},{"v":129.95,"d":"$129.95"}]
[1,"M80037  ","001","M  ","M Wild Sky Mid","Black","          ",{"v":77.5,"d":"$77.50"},{"v":155,"d":"$155.00"},{"v":154.95,"d":"$154.95"}]
[1,"M80037  ","072","M  ","M Wild Sky Mid","Dkgry/Gold","          ",{"v":77.5,"d":"$77.50"},{"v":155,"d":"$155.00"},{"v":154.95,"d":"$154.95"}]
[1,"M80037  ","249","M  ","M Wild Sky Mid","Brn Multi","          ",{"v":77.5,"d":"$77.50"},{"v":155,"d":"$155.00"},{"v":154.95,"d":"$154.95"}]
[2,"MFW21D1 ","235","M  ","M Dispatch","Toffee","C/O       ",{"v":85,"d":"$85.00"},{"v":170,"d":"$170.00"},{"v":169.95,"d":"$169.95"}]
[2,"MFW21D3 ","410","M  ","M Dispatch","Navy","C/O       ",{"v":85,"d":"$85.00"},{"v":170,"d":"$170.00"},{"v":169.95,"d":"$169.95"}]
[2,"M80013  ","349","M  ","M Dispatch","Lodenmulti","C/O       ",{"v":85,"d":"$85.00"},{"v":170,"d":"$170.00"},{"v":169.95,"d":"$169.95"}]
[3,"M80001  ","020","M  ","M Dispatch Low Top","Gray",null,{"v":77.5,"d":"$77.50"},{"v":155,"d":"$155.00"},{"v":149.95,"d":"$149.95"}]
[3,"M80001  ","025","M  ","M Dispatch Low Top","Gunmetal","C/O       ",{"v":77.5,"d":"$77.50"},{"v":155,"d":"$155.00"},{"v":149.95,"d":"$149.95"}]
[3,"M80001  ","240","M  ","M Dispatch Low Top","Tan","C/O       ",{"v":77.5,"d":"$77.50"},{"v":155,"d":"$155.00"},{"v":149.95,"d":"$149.95"}]
[3,"M80001  ","305","M  ","M Dispatch Low Top","Loden","C/O       ",{"v":77.5,"d":"$77.50"},{"v":155,"d":"$155.00"},{"v":149.95,"d":"$149.95"}]
{"$rows_left_out":70}
{"sheet":"SKU","index":3,"n_rows":987,"n_cols":20,"rows_kept":987,"hidden":true}
["Catalog Page","Stock","Color","Width","Style Desc","Color Desc","UPC","Carry Over","Size","Quantity","Cost","MSRP","MAP","Extended Cost","SKU","Filler","Helper1","Helper2","Helper3"]
[15,"MFW18PM4","201","M  ","M Phil Mid Top","Dark Brown","7-18598-83058-8","C/O       ","8",null,{"v":77.5,"d":"$77.50"},{"v":155,"d":"$155.00"},{"v":154.95,"d":"$154.95"},{"$f":"J2*K2","v":0},"Mfw18pm4-201-M  M Phil Mid Top"," ",{"$f":"--ISNUMBER(IFERROR(SEARCH(Orders!$E18,O2,1),\"\"))","v":1},{"$f":"IF(Q2=1,COUNTIF($Q$2:Q2,1),\"\")","v":1},{"$f":"IFERROR(INDEX($O2:$O986,MATCH(ROWS($Q$2:Q2),$R2:$R986,0)),\"\")","v":"Mfw18pm4-201-M  M Phil Mid Top"}]
[15,"MFW18PM4","201","M  ","M Phil Mid Top","Dark Brown","7-18598-83059-5","C/O       ",8.5,null,{"v":77.5,"d":"$77.50"},{"v":155,"d":"$155.00"},{"v":154.95,"d":"$154.95"},0,"Mfw18pm4-201-M  M Phil Mid Top"," ",{"$f":"--ISNUMBER(IFERROR(SEARCH(Orders!$E18,O3,1),\"\"))","v":1},{"$f":"IF(Q3=1,COUNTIF($Q$2:Q3,1),\"\")","v":2},{"$f":"IFERROR(INDEX($O2:$O986,MATCH(ROWS($Q$2:Q3),$R2:$R986,0)),\"\")","v":"Mfw18pm4-201-M  M Phil Mid Top"}]
[15,"MFW18PM4","201","M  ","M Phil Mid Top","Dark Brown","7-18598-83060-1","C/O       ",9,null,{"v":77.5,"d":"$77.50"},{"v":155,"d":"$155.00"},{"v":154.95,"d":"$154.95"},0,"Mfw18pm4-201-M  M Phil Mid Top"," ",{"$f":"--ISNUMBER(IFERROR(SEARCH(Orders!$E18,O4,1),\"\"))","v":1},{"$f":"IF(Q4=1,COUNTIF($Q$2:Q4,1),\"\")","v":3},{"$f":"IFERROR(INDEX($O2:$O986,MATCH(ROWS($Q$2:Q4),$R2:$R986,0)),\"\")","v":"Mfw18pm4-201-M  M Phil Mid Top"}]
[15,"MFW18PM4","201","M  ","M Phil Mid Top","Dark Brown","7-18598-83061-8","C/O       ",9.5,null,{"v":77.5,"d":"$77.50"},{"v":155,"d":"$155.00"},{"v":154.95,"d":"$154.95"},0,"Mfw18pm4-201-M  M Phil Mid Top"," ",{"$f":"--ISNUMBER(IFERROR(SEARCH(Orders!$E18,O5,1),\"\"))","v":1},{"$f":"IF(Q5=1,COUNTIF($Q$2:Q5,1),\"\")","v":4},{"$f":"IFERROR(INDEX($O2:$O986,MATCH(ROWS($Q$2:Q5),$R2:$R986,0)),\"\")","v":"Mfw18pm4-201-M  M Phil Mid Top"}]
[15,"MFW18PM4","201","M  ","M Phil Mid Top","Dark Brown","7-18598-83062-5","C/O       ",10,null,{"v":77.5,"d":"$77.50"},{"v":155,"d":"$155.00"},{"v":154.95,"d":"$154.95"},0,"Mfw18pm4-201-M  M Phil Mid Top"," ",{"$f":"--ISNUMBER(IFERROR(SEARCH(Orders!$E18,O6,1),\"\"))","v":1},{"$f":"IF(Q6=1,COUNTIF($Q$2:Q6,1),\"\")","v":5},{"$f":"IFERROR(INDEX($O2:$O986,MATCH(ROWS($Q$2:Q6),$R2:$R986,0)),\"\")","v":"Mfw18pm4-201-M  M Phil Mid Top"}]
[15,"MFW18PM4","201","M  ","M Phil Mid Top","Dark Brown","7-18598-83063-2","C/O       ",10.5,null,{"v":77.5,"d":"$77.50"},{"v":155,"d":"$155.00"},{"v":154.95,"d":"$154.95"},0,"Mfw18pm4-201-M  M Phil Mid Top"," ",{"$f":"--ISNUMBER(IFERROR(SEARCH(Orders!$E18,O7,1),\"\"))","v":1},{"$f":"IF(Q7=1,COUNTIF($Q$2:Q7,1),\"\")","v":6},{"$f":"IFERROR(INDEX($O2:$O986,MATCH(ROWS($Q$2:Q7),$R2:$R986,0)),\"\")","v":"Mfw18pm4-201-M  M Phil Mid Top"}]
[15,"MFW18PM4","201","M  ","M Phil Mid Top","Dark Brown","7-18598-83064-9","C/O       ",11,null,{"v":77.5,"d":"$77.50"},{"v":155,"d":"$155.00"},{"v":154.95,"d":"$154.95"},0,"Mfw18pm4-201-M  M Phil Mid Top"," ",{"$f":"--ISNUMBER(IFERROR(SEARCH(Orders!$E18,O8,1),\"\"))","v":1},{"$f":"IF(Q8=1,COUNTIF($Q$2:Q8,1),\"\")","v":7},{"$f":"IFERROR(INDEX($O2:$O986,MATCH(ROWS($Q$2:Q8),$R2:$R986,0)),\"\")","v":"Mfw18pm4-201-M  M Phil Mid Top"}]
[15,"MFW18PM4","201","M  ","M Phil Mid Top","Dark Brown","7-18598-83065-6","C/O       ",11.5,null,{"v":77.5,"d":"$77.50"},{"v":155,"d":"$155.00"},{"v":154.95,"d":"$154.95"},0,"Mfw18pm4-201-M  M Phil Mid Top"," ",{"$f":"--ISNUMBER(IFERROR(SEARCH(Orders!$E18,O9,1),\"\"))","v":1},{"$f":"IF(Q9=1,COUNTIF($Q$2:Q9,1),\"\")","v":8},{"$f":"IFERROR(INDEX($O2:$O986,MATCH(ROWS($Q$2:Q9),$R2:$R986,0)),\"\")","v":"Mfw18pm4-201-M  M Phil Mid Top"}]
[15,"MFW18PM4","201","M  ","M Phil Mid Top","Dark Brown","7-18598-83066-3","C/O       ",12,null,{"v":77.5,"d":"$77.50"},{"v":155,"d":"$155.00"},{"v":154.95,"d":"$154.95"},0,"Mfw18pm4-201-M  M Phil Mid Top"," ",{"$f":"--ISNUMBER(IFERROR(SEARCH(Orders!$E18,O10,1),\"\"))","v":1},{"$f":"IF(Q10=1,COUNTIF($Q$2:Q10,1),\"\")","v":9},{"$f":"IFERROR(INDEX($O2:$O986,MATCH(ROWS($Q$2:Q10),$R2:$R986,0)),\"\")","v":"Mfw18pm4-201-M  M Phil Mid Top"}]
[15,"MFW18PM4","201","M  ","M Phil Mid Top","Dark Brown","7-18598-83067-0","C/O       ",12.5,null,{"v":77.5,"d":"$77.50"},{"v":155,"d":"$155.00"},{"v":154.95,"d":"$154.95"},0,"Mfw18pm4-201-M  M Phil Mid Top"," ",{"$f":"--ISNUMBER(IFERROR(SEARCH(Orders!$E18,O11,1),\"\"))","v":1},{"$f":"IF(Q11=1,COUNTIF($Q$2:Q11,1),\"\")","v":10},{"$f":"IFERROR(INDEX($O2:$O986,MATCH(ROWS($Q$2:Q11),$R2:$R986,0)),\"\")","v":"Mfw18pm4-201-M  M Phil Mid Top"}]
[15,"MFW18PM4","201","M  ","M Phil Mid Top","Dark Brown","7-18598-83068-7","C/O       ",13,null,{"v":77.5,"d":"$77.50"},{"v":155,"d":"$155.00"},{"v":154.95,"d":"$154.95"},0,"Mfw18pm4-201-M  M Phil Mid Top"," ",{"$f":"--ISNUMBER(IFERROR(SEARCH(Orders!$E18,O12,1),\"\"))","v":1},{"$f":"IF(Q12=1,COUNTIF($Q$2:Q12,1),\"\")","v":11},{"$f":"IFERROR(INDEX($O2:$O986,MATCH(ROWS($Q$2:Q12),$R2:$R986,0)),\"\")","v":"Mfw18pm4-201-M  M Phil Mid Top"}]
[15,"MFW18PM4","201","M  ","M Phil Mid Top","Dark Brown","7-18598-83069-4","C/O       ",14,null,{"v":77.5,"d":"$77.50"},{"v":155,"d":"$155.00"},{"v":154.95,"d":"$154.95"},0,"Mfw18pm4-201-M  M Phil Mid Top"," ",{"$f":"--ISNUMBER(IFERROR(SEARCH(Orders!$E18,O13,1),\"\"))","v":1},{"$f":"IF(Q13=1,COUNTIF($Q$2:Q13,1),\"\")","v":12},{"$f":"IFERROR(INDEX($O2:$O986,MATCH(ROWS($Q$2:Q13),$R2:$R986,0)),\"\")","v":"Mfw18pm4-201-M  M Phil Mid Top"}]
[15,"MFW18PM5","020","M  ","M Phil Mid Top","Gray","7-52505-95186-7","C/O       ",8,null,{"v":77.5,"d":"$77.50"},{"v":155,"d":"$155.00"},{"v":154.95,"d":"$154.95"},0,"Mfw18pm5-020-M  M Phil Mid Top"," ",{"$f":"--ISNUMBER(IFERROR(SEARCH(Orders!$E18,O14,1),\"\"))","v":1},{"$f":"IF(Q14=1,COUNTIF($Q$2:Q14,1),\"\")","v":13},{"$f":"IFERROR(INDEX($O2:$O986,MATCH(ROWS($Q$2:Q14),$R2:$R986,0)),\"\")","v":"Mfw18pm5-020-M  M Phil Mid Top"}]
[15,"MFW18PM5","020","M  ","M Phil Mid Top","Gray","7-52505-95187-4","C/O       ",8.5,null,{"v":77.5,"d":"$77.50"},{"v":155,"d":"$155.00"},{"v":154.95,"d":"$154.95"},0,"Mfw18pm5-020-M  M Phil Mid Top"," ",{"$f":"--ISNUMBER(IFERROR(SEARCH(Orders!$E18,O15,1),\"\"))","v":1},{"$f":"IF(Q15=1,COUNTIF($Q$2:Q15,1),\"\")","v":14},{"$f":"IFERROR(INDEX($O2:$O986,MATCH(ROWS($Q$2:Q15),$R2:$R986,0)),\"\")","v":"Mfw18pm5-020-M  M Phil Mid Top"}]
{"$rows_left_out":973}
{"sheet":"SKU_Unique","index":4,"n_rows":84,"n_cols":23,"rows_kept":84,"hidden":true}
["Catalog Page","Stock","Color","Width","Style Desc","Color Desc","UPC","Carry Over","Size","Quantity","Cost","MSRP","MAP","Extended Cost","SKU","Filler","Helper1","Helper2",null,{"$f":"OFFSET(SKU_Unique!$S1,Orders!P18,0)","v":0},null,null,{"$f":"OFFSET(SKU_Unique!$V1,Orders!P20,0)","v":0}]
[15,"MFW18PM4","201","M  ","M Phil Mid Top","Dark Brown","7-18598-83058-8","C/O       ","8",null,{"v":77.5,"d":"$77.50"},{"v":155,"d":"$155.00"},{"v":154.95,"d":"$154.95"},{"$f":"J2*K2","v":0},"Mfw18pm4-201-M  M Phil Mid Top"," ",{"$f":"--ISNUMBER(IFERROR(SEARCH(Orders!$E$18,O2,1),\"\"))","v":1},{"$f":"IF(Q2=1,COUNTIF($Q$2:Q2,1),\"\")","v":1},{"$f":"IFERROR(INDEX($O2:$O986,MATCH(ROWS($Q$2:Q2),$R2:$R986,0)),\"\")","v":"Mfw18pm4-201-M  M Phil Mid Top"},{"$f":"IF(Orders!$B$20=$A$2, 1, \"\")","v":""},{"$f":"IF(T2=1,COUNTIF($T$2:T2,1),\"\")","v":""},{"$f":"IFERROR(INDEX($O2:$O986,MATCH(ROWS($T$2:T2),$U2:$U986,0)),\"\")","v":"M80002-009-M  M Cascade Trail Low"}]
[15,"MFW18PM5","020","M  ","M Phil Mid Top","Gray","7-52505-95186-7","C/O       ",8,null,{"v":77.5,"d":"$77.50"},{"v":155,"d":"$155.00"},{"v":154.95,"d":"$154.95"},0,"Mfw18pm5-020-M  M Phil Mid Top"," ",{"$f":"--ISNUMBER(IFERROR(SEARCH(Orders!$E$18,O3,1),\"\"))","v":1},{"$f":"IF(Q3=1,COUNTIF($Q$2:Q3,1),\"\")","v":2},{"$f":"IFERROR(INDEX($O2:$O986,MATCH(ROWS($Q$2:Q3),$R2:$R986,0)),\"\")","v":"Mfw18pm5-020-M  M Phil Mid Top"},{"$f":"IF(Orders!$B$20=$A$3, 1, \"\")","v":""},{"$f":"IF(T3=1,COUNTIF($T$2:T3,1),\"\")","v":""},{"$f":"IFERROR(INDEX($O2:$O986,MATCH(ROWS($T$2:T3),$U2:$U986,0)),\"\")","v":"M80002-419-M  M Cascade Trail Low"}]
[9,"MFW19W1 ","988","M  ","M Halden Mid","Tan/Black","7-18598-82980-3","C/O       ",8,null,{"v":87.5,"d":"$87.50"},{"v":175,"d":"$175.00"},{"v":174.95,"d":"$174.95"},0,"Mfw19w1-988-M  M Halden Mid"," ",{"$f":"--ISNUMBER(IFERROR(SEARCH(Orders!$E$18,O4,1),\"\"))","v":1},{"$f":"IF(Q4=1,COUNTIF($Q$2:Q4,1),\"\")","v":3},{"$f":"IFERROR(INDEX($O2:$O986,MATCH(ROWS($Q$2:Q4),$R2:$R986,0)),\"\")","v":"Mfw19w1-988-M  M Halden Mid"},{"$f":"IF(Orders!$B$20=$A$4, 1, \"\")","v":""},{"$f":"IF(T4=1,COUNTIF($T$2:T4,1),\"\")","v":""},{"$f":"IFERROR(INDEX($O2:$O986,MATCH(ROWS($T$2:T4),$U2:$U986,0)),\"\")","v":"W80005-062-M  W Cascade Trail Low"}]
[9,"MFW19W4 ","219","M  ","M Halden","Mocha Mlti","8-40221-90095-2","C/O       ",8,null,{"v":87.5,"d":"$87.50"},{"v":175,"d":"$175.00"},{"v":174.95,"d":"$174.95"},0,"Mfw19w4-219-M  M Halden"," ",{"$f":"--ISNUMBER(IFERROR(SEARCH(Orders!$E$18,O5,1),\"\"))","v":1},{"$f":"IF(Q5=1,COUNTIF($Q$2:Q5,1),\"\")","v":4},{"$f":"IFERROR(INDEX($O2:$O986,MATCH(ROWS($Q$2:Q5),$R2:$R986,0)),\"\")","v":"Mfw19w4-219-M  M Halden"},{"$f":"IF(Orders!$B$20=$A$5, 1, \"\")","v":""},{"$f":"IF(T5=1,COUNTIF($T$2:T5,1),\"\")","v":""},{"$f":"IFERROR(INDEX($O2:$O986,MATCH(ROWS($T$2:T5),$U2:$U986,0)),\"\")","v":"W80005-450-M  W Cascade Trail Low"}]
[11,"MFW20DH2","216","M  ","M Davos High","Mocha","7-52505-95228-4","C/O       ",8,null,{"v":95,"d":"$95.00"},{"v":190,"d":"$190.00"},{"v":189.95,"d":"$189.95"},0,"Mfw20dh2-216-M  M Davos High"," ",{"$f":"--ISNUMBER(IFERROR(SEARCH(Orders!$E$18,O6,1),\"\"))","v":1},{"$f":"IF(Q6=1,COUNTIF($Q$2:Q6,1),\"\")","v":5},{"$f":"IFERROR(INDEX($O2:$O986,MATCH(ROWS($Q$2:Q6),$R2:$R986,0)),\"\")","v":"Mfw20dh2-216-M  M Davos High"},{"$f":"IF(Orders!$B$20=$A$6, 1, \"\")","v":""},{"$f":"IF(T6=1,COUNTIF($T$2:T6,1),\"\")","v":""},{"$f":"IFERROR(INDEX($O2:$O986,MATCH(ROWS($T$2:T6),$U2:$U986,0)),\"\")","v":""}]
[11,"MFW20DH3","235","M  ","M Davos High","Toffee","7-52505-95242-0","C/O       ",8,null,{"v":95,"d":"$95.00"},{"v":190,"d":"$190.00"},{"v":189.95,"d":"$189.95"},0,"Mfw20dh3-235-M  M Davos High"," ",{"$f":"--ISNUMBER(IFERROR(SEARCH(Orders!$E$18,O7,1),\"\"))","v":1},{"$f":"IF(Q7=1,COUNTIF($Q$2:Q7,1),\"\")","v":6},{"$f":"IFERROR(INDEX($O2:$O986,MATCH(ROWS($Q$2:Q7),$R2:$R986,0)),\"\")","v":"Mfw20dh3-235-M  M Davos High"},{"$f":"IF(Orders!$B$20=$A$7, 1, \"\")","v":""},{"$f":"IF(T7=1,COUNTIF($T$2:T7,1),\"\")","v":""},{"$f":"IFERROR(INDEX($O2:$O986,MATCH(ROWS($T$2:T7),$U2:$U986,0)),\"\")","v":""}]
[11,"MFW20DH4","025","M  ","M Davos High","Gunmetal","8-40221-90081-5","C/O       ",8,null,{"v":95,"d":"$95.00"},{"v":190,"d":"$190.00"},{"v":189.95,"d":"$189.95"},0,"Mfw20dh4-025-M  M Davos High"," ",{"$f":"--ISNUMBER(IFERROR(SEARCH(Orders!$E$18,O8,1),\"\"))","v":1},{"$f":"IF(Q8=1,COUNTIF($Q$2:Q8,1),\"\")","v":7},{"$f":"IFERROR(INDEX($O2:$O986,MATCH(ROWS($Q$2:Q8),$R2:$R986,0)),\"\")","v":"Mfw20dh4-025-M  M Davos High"},{"$f":"IF(Orders!$B$20=$A$8, 1, \"\")","v":""},{"$f":"IF(T8=1,COUNTIF($T$2:T8,1),\"\")","v":""},{"$f":"IFERROR(INDEX($O2:$O986,MATCH(ROWS($T$2:T8),$U2:$U986,0)),\"\")","v":""}]
[12,"MFW21DM1","235","M  ","M Davos Mid Top","Toffee","8-40221-90387-8","C/O       ",8,null,{"v":85,"d":"$85.00"},{"v":170,"d":"$170.00"},{"v":169.95,"d":"$169.95"},0,"Mfw21dm1-235-M  M Davos Mid Top"," ",{"$f":"--ISNUMBER(IFERROR(SEARCH(Orders!$E$18,O9,1),\"\"))","v":1},{"$f":"IF(Q9=1,COUNTIF($Q$2:Q9,1),\"\")","v":8},{"$f":"IFERROR(INDEX($O2:$O986,MATCH(ROWS($Q$2:Q9),$R2:$R986,0)),\"\")","v":"Mfw21dm1-235-M  M Davos Mid Top"},{"$f":"IF(Orders!$B$20=$A$9, 1, \"\")","v":""},{"$f":"IF(T9=1,COUNTIF($T$2:T9,1),\"\")","v":""},{"$f":"IFERROR(INDEX($O2:$O986,MATCH(ROWS($T$2:T9),$U2:$U986,0)),\"\")","v":""}]
[2,"MFW21D1 ","235","M  ","M Dispatch","Toffee","8-40221-90109-6","C/O       ",8,null,{"v":85,"d":"$85.00"},{"v":170,"d":"$170.00"},{"v":169.95,"d":"$169.95"},0,"Mfw21d1-235-M  M Dispatch"," ",{"$f":"--ISNUMBER(IFERROR(SEARCH(Orders!$E$18,O10,1),\"\"))","v":1},{"$f":"IF(Q10=1,COUNTIF($Q$2:Q10,1),\"\")","v":9},{"$f":"IFERROR(INDEX($O2:$O986,MATCH(ROWS($Q$2:Q10),$R2:$R986,0)),\"\")","v":"Mfw21d1-235-M  M Dispatch"},{"$f":"IF(Orders!$B$20=$A$10, 1, \"\")","v":""},{"$f":"IF(T10=1,COUNTIF($T$2:T10,1),\"\")","v":""},{"$f":"IFERROR(INDEX($O2:$O986,MATCH(ROWS($T$2:T10),$U2:$U986,0)),\"\")","v":""}]
[2,"MFW21D3 ","410","M  ","M Dispatch","Navy","8-40221-90137-9","C/O       ",8,null,{"v":85,"d":"$85.00"},{"v":170,"d":"$170.00"},{"v":169.95,"d":"$169.95"},0,"Mfw21d3-410-M  M Dispatch"," ",{"$f":"--ISNUMBER(IFERROR(SEARCH(Orders!$E$18,O11,1),\"\"))","v":1},{"$f":"IF(Q11=1,COUNTIF($Q$2:Q11,1),\"\")","v":10},{"$f":"IFERROR(INDEX($O2:$O986,MATCH(ROWS($Q$2:Q11),$R2:$R986,0)),\"\")","v":"Mfw21d3-410-M  M Dispatch"},{"$f":"IF(Orders!$B$20=$A$11, 1, \"\")","v":""},{"$f":"IF(T11=1,COUNTIF($T$2:T11,1),\"\")","v":""},{"$f":"IFERROR(INDEX($O2:$O986,MATCH(ROWS($T$2:T11),$U2:$U986,0)),\"\")","v":""}]
[14,"MFW21MC1","001","M  ","M Mason Chukka","Black","8-40221-90193-5","C/O       ",8,null,{"v":65,"d":"$65.00"},{"v":130,"d":"$130.00"},{"v":129.95,"d":"$129.95"},0,"Mfw21mc1-001-M  M Mason Chukka"," ",{"$f":"--ISNUMBER(IFERROR(SEARCH(Orders!$E$18,O12,1),\"\"))","v":1},{"$f":"IF(Q12=1,COUNTIF($Q$2:Q12,1),\"\")","v":11},{"$f":"IFERROR(INDEX($O2:$O986,MATCH(ROWS($Q$2:Q12),$R2:$R986,0)),\"\")","v":"Mfw21mc1-001-M  M Mason Chukka"},{"$f":"IF(Orders!$B$20=$A$12, 1, \"\")","v":""},{"$f":"IF(T12=1,COUNTIF($T$2:T12,1),\"\")","v":""},{"$f":"IFERROR(INDEX($O2:$O986,MATCH(ROWS($T$2:T12),$U2:$U986,0)),\"\")","v":""}]
[14,"MFW21MC2","201","M  ","M Mason Chukka","Dark Brown","8-40221-90207-9","C/O       ",8,null,{"v":65,"d":"$65.00"},{"v":130,"d":"$130.00"},{"v":129.95,"d":"$129.95"},0,"Mfw21mc2-201-M  M Mason Chukka"," ",{"$f":"--ISNUMBER(IFERROR(SEARCH(Orders!$E$18,O13,1),\"\"))","v":1},{"$f":"IF(Q13=1,COUNTIF($Q$2:Q13,1),\"\")","v":12},{"$f":"IFERROR(INDEX($O2:$O986,MATCH(ROWS($Q$2:Q13),$R2:$R986,0)),\"\")","v":"Mfw21mc2-201-M  M Mason Chukka"},{"$f":"IF(Orders!$B$20=$A$13, 1, \"\")","v":""},{"$f":"IF(T13=1,COUNTIF($T$2:T13,1),\"\")","v":""},{"$f":"IFERROR(INDEX($O2:$O986,MATCH(ROWS($T$2:T13),$U2:$U986,0)),\"\")","v":""}]
[13,"MFW21MM1","001","M  ","M Mason Mid","Black","8-40221-90151-5","C/O       ",8,null,{"v":82.5,"d":"$82.50"},{"v":165,"d":"$165.00"},{"v":164.95,"d":"$164.95"},0,"Mfw21mm1-001-M  M Mason Mid"," ",{"$f":"--ISNUMBER(IFERROR(SEARCH(Orders!$E$18,O14,1),\"\"))","v":1},{"$f":"IF(Q14=1,COUNTIF($Q$2:Q14,1),\"\")","v":13},{"$f":"IFERROR(INDEX($O2:$O986,MATCH(ROWS($Q$2:Q14),$R2:$R986,0)),\"\")","v":"Mfw21mm1-001-M  M Mason Mid"},{"$f":"IF(Orders!$B$20=$A$14, 1, \"\")","v":""},{"$f":"IF(T14=1,COUNTIF($T$2:T14,1),\"\")","v":""},{"$f":"IFERROR(INDEX($O2:$O986,MATCH(ROWS($T$2:T14),$U2:$U986,0)),\"\")","v":""}]
[10,"MSS18RL2","302","M  ","M Range Low","Olive Mlti","7-54697-65732-9","C/O       ",8,null,{"v":77.5,"d":"$77.50"},{"v":155,"d":"$155.00"},{"v":154.95,"d":"$154.95"},0,"Mss18rl2-302-M  M Range Low"," ",{"$f":"--ISNUMBER(IFERROR(SEARCH(Orders!$E$18,O15,1),\"\"))","v":1},{"$f":"IF(Q15=1,COUNTIF($Q$2:Q15,1),\"\")","v":14},{"$f":"IFERROR(INDEX($O2:$O986,MATCH(ROWS($Q$2:Q15),$R2:$R986,0)),\"\")","v":"Mss18rl2-302-M  M Range Low"},{"$f":"IF(Orders!$B$20=$A$15, 1, \"\")","v":""},{"$f":"IF(T15=1,COUNTIF($T$2:T15,1),\"\")","v":""},{"$f":"IFERROR(INDEX($O2:$O986,MATCH(ROWS($T$2:T15),$U2:$U986,0)),\"\")","v":""}]
{"$rows_left_out":70}
{"sheet":"Customer","index":5,"n_rows":420,"n_cols":4,"rows_kept":420}
["Customer","Sold_To","Ship_To","Name"]
["00035","00035","","Brown Shoe Fit"]
["00035-0015","00035","0015","Brown's Shoe Fit No 15"]
["00268","00268","","Red's Shoe Barn Inc"]
["00268-0001","00268","0001","Red's Shoe Barn Inc"]
["00362","00362","","Marshalls/Marmaxx Group"]
["00362-0008","00362","0008","Tjx Companies Inc"]
["02037","02037","","Abelman Co.(The)"]
["02037-0001","02037","0001","Abelman Co.(The)"]
["03005","03005","","Erhco Inc"]
["03005-0013","03005","0013","Burchs Fine Footwear"]
["04156","04156","","Lamey-Wellehan Inc"]
["04156-0001","04156","0001","Lamey Wellehan Shoes"]
["05135","05135","","Lb Pennyworth's"]
["05135-0005","05135","0005","Hyman's Penneyworths"]
{"$rows_left_out":405}