{"text_format":"3","workbook":"xlsx","n_sheets":6,"sheets":["Instructions","Orders","Styles","SKU","SKU_Unique","Customer"],"not_rendered":{"images":1,"macros":1,"defined_names":12},"read":"whole","date_system":"1900"}

{"sheet":"Instructions","index":0,"n_rows":33,"n_cols":4,"rows_kept":33,"merged":[[10,2,10,12],[13,1,13,12],[20,2,20,12],[26,1,26,5],[32,0,32,4]]}
["Forsake Order Form Instructions"]
["Below are instructions on how this form can be used to send in your Forsake orders."]
[]
["1.","Everything can be done from the Orders tab."]
[]
["2.","Start by entering in your billing and shipping information."]
[null,null,"- All green cells are required, yellow cells will be used to help build the order."]
[null,null,"- You must enter a Bill To, Ship Date & Cancel Date."]
[null,null,"- When entering Bill To and Ship To the customer name will be added for you."]
[null,null,"- After entering a Bill To a list of valid ship to numbers will display in the dropdown box."]
[null,null,"- All other cells on the sheet are not required to create an order, but can be used by you to identify the order you are sending in."]
[null,null,"- Click on the Hide Shipping and Show Shipping buttons to hide or show rows 5 to 17."]
[]
["3.","Next you need to select styles you would like to order."]
[null,null,"- To select by style."]
[{"$nulls":3},"- Enter a style number in cell E18 to filter the drop-down box."]
[{"$nulls":3},"- Select a style from the drop-down box."]
[{"$nulls":3},"- Click [Add Style] to add the style to the order."]
[]
["4.","In column J fill in quantities for the SKUs you would like to order."]
[null,null,"- If you don't want to order a specific size, or entire SKU, just leave the quantity field blank.  You can't delete a style once added."]
[]
["5.","If you would like to leave a message for customer service just type it in the comments cell (B15)."]
[]
["6.","When done email your spreadsheet to the address below.  You will get a confirmation when the email is processed."]
[null,"You will get an order acknowledgement when the order is created in our system."]
[null,"forsakeorders@forsake.com"]
[null,"(email sent to forsakeorders@forsake.com will NOT BE READ BY A PERSON.  Please don't send messages in the email)"]
[]
["Please send questions or comments to:"]
["Leslie Osep"]
["414-908-1853"]
["losep@weycogroup.com"]

{"sheet":"Orders","index":1,"n_rows":24,"n_cols":18,"rows_kept":24,"merged":[[0,0,2,10],[0,11,0,13],[1,11,1,13],[2,11,2,13],[3,0,3,5],[3,9,3,13],[4,3,4,4],[4,5,12,6],[4,7,4,12],[4,13,14,13],[5,1,5,4],[5,7,5,8],[5,9,5,12],[6,1,6,4],[6,7,6,8],[6,9,6,12],[7,1,7,2],[7,7,7,12],[8,1,8,4],[8,7,8,8],[8,9,8,12],[9,3,9,4],[9,7,9,8],[9,9,9,12],[10,1,10,4],[10,7,10,8],[10,9,10,12],[11,1,11,4],[11,7,11,8],[11,9,11,12],[12,1,12,2],[12,7,12,8],[12,9,12,12],[13,1,13,3],[13,4,13,6],[13,7,13,8],[13,9,13,12],[14,1,15,6],[14,7,14,8],[14,9,14,12],[15,7,17,8],[15,9,16,13],[16,0,16,6],[17,0,17,3],[17,4,17,6],[17,9,17,13],[18,0,18,4],[18,7,18,8],[18,11,18,12],[19,7,19,8],[19,11,19,12]]}
["FORSAKE",{"$nulls":10},"FORSAKE",{"$nulls":3},"Created","Terms based on customer","Price Level based on customer"]
[{"$nulls":11},"333 W. ESTABROOK BLVD",{"$nulls":3},"2022-05-05T13:47:15","CA – Cash in advance","1 – Regular wholesale"]
[{"$nulls":11},"GLENDALE, WI  53212",{"$nulls":3},"US","CC – Credit card","2 – 8% discount"]
["FS SS23",{"$nulls":5},"Version:",{"$f":"P15","v":"1.0.1"},null,"Phone: 1-833-685-2599  Fax: 1-414-908-1604",{"$nulls":5},"User","C1 – Credit card, one-time payment","3 – 4% discount"]
["Bill To:",null,"Name:",{"$f":"IFERROR(INDEX(Customer[Name], MATCH(B5, Customer[Customer],0)), \"Customer not found\")","v":"Customer not found"},{"$nulls":11},"JEFFB","0D – Net 30","5 – Closeout"]
["Address:",{"$nulls":6},"PO#:",{"$nulls":8},"0E – Net 45"]
[{"$nulls":7},"Date:",null,{"$f":"TODAY()","v":"2022-05-31"},{"$nulls":5},"Division","0G – Net 90"]
["City, St, Zip:",{"$nulls":6},"www.forsake.com",{"$nulls":7},"14"]
["Phone:",{"$nulls":6},"Ship Date:",{"$nulls":7},"Forsake"]
["Ship To:",null,"Name:",{"$f":"IFERROR(INDEX(Customer[Name], MATCH(CONCATENATE(B5, \"-\",B10), Customer[Customer],0)), D5)","v":"Customer not found"},{"$nulls":3},"Cancel Date:"]
["Address:",{"$nulls":6},"Terms:",null,"Terms based on customer",{"$nulls":5},"# of Lines"]
[{"$nulls":7},"Price Level:",null,"Price Level based on customer",{"$nulls":5},{"$f":"SUBTOTAL(103, Order[Stock])","v":0}]
["City, St, Zip:",{"$nulls":6},"Ship Via:"]
["Phone:",{"$nulls":3},"* Comments will be sent to customer service.",null,null,"Sales Rep:",{"$nulls":7},"Version"]
["Comments:",{"$nulls":6},"Buyer:",{"$nulls":7},"1.0.1"]
[{"$nulls":9},"* All costs are based on when the spreadsheet was created and may not be the cost at the time the order is entered."]
[{"$nulls":15},"DropDown Key"]
["Enter style number to filter drop-down:  ",{"$nulls":8},"*INTERNET MAP PRICING IS MSRP LESS $0.05"]
["Select Style…...........:",{"$nulls":6},"Total Quantity:",null,{"$f":"SUM(J22:J23)","v":0},null,"Total Amount:",null,{"$f":"SUM(N22:N23)","v":0},null,"DropDown Key-Page"]
["Select Page",{"$nulls":6},"Total Quantity:",null,{"$f":"SUM(J22:J23)","v":0},null,"Total Amount:",null,{"$f":"SUM(N22:N23)","v":0}]
["Catalog Page","Stock","Color","Width","Style Desc","Color Desc","UPC","Carry Over","Size","Quantity","Cost","MSRP","MAP","Extended Cost"]
[]
[]
[{"$nulls":7},"Totals:",null,{"$f":"SUBTOTAL(109,Order[Quantity])","v":0},{"$nulls":3},{"$f":"SUBTOTAL(109,Order[Extended Cost])","v":0}]

{"sheet":"Styles","index":2,"n_rows":84,"n_cols":10,"rows_kept":84}
["Catalog Page","Stock","Color","Width","Style Desc","Color Desc","Carry Over","Cost","MSRP","MAP"]
[0,"M80002  ","009","M  ","M Cascade Trail Low","Blk Multi","          ",{"v":65,"d":"$65.00"},{"v":130,"d":"$130.00"},{"v":129.95,"d":"$129.95"}]
[0,"M80002  ","419","M  ","M Cascade Trail Low","Navy/Gray","          ",{"v":65,"d":"$65.00"},{"v":130,"d":"$130.00"},{"v":129.95,"d":"$129.95"}]
[0,"W80005  ","062","M  ","W Cascade Trail Low","Gray Multi","          ",{"v":65,"d":"$65.00"},{"v":130,"d":"$130.00"},{"v":129.95,"d":"$129.95"}]
[0,"W80005  ","450","M  ","W Cascade Trail Low","Sky Blue","          ",{"v":65,"d":"$65.00"},{"v":130,"d":"$130.00"},{"v":129.95,"d":"$129.95"}]
[1,"M80037  ","001","M  ","M Wild Sky Mid","Black","          ",{"v":77.5,"d":"$77.50"},{"v":155,"d":"$155.00"},{"v":154.95,"d":"$154.95"}]
[1,"M80037  ","072","M  ","M Wild Sky Mid","Dkgry/Gold","          ",{"v":77.5,"d":"$77.50"},{"v":155,"d":"$155.00"},{"v":154.95,"d":"$154.95"}]
[1,"M80037  ","249","M  ","M Wild Sky Mid","Brn Multi","          ",{"v":77.5,"d":"$77.50"},{"v":155,"d":"$155.00"},{"v":154.95,"d":"$154.95"}]
[2,"MFW21D1 ","235","M  ","M Dispatch","Toffee","C/O       ",{"v":85,"d":"$85.00"},{"v":170,"d":"$170.00"},{"v":169.95,"d":"$169.95"}]
[2,"MFW21D3 ","410","M  ","M Dispatch","Navy","C/O       ",{"v":85,"d":"$85.00"},{"v":170,"d":"$170.00"},{"v":169.95,"d":"$169.95"}]
[2,"M80013  ","349","M  ","M Dispatch","Lodenmulti","C/O       ",{"v":85,"d":"$85.00"},{"v":170,"d":"$170.00"},{"v":169.95,"d":"$169.95"}]
[3,"M80001  ","020","M  ","M Dispatch Low Top","Gray",null,{"v":77.5,"d":"$77.50"},{"v":155,"d":"$155.00"},{"v":149.95,"d":"$149.95"}]
[3,"M80001  ","025","M  ","M Dispatch Low Top","Gunmetal","C/O       ",{"v":77.5,"d":"$77.50"},{"v":155,"d":"$155.00"},{"v":149.95,"d":"$149.95"}]
[3,"M80001  ","240","M  ","M Dispatch Low Top","Tan","C/O       ",{"v":77.5,"d":"$77.50"},{"v":155,"d":"$155.00"},{"v":149.95,"d":"$149.95"}]
[3,"M80001  ","305","M  ","M Dispatch Low Top","Loden","C/O       ",{"v":77.5,"d":"$77.50"},{"v":155,"d":"$155.00"},{"v":149.95,"d":"$149.95"}]
[4,"M80007  ","001","M  ","M Cascade Trail Mid","Black","C/O       ",{"v":75,"d":"$75.00"},{"v":150,"d":"$150.00"},{"v":149.95,"d":"$149.95"}]
[4,"M80007  ","052","M  ","M Cascade Trail Mid","Misty Gray","C/O       ",{"v":75,"d":"$75.00"},{"v":150,"d":"$150.00"},{"v":149.95,"d":"$149.95"}]
[4,"M80007  ","349","M  ","M Cascade Trail Mid","Lodenmulti","C/O       ",{"v":75,"d":"$75.00"},{"v":150,"d":"$150.00"},{"v":149.95,"d":"$149.95"}]
[5,"M80032  ","025","M  ","M Cascade Peak Low W","Gunmetal","          ",{"v":72.5,"d":"$72.50"},{"v":145,"d":"$145.00"},{"v":144.95,"d":"$144.95"}]
[5,"M80032  ","233","M  ","M Cascade Peak Low W","Cocoa","          ",{"v":72.5,"d":"$72.50"},{"v":145,"d":"$145.00"},{"v":144.95,"d":"$144.95"}]
[5,"M80032  ","410","M  ","M Cascade Peak Low W","Navy","          ",{"v":72.5,"d":"$72.50"},{"v":145,"d":"$145.00"},{"v":144.95,"d":"$144.95"}]
[7,"M80008  ","001","M  ","M Banks Mid","Black","C/O       ",{"v":77.5,"d":"$77.50"},{"v":155,"d":"$155.00"},{"v":154.95,"d":"$154.95"}]
[7,"M80008  ","349","M  ","M Banks Mid","Lodenmulti","C/O       ",{"v":77.5,"d":"$77.50"},{"v":155,"d":"$155.00"},{"v":154.95,"d":"$154.95"}]
[7,"M80008  ","492","M  ","M Banks Mid","Navy Multi","C/O       ",{"v":77.5,"d":"$77.50"},{"v":155,"d":"$155.00"},{"v":154.95,"d":"$154.95"}]
[8,"MSS21B1 ","492","M  ","M Banks Low Top","Navy Multi","C/O       ",{"v":65,"d":"$65.00"},{"v":130,"d":"$130.00"},{"v":129.95,"d":"$129.95"}]
[8,"MSS21B3 ","978","M  ","M Banks Low","Blk/Green","C/O       ",{"v":65,"d":"$65.00"},{"v":130,"d":"$130.00"},{"v":129.95,"d":"$129.95"}]
[9,"MFW19W1 ","988","M  ","M Halden Mid","Tan/Black","C/O       ",{"v":87.5,"d":"$87.50"},{"v":175,"d":"$175.00"},{"v":174.95,"d":"$174.95"}]
[9,"MFW19W4 ","219","M  ","M Halden","Mocha Mlti","C/O       ",{"v":87.5,"d":"$87.50"},{"v":175,"d":"$175.00"},{"v":174.95,"d":"$174.95"}]
[9,"M80012  ","305","M  ","M Halden","Loden","C/O       ",{"v":87.5,"d":"$87.50"},{"v":175,"d":"$175.00"},{"v":174.95,"d":"$174.95"}]
[10,"MSS18RL2","302","M  ","M Range Low","Olive Mlti","C/O       ",{"v":77.5,"d":"$77.50"},{"v":155,"d":"$155.00"},{"v":154.95,"d":"$154.95"}]
[10,"M80016  ","025","M  ","M Range Low","Gunmetal","C/O       ",{"v":77.5,"d":"$77.50"},{"v":155,"d":"$155.00"},{"v":154.95,"d":"$154.95"}]
[10,"M80016  ","261","M  ","M Range Low","Taupe Mult","          ",{"v":77.5,"d":"$77.50"},{"v":155,"d":"$155.00"},{"v":154.95,"d":"$154.95"}]
[11,"MFW20DH2","216","M  ","M Davos High","Mocha","C/O       ",{"v":95,"d":"$95.00"},{"v":190,"d":"$190.00"},{"v":189.95,"d":"$189.95"}]
[11,"MFW20DH3","235","M  ","M Davos High","Toffee","C/O       ",{"v":95,"d":"$95.00"},{"v":190,"d":"$190.00"},{"v":189.95,"d":"$189.95"}]
[11,"MFW20DH4","025","M  ","M Davos High","Gunmetal","C/O       ",{"v":95,"d":"$95.00"},{"v":190,"d":"$190.00"},{"v":189.95,"d":"$189.95"}]
[12,"MFW21DM1","235","M  ","M Davos Mid Top","Toffee","C/O       ",{"v":85,"d":"$85.00"},{"v":170,"d":"$170.00"},{"v":169.95,"d":"$169.95"}]
[12,"M80015  ","001","M  ","M Davos Mid","Black","C/O       ",{"v":85,"d":"$85.00"},{"v":170,"d":"$170.00"},{"v":169.95,"d":"$169.95"}]
[12,"M80015  ","305","M  ","M Davos Mid","Loden","          ",{"v":85,"d":"$85.00"},{"v":170,"d":"$170.00"},{"v":169.95,"d":"$169.95"}]
[13,"MFW21MM1","001","M  ","M Mason Mid","Black","C/O       ",{"v":82.5,"d":"$82.50"},{"v":165,"d":"$165.00"},{"v":164.95,"d":"$164.95"}]
[13,"M80010  ","020","M  ","M Mason Mid","Gray","C/O       ",{"v":82.5,"d":"$82.50"},{"v":165,"d":"$165.00"},{"v":164.95,"d":"$164.95"}]
[13,"M80010  ","240","M  ","M Mason Mid","Tan","C/O       ",{"v":82.5,"d":"$82.50"},{"v":165,"d":"$165.00"},{"v":164.95,"d":"$164.95"}]
[13,"M80010  ","303","M  ","M Mason Mid","Olive","C/O       ",{"v":82.5,"d":"$82.50"},{"v":165,"d":"$165.00"},{"v":164.95,"d":"$164.95"}]
[14,"MFW21MC1","001","M  ","M Mason Chukka","Black","C/O       ",{"v":65,"d":"$65.00"},{"v":130,"d":"$130.00"},{"v":129.95,"d":"$129.95"}]
[14,"MFW21MC2","201","M  ","M Mason Chukka","Dark Brown","C/O       ",{"v":65,"d":"$65.00"},{"v":130,"d":"$130.00"},{"v":129.95,"d":"$129.95"}]
[15,"MFW18PM4","201","M  ","M Phil Mid Top","Dark Brown","C/O       ",{"v":77.5,"d":"$77.50"},{"v":155,"d":"$155.00"},{"v":154.95,"d":"$154.95"}]
[15,"MFW18PM5","020","M  ","M Phil Mid Top","Gray","C/O       ",{"v":77.5,"d":"$77.50"},{"v":155,"d":"$155.00"},{"v":154.95,"d":"$154.95"}]
[16,"W80036  ","014","M  ","W Wild Sky Mid","Blk Olive","          ",{"v":77.5,"d":"$77.50"},{"v":155,"d":"$155.00"},{"v":154.95,"d":"$154.95"}]
[16,"W80036  ","240","M  ","W Wild Sky Mid","Tan","          ",{"v":77.5,"d":"$77.50"},{"v":155,"d":"$155.00"},{"v":154.95,"d":"$154.95"}]
[16,"W80036  ","305","M  ","W Wild Sky Mid","Loden","          ",{"v":77.5,"d":"$77.50"},{"v":155,"d":"$155.00"},{"v":154.95,"d":"$154.95"}]
[17,"WFW20T1 ","001","M  ","W Thatcher Mid","Black","C/O       ",{"v":85,"d":"$85.00"},{"v":170,"d":"$170.00"},{"v":169.95,"d":"$169.95"}]
[17,"WFW20T2 ","235","M  ","W Thatcher Mid","Toffee","C/O       ",{"v":85,"d":"$85.00"},{"v":170,"d":"$170.00"},{"v":169.95,"d":"$169.95"}]
[17,"W80024  ","337","M  ","W Thatcher Mid","Green Ash","C/O       ",{"v":85,"d":"$85.00"},{"v":170,"d":"$170.00"},{"v":169.95,"d":"$169.95"}]
[18,"WSS21TW1","988","M  ","W Thatcher Low Wp","Tan/Black","C/O       ",{"v":75,"d":"$75.00"},{"v":150,"d":"$150.00"},{"v":149.95,"d":"$149.95"}]
[18,"W80004  ","235","M  ","W Thatcher Low Wp","Toffee","          ",{"v":75,"d":"$75.00"},{"v":150,"d":"$150.00"},{"v":149.95,"d":"$149.95"}]
[18,"W80004  ","260","M  ","W Thatcher Low Wp","Taupe","          ",{"v":75,"d":"$75.00"},{"v":150,"d":"$150.00"},{"v":149.95,"d":"$149.95"}]
[19,"W80006  ","240","M  ","W Thatcher Low","Tan","C/O       ",{"v":60,"d":"$60.00"},{"v":120,"d":"$120.00"},{"v":119.95,"d":"$119.95"}]
[19,"W80006  ","261","M  ","W Thatcher Low","Taupe Mult","          ",{"v":60,"d":"$60.00"},{"v":120,"d":"$120.00"},{"v":119.95,"d":"$119.95"}]
[20,"W80019  ","001","M  ","W Cascade Trail Mid","Black","C/O       ",{"v":75,"d":"$75.00"},{"v":150,"d":"$150.00"},{"v":149.95,"d":"$149.95"}]
[20,"W80019  ","305","M  ","W Cascade Trail Mid","Loden","C/O       ",{"v":75,"d":"$75.00"},{"v":150,"d":"$150.00"},{"v":149.95,"d":"$149.95"}]
[20,"W80019  ","450","M  ","W Cascade Trail Mid","Sky Blue","C/O       ",{"v":75,"d":"$75.00"},{"v":150,"d":"$150.00"},{"v":149.95,"d":"$149.95"}]
[21,"W80027  ","009","M  ","W Cascade Peak Low W","Blk Multi","          ",{"v":72.5,"d":"$72.50"},{"v":145,"d":"$145.00"},{"v":144.95,"d":"$144.95"}]
[21,"W80027  ","275","M  ","W Cascade Peak Low W","Stone","          ",{"v":72.5,"d":"$72.50"},{"v":145,"d":"$145.00"},{"v":144.95,"d":"$144.95"}]
[21,"W80027  ","410","M  ","W Cascade Peak Low W","Navy","          ",{"v":72.5,"d":"$72.50"},{"v":145,"d":"$145.00"},{"v":144.95,"d":"$144.95"}]
[23,"WFW16P1 ","988","M  ","W Patch Mid","Tan/Black","C/O       ",{"v":85,"d":"$85.00"},{"v":170,"d":"$170.00"},{"v":169.95,"d":"$169.95"}]
[23,"WFW16P12","303","M  ","W Patch Mid","Olive","C/O       ",{"v":85,"d":"$85.00"},{"v":170,"d":"$170.00"},{"v":169.95,"d":"$169.95"}]
[23,"WFW16P7 ","989","M  ","W Patch Mid","Brwn/Navy","C/O       ",{"v":85,"d":"$85.00"},{"v":170,"d":"$170.00"},{"v":169.95,"d":"$169.95"}]
[23,"W80025  ","030","M  ","W Patch Mid","Pewter","          ",{"v":85,"d":"$85.00"},{"v":170,"d":"$170.00"},{"v":169.95,"d":"$169.95"}]
[24,"W80017  ","001","M  ","W Sofia Lace","Black","C/O       ",{"v":87.5,"d":"$87.50"},{"v":175,"d":"$175.00"},{"v":174.95,"d":"$174.95"}]
[24,"W80017  ","235","M  ","W Sofia Lace","Toffee","C/O       ",{"v":87.5,"d":"$87.50"},{"v":175,"d":"$175.00"},{"v":174.95,"d":"$174.95"}]
[24,"W80017  ","305","M  ","W Sofia Lace","Loden","C/O       ",{"v":87.5,"d":"$87.50"},{"v":175,"d":"$175.00"},{"v":174.95,"d":"$174.95"}]
[25,"W80029  ","013","M  ","W Rosie Mid","Charcoal",null,{"v":80,"d":"$80.00"},{"v":160,"d":"$160.00"},{"v":159.95,"d":"$159.95"}]
[25,"W80029  ","235","M  ","W Rosie Mid","Toffee",null,{"v":80,"d":"$80.00"},{"v":160,"d":"$160.00"},{"v":159.95,"d":"$159.95"}]
[25,"W80029  ","275","M  ","W Rosie Mid","Stone",null,{"v":80,"d":"$80.00"},{"v":160,"d":"$160.00"},{"v":159.95,"d":"$159.95"}]
[26,"WFW21LC1","001","M  ","W Lucie Chelsea","Black","C/O       ",{"v":77.5,"d":"$77.50"},{"v":155,"d":"$155.00"},{"v":154.95,"d":"$154.95"}]
[26,"WFW21LC2","240","M  ","W Lucie Chelsea","Tan","C/O       ",{"v":77.5,"d":"$77.50"},{"v":155,"d":"$155.00"},{"v":154.95,"d":"$154.95"}]
[26,"W80021  ","305","M  ","W Lucie Chelsea","Loden","C/O       ",{"v":77.5,"d":"$77.50"},{"v":155,"d":"$155.00"},{"v":154.95,"d":"$154.95"}]
[26,"W80021  ","337","M  ","W Lucie Chelsea","Green Ash","C/O       ",{"v":77.5,"d":"$77.50"},{"v":155,"d":"$155.00"},{"v":154.95,"d":"$154.95"}]
[27,"WFW19LM1","303","M  ","W Lucie Mid","Olive","C/O       ",{"v":75,"d":"$75.00"},{"v":150,"d":"$150.00"},{"v":149.95,"d":"$149.95"}]
[27,"WFW19LM9","009","M  ","W Lucie Mid","Blk Multi","C/O       ",{"v":75,"d":"$75.00"},{"v":150,"d":"$150.00"},{"v":149.95,"d":"$149.95"}]
[27,"W80020  ","451","M  ","W Lucie Mid","Mist Blue","C/O       ",{"v":75,"d":"$75.00"},{"v":150,"d":"$150.00"},{"v":149.95,"d":"$149.95"}]
[28,"U80035  ","001","M  ","Rogue","Black","          ",{"v":42.5,"d":"$42.50"},{"v":85,"d":"$85.00"},{"v":84.95,"d":"$84.95"}]
[28,"U80035  ","009","M  ","Rogue","Blk Multi","          ",{"v":42.5,"d":"$42.50"},{"v":85,"d":"$85.00"},{"v":84.95,"d":"$84.95"}]
[28,"U80035  ","305","M  ","Rogue","Loden","          ",{"v":42.5,"d":"$42.50"},{"v":85,"d":"$85.00"},{"v":84.95,"d":"$84.95"}]
[28,"U80035  ","540","M  ","Rogue","Prpl Multi","          ",{"v":42.5,"d":"$42.50"},{"v":85,"d":"$85.00"},{"v":84.95,"d":"$84.95"}]

{"sheet":"SKU","index":3,"n_rows":987,"n_cols":20,"rows_kept":987,"hidden":true}
["Catalog Page","Stock","Color","Width","Style Desc","Color Desc","UPC","Carry Over","Size","Quantity","Cost","MSRP","MAP","Extended Cost","SKU","Filler","Helper1","Helper2","Helper3"]
[15,"MFW18PM4","201","M  ","M Phil Mid Top","Dark Brown","7-18598-83058-8","C/O       ","8",null,{"v":77.5,"d":"$77.50"},{"v":155,"d":"$155.00"},{"v":154.95,"d":"$154.95"},{"$f":"J2*K2","v":0},"Mfw18pm4-201-M  M Phil Mid Top"," ",{"$f":"--ISNUMBER(IFERROR(SEARCH(Orders!$E18,O2,1),\"\"))","v":1},{"$f":"IF(Q2=1,COUNTIF($Q$2:Q2,1),\"\")","v":1},{"$f":"IFERROR(INDEX($O2:$O986,MATCH(ROWS($Q$2:Q2),$R2:$R986,0)),\"\")","v":"Mfw18pm4-201-M  M Phil Mid Top"}]
[15,"MFW18PM4","201","M  ","M Phil Mid Top","Dark Brown","7-18598-83059-5","C/O       ",8.5,null,{"v":77.5,"d":"$77.50"},{"v":155,"d":"$155.00"},{"v":154.95,"d":"$154.95"},0,"Mfw18pm4-201-M  M Phil Mid Top"," ",{"$f":"--ISNUMBER(IFERROR(SEARCH(Orders!$E18,O3,1),\"\"))","v":1},{"$f":"IF(Q3=1,COUNTIF($Q$2:Q3,1),\"\")","v":2},{"$f":"IFERROR(INDEX($O2:$O986,MATCH(ROWS($Q$2:Q3),$R2:$R986,0)),\"\")","v":"Mfw18pm4-201-M  M Phil Mid Top"}]
[15,"MFW18PM4","201","M  ","M Phil Mid Top","Dark Brown","7-18598-83060-1","C/O       ",9,null,{"v":77.5,"d":"$77.50"},{"v":155,"d":"$155.00"},{"v":154.95,"d":"$154.95"},0,"Mfw18pm4-201-M  M Phil Mid Top"," ",{"$f":"--ISNUMBER(IFERROR(SEARCH(Orders!$E18,O4,1),\"\"))","v":1},{"$f":"IF(Q4=1,COUNTIF($Q$2:Q4,1),\"\")","v":3},{"$f":"IFERROR(INDEX($O2:$O986,MATCH(ROWS($Q$2:Q4),$R2:$R986,0)),\"\")","v":"Mfw18pm4-201-M  M Phil Mid Top"}]
[15,"MFW18PM4","201","M  ","M Phil Mid Top","Dark Brown","7-18598-83061-8","C/O       ",9.5,null,{"v":77.5,"d":"$77.50"},{"v":155,"d":"$155.00"},{"v":154.95,"d":"$154.95"},0,"Mfw18pm4-201-M  M Phil Mid Top"," ",{"$f":"--ISNUMBER(IFERROR(SEARCH(Orders!$E18,O5,1),\"\"))","v":1},{"$f":"IF(Q5=1,COUNTIF($Q$2:Q5,1),\"\")","v":4},{"$f":"IFERROR(INDEX($O2:$O986,MATCH(ROWS($Q$2:Q5),$R2:$R986,0)),\"\")","v":"Mfw18pm4-201-M  M Phil Mid Top"}]
[15,"MFW18PM4","201","M  ","M Phil Mid Top","Dark Brown","7-18598-83062-5","C/O       ",10,null,{"v":77.5,"d":"$77.50"},{"v":155,"d":"$155.00"},{"v":154.95,"d":"$154.95"},0,"Mfw18pm4-201-M  M Phil Mid Top"," ",{"$f":"--ISNUMBER(IFERROR(SEARCH(Orders!$E18,O6,1),\"\"))","v":1},{"$f":"IF(Q6=1,COUNTIF($Q$2:Q6,1),\"\")","v":5},{"$f":"IFERROR(INDEX($O2:$O986,MATCH(ROWS($Q$2:Q6),$R2:$R986,0)),\"\")","v":"Mfw18pm4-201-M  M Phil Mid Top"}]
[15,"MFW18PM4","201","M  ","M Phil Mid Top","Dark Brown","7-18598-83063-2","C/O       ",10.5,null,{"v":77.5,"d":"$77.50"},{"v":155,"d":"$155.00"},{"v":154.95,"d":"$154.95"},0,"Mfw18pm4-201-M  M Phil Mid Top"," ",{"$f":"--ISNUMBER(IFERROR(SEARCH(Orders!$E18,O7,1),\"\"))","v":1},{"$f":"IF(Q7=1,COUNTIF($Q$2:Q7,1),\"\")","v":6},{"$f":"IFERROR(INDEX($O2:$O986,MATCH(ROWS($Q$2:Q7),$R2:$R986,0)),\"\")","v":"Mfw18pm4-201-M  M Phil Mid Top"}]
[15,"MFW18PM4","201","M  ","M Phil Mid Top","Dark Brown","7-18598-83064-9","C/O       ",11,null,{"v":77.5,"d":"$77.50"},{"v":155,"d":"$155.00"},{"v":154.95,"d":"$154.95"},0,"Mfw18pm4-201-M  M Phil Mid Top"," ",{"$f":"--ISNUMBER(IFERROR(SEARCH(Orders!$E18,O8,1),\"\"))","v":1},{"$f":"IF(Q8=1,COUNTIF($Q$2:Q8,1),\"\")","v":7},{"$f":"IFERROR(INDEX($O2:$O986,MATCH(ROWS($Q$2:Q8),$R2:$R986,0)),\"\")","v":"Mfw18pm4-201-M  M Phil Mid Top"}]
[15,"MFW18PM4","201","M  ","M Phil Mid Top","Dark Brown","7-18598-83065-6","C/O       ",11.5,null,{"v":77.5,"d":"$77.50"},{"v":155,"d":"$155.00"},{"v":154.95,"d":"$154.95"},0,"Mfw18pm4-201-M  M Phil Mid Top"," ",{"$f":"--ISNUMBER(IFERROR(SEARCH(Orders!$E18,O9,1),\"\"))","v":1},{"$f":"IF(Q9=1,COUNTIF($Q$2:Q9,1),\"\")","v":8},{"$f":"IFERROR(INDEX($O2:$O986,MATCH(ROWS($Q$2:Q9),$R2:$R986,0)),\"\")","v":"Mfw18pm4-201-M  M Phil Mid Top"}]
[15,"MFW18PM4","201","M  ","M Phil Mid Top","Dark Brown","7-18598-83066-3","C/O       ",12,null,{"v":77.5,"d":"$77.50"},{"v":155,"d":"$155.00"},{"v":154.95,"d":"$154.95"},0,"Mfw18pm4-201-M  M Phil Mid Top"," ",{"$f":"--ISNUMBER(IFERROR(SEARCH(Orders!$E18,O10,1),\"\"))","v":1},{"$f":"IF(Q10=1,COUNTIF($Q$2:Q10,1),\"\")","v":9},{"$f":"IFERROR(INDEX($O2:$O986,MATCH(ROWS($Q$2:Q10),$R2:$R986,0)),\"\")","v":"Mfw18pm4-201-M  M Phil Mid Top"}]
[15,"MFW18PM4","201","M  ","M Phil Mid Top","Dark Brown","7-18598-83067-0","C/O       ",12.5,null,{"v":77.5,"d":"$77.50"},{"v":155,"d":"$155.00"},{"v":154.95,"d":"$154.95"},0,"Mfw18pm4-201-M  M Phil Mid Top"," ",{"$f":"--ISNUMBER(IFERROR(SEARCH(Orders!$E18,O11,1),\"\"))","v":1},{"$f":"IF(Q11=1,COUNTIF($Q$2:Q11,1),\"\")","v":10},{"$f":"IFERROR(INDEX($O2:$O986,MATCH(ROWS($Q$2:Q11),$R2:$R986,0)),\"\")","v":"Mfw18pm4-201-M  M Phil Mid Top"}]
[15,"MFW18PM4","201","M  ","M Phil Mid Top","Dark Brown","7-18598-83068-7","C/O       ",13,null,{"v":77.5,"d":"$77.50"},{"v":155,"d":"$155.00"},{"v":154.95,"d":"$154.95"},0,"Mfw18pm4-201-M  M Phil Mid Top"," ",{"$f":"--ISNUMBER(IFERROR(SEARCH(Orders!$E18,O12,1),\"\"))","v":1},{"$f":"IF(Q12=1,COUNTIF($Q$2:Q12,1),\"\")","v":11},{"$f":"IFERROR(INDEX($O2:$O986,MATCH(ROWS($Q$2:Q12),$R2:$R986,0)),\"\")","v":"Mfw18pm4-201-M  M Phil Mid Top"}]
[15,"MFW18PM4","201","M  ","M Phil Mid Top","Dark Brown","7-18598-83069-4","C/O       ",14,null,{"v":77.5,"d":"$77.50"},{"v":155,"d":"$155.00"},{"v":154.95,"d":"$154.95"},0,"Mfw18pm4-201-M  M Phil Mid Top"," ",{"$f":"--ISNUMBER(IFERROR(SEARCH(Orders!$E18,O13,1),\"\"))","v":1},{"$f":"IF(Q13=1,COUNTIF($Q$2:Q13,1),\"\")","v":12},{"$f":"IFERROR(INDEX($O2:$O986,MATCH(ROWS($Q$2:Q13),$R2:$R986,0)),\"\")","v":"Mfw18pm4-201-M  M Phil Mid Top"}]
[15,"MFW18PM5","020","M  ","M Phil Mid Top","Gray","7-52505-95186-7","C/O       ",8,null,{"v":77.5,"d":"$77.50"},{"v":155,"d":"$155.00"},{"v":154.95,"d":"$154.95"},0,"Mfw18pm5-020-M  M Phil Mid Top"," ",{"$f":"--ISNUMBER(IFERROR(SEARCH(Orders!$E18,O14,1),\"\"))","v":1},{"$f":"IF(Q14=1,COUNTIF($Q$2:Q14,1),\"\")","v":13},{"$f":"IFERROR(INDEX($O2:$O986,MATCH(ROWS($Q$2:Q14),$R2:$R986,0)),\"\")","v":"Mfw18pm5-020-M  M Phil Mid Top"}]
[15,"MFW18PM5","020","M  ","M Phil Mid Top","Gray","7-52505-95187-4","C/O       ",8.5,null,{"v":77.5,"d":"$77.50"},{"v":155,"d":"$155.00"},{"v":154.95,"d":"$154.95"},0,"Mfw18pm5-020-M  M Phil Mid Top"," ",{"$f":"--ISNUMBER(IFERROR(SEARCH(Orders!$E18,O15,1),\"\"))","v":1},{"$f":"IF(Q15=1,COUNTIF($Q$2:Q15,1),\"\")","v":14},{"$f":"IFERROR(INDEX($O2:$O986,MATCH(ROWS($Q$2:Q15),$R2:$R986,0)),\"\")","v":"Mfw18pm5-020-M  M Phil Mid Top"}]
[15,"MFW18PM5","020","M  ","M Phil Mid Top","Gray","7-52505-95188-1","C/O       ",9,null,{"v":77.5,"d":"$77.50"},{"v":155,"d":"$155.00"},{"v":154.95,"d":"$154.95"},0,"Mfw18pm5-020-M  M Phil Mid Top"," ",{"$f":"--ISNUMBER(IFERROR(SEARCH(Orders!$E18,O16,1),\"\"))","v":1},{"$f":"IF(Q16=1,COUNTIF($Q$2:Q16,1),\"\")","v":15},{"$f":"IFERROR(INDEX($O2:$O986,MATCH(ROWS($Q$2:Q16),$R2:$R986,0)),\"\")","v":"Mfw18pm5-020-M  M Phil Mid Top"}]
[15,"MFW18PM5","020","M  ","M Phil Mid Top","Gray","7-52505-95189-8","C/O       ",9.5,null,{"v":77.5,"d":"$77.50"},{"v":155,"d":"$155.00"},{"v":154.95,"d":"$154.95"},0,"Mfw18pm5-020-M  M Phil Mid Top"," ",{"$f":"--ISNUMBER(IFERROR(SEARCH(Orders!$E18,O17,1),\"\"))","v":1},{"$f":"IF(Q17=1,COUNTIF($Q$2:Q17,1),\"\")","v":16},{"$f":"IFERROR(INDEX($O2:$O986,MATCH(ROWS($Q$2:Q17),$R2:$R986,0)),\"\")","v":"Mfw18pm5-020-M  M Phil Mid Top"}]
[15,"MFW18PM5","020","M  ","M Phil Mid Top","Gray","7-52505-95190-4","C/O       ",10,null,{"v":77.5,"d":"$77.50"},{"v":155,"d":"$155.00"},{"v":154.95,"d":"$154.95"},0,"Mfw18pm5-020-M  M Phil Mid Top"," ",{"$f":"--ISNUMBER(IFERROR(SEARCH(Orders!$E18,O18,1),\"\"))","v":1},{"$f":"IF(Q18=1,COUNTIF($Q$2:Q18,1),\"\")","v":17},{"$f":"IFERROR(INDEX($O2:$O986,MATCH(ROWS($Q$2:Q18),$R2:$R986,0)),\"\")","v":"Mfw18pm5-020-M  M Phil Mid Top"}]
[15,"MFW18PM5","020","M  ","M Phil Mid Top","Gray","7-52505-95191-1","C/O       ",10.5,null,{"v":77.5,"d":"$77.50"},{"v":155,"d":"$155.00"},{"v":154.95,"d":"$154.95"},0,"Mfw18pm5-020-M  M Phil Mid Top"," ",{"$f":"--ISNUMBER(IFERROR(SEARCH(Orders!$E18,O19,1),\"\"))","v":1},{"$f":"IF(Q19=1,COUNTIF($Q$2:Q19,1),\"\")","v":18},{"$f":"IFERROR(INDEX($O2:$O986,MATCH(ROWS($Q$2:Q19),$R2:$R986,0)),\"\")","v":"Mfw18pm5-020-M  M Phil Mid Top"}]
[15,"MFW18PM5","020","M  ","M Phil Mid Top","Gray","7-52505-95192-8","C/O       ",11,null,{"v":77.5,"d":"$77.50"},{"v":155,"d":"$155.00"},{"v":154.95,"d":"$154.95"},0,"Mfw18pm5-020-M  M Phil Mid Top"," ",{"$f":"--ISNUMBER(IFERROR(SEARCH(Orders!$E18,O20,1),\"\"))","v":1},{"$f":"IF(Q20=1,COUNTIF($Q$2:Q20,1),\"\")","v":19},{"$f":"IFERROR(INDEX($O2:$O986,MATCH(ROWS($Q$2:Q20),$R2:$R986,0)),\"\")","v":"Mfw18pm5-020-M  M Phil Mid Top"}]
[15,"MFW18PM5","020","M  ","M Phil Mid Top","Gray","7-52505-95193-5","C/O       ",11.5,null,{"v":77.5,"d":"$77.50"},{"v":155,"d":"$155.00"},{"v":154.95,"d":"$154.95"},0,"Mfw18pm5-020-M  M Phil Mid Top"," ",{"$f":"--ISNUMBER(IFERROR(SEARCH(Orders!$E18,O21,1),\"\"))","v":1},{"$f":"IF(Q21=1,COUNTIF($Q$2:Q21,1),\"\")","v":20},{"$f":"IFERROR(INDEX($O2:$O986,MATCH(ROWS($Q$2:Q21),$R2:$R986,0)),\"\")","v":"Mfw18pm5-020-M  M Phil Mid Top"}]
[15,"MFW18PM5","020","M  ","M Phil Mid Top","Gray","7-52505-95194-2","C/O       ",12,null,{"v":77.5,"d":"$77.50"},{"v":155,"d":"$155.00"},{"v":154.95,"d":"$154.95"},0,"Mfw18pm5-020-M  M Phil Mid Top"," ",{"$f":"--ISNUMBER(IFERROR(SEARCH(Orders!$E18,O22,1),\"\"))","v":1},{"$f":"IF(Q22=1,COUNTIF($Q$2:Q22,1),\"\")","v":21},{"$f":"IFERROR(INDEX($O2:$O986,MATCH(ROWS($Q$2:Q22),$R2:$R986,0)),\"\")","v":"Mfw18pm5-020-M  M Phil Mid Top"}]
[15,"MFW18PM5","020","M  ","M Phil Mid Top","Gray","7-52505-95195-9","C/O       ",12.5,null,{"v":77.5,"d":"$77.50"},{"v":155,"d":"$155.00"},{"v":154.95,"d":"$154.95"},0,"Mfw18pm5-020-M  M Phil Mid Top"," ",{"$f":"--ISNUMBER(IFERROR(SEARCH(Orders!$E18,O23,1),\"\"))","v":1},{"$f":"IF(Q23=1,COUNTIF($Q$2:Q23,1),\"\")","v":22},{"$f":"IFERROR(INDEX($O2:$O986,MATCH(ROWS($Q$2:Q23),$R2:$R986,0)),\"\")","v":"Mfw18pm5-020-M  M Phil Mid Top"}]
[15,"MFW18PM5","020","M  ","M Phil Mid Top","Gray","7-52505-95196-6","C/O       ",13,null,{"v":77.5,"d":"$77.50"},{"v":155,"d":"$155.00"},{"v":154.95,"d":"$154.95"},0,"Mfw18pm5-020-M  M Phil Mid Top"," ",{"$f":"--ISNUMBER(IFERROR(SEARCH(Orders!$E18,O24,1),\"\"))","v":1},{"$f":"IF(Q24=1,COUNTIF($Q$2:Q24,1),\"\")","v":23},{"$f":"IFERROR(INDEX($O2:$O986,MATCH(ROWS($Q$2:Q24),$R2:$R986,0)),\"\")","v":"Mfw18pm5-020-M  M Phil Mid Top"}]
[15,"MFW18PM5","020","M  ","M Phil Mid Top","Gray","7-52505-95197-3","C/O       ",14,null,{"v":77.5,"d":"$77.50"},{"v":155,"d":"$155.00"},{"v":154.95,"d":"$154.95"},0,"Mfw18pm5-020-M  M Phil Mid Top"," ",{"$f":"--ISNUMBER(IFERROR(SEARCH(Orders!$E18,O25,1),\"\"))","v":1},{"$f":"IF(Q25=1,COUNTIF($Q$2:Q25,1),\"\")","v":24},{"$f":"IFERROR(INDEX($O2:$O986,MATCH(ROWS($Q$2:Q25),$R2:$R986,0)),\"\")","v":"Mfw18pm5-020-M  M Phil Mid Top"}]
[9,"MFW19W1 ","988","M  ","M Halden Mid","Tan/Black","7-18598-82980-3","C/O       ",8,null,{"v":87.5,"d":"$87.50"},{"v":175,"d":"$175.00"},{"v":174.95,"d":"$174.95"},0,"Mfw19w1-988-M  M Halden Mid"," ",{"$f":"--ISNUMBER(IFERROR(SEARCH(Orders!$E18,O26,1),\"\"))","v":1},{"$f":"IF(Q26=1,COUNTIF($Q$2:Q26,1),\"\")","v":25},{"$f":"IFERROR(INDEX($O2:$O986,MATCH(ROWS($Q$2:Q26),$R2:$R986,0)),\"\")","v":"Mfw19w1-988-M  M Halden Mid"}]
[9,"MFW19W1 ","988","M  ","M Halden Mid","Tan/Black","7-18598-82981-0","C/O       ",8.5,null,{"v":87.5,"d":"$87.50"},{"v":175,"d":"$175.00"},{"v":174.95,"d":"$174.95"},0,"Mfw19w1-988-M  M Halden Mid"," ",{"$f":"--ISNUMBER(IFERROR(SEARCH(Orders!$E18,O27,1),\"\"))","v":1},{"$f":"IF(Q27=1,COUNTIF($Q$2:Q27,1),\"\")","v":26},{"$f":"IFERROR(INDEX($O2:$O986,MATCH(ROWS($Q$2:Q27),$R2:$R986,0)),\"\")","v":"Mfw19w1-988-M  M Halden Mid"}]
[9,"MFW19W1 ","988","M  ","M Halden Mid","Tan/Black","7-18598-82982-7","C/O       ",9,null,{"v":87.5,"d":"$87.50"},{"v":175,"d":"$175.00"},{"v":174.95,"d":"$174.95"},0,"Mfw19w1-988-M  M Halden Mid"," ",{"$f":"--ISNUMBER(IFERROR(SEARCH(Orders!$E18,O28,1),\"\"))","v":1},{"$f":"IF(Q28=1,COUNTIF($Q$2:Q28,1),\"\")","v":27},{"$f":"IFERROR(INDEX($O2:$O986,MATCH(ROWS($Q$2:Q28),$R2:$R986,0)),\"\")","v":"Mfw19w1-988-M  M Halden Mid"}]
[9,"MFW19W1 ","988","M  ","M Halden Mid","Tan/Black","7-18598-82983-4","C/O       ",9.5,null,{"v":87.5,"d":"$87.50"},{"v":175,"d":"$175.00"},{"v":174.95,"d":"$174.95"},0,"Mfw19w1-988-M  M Halden Mid"," ",{"$f":"--ISNUMBER(IFERROR(SEARCH(Orders!$E18,O29,1),\"\"))","v":1},{"$f":"IF(Q29=1,COUNTIF($Q$2:Q29,1),\"\")","v":28},{"$f":"IFERROR(INDEX($O2:$O986,MATCH(ROWS($Q$2:Q29),$R2:$R986,0)),\"\")","v":"Mfw19w1-988-M  M Halden Mid"}]
[9,"MFW19W1 ","988","M  ","M Halden Mid","Tan/Black","7-18598-82984-1","C/O       ",10,null,{"v":87.5,"d":"$87.50"},{"v":175,"d":"$175.00"},{"v":174.95,"d":"$174.95"},0,"Mfw19w1-988-M  M Halden Mid"," ",{"$f":"--ISNUMBER(IFERROR(SEARCH(Orders!$E18,O30,1),\"\"))","v":1},{"$f":"IF(Q30=1,COUNTIF($Q$2:Q30,1),\"\")","v":29},{"$f":"IFERROR(INDEX($O2:$O986,MATCH(ROWS($Q$2:Q30),$R2:$R986,0)),\"\")","v":"Mfw19w1-988-M  M Halden Mid"}]
[9,"MFW19W1 ","988","M  ","M Halden Mid","Tan/Black","7-18598-82985-8","C/O       ",10.5,null,{"v":87.5,"d":"$87.50"},{"v":175,"d":"$175.00"},{"v":174.95,"d":"$174.95"},0,"Mfw19w1-988-M  M Halden Mid"," ",{"$f":"--ISNUMBER(IFERROR(SEARCH(Orders!$E18,O31,1),\"\"))","v":1},{"$f":"IF(Q31=1,COUNTIF($Q$2:Q31,1),\"\")","v":30},{"$f":"IFERROR(INDEX($O2:$O986,MATCH(ROWS($Q$2:Q31),$R2:$R986,0)),\"\")","v":"Mfw19w1-988-M  M Halden Mid"}]
[9,"MFW19W1 ","988","M  ","M Halden Mid","Tan/Black","7-18598-82986-5","C/O       ",11,null,{"v":87.5,"d":"$87.50"},{"v":175,"d":"$175.00"},{"v":174.95,"d":"$174.95"},0,"Mfw19w1-988-M  M Halden Mid"," ",{"$f":"--ISNUMBER(IFERROR(SEARCH(Orders!$E18,O32,1),\"\"))","v":1},{"$f":"IF(Q32=1,COUNTIF($Q$2:Q32,1),\"\")","v":31},{"$f":"IFERROR(INDEX($O2:$O986,MATCH(ROWS($Q$2:Q32),$R2:$R986,0)),\"\")","v":"Mfw19w1-988-M  M Halden Mid"}]
[9,"MFW19W1 ","988","M  ","M Halden Mid","Tan/Black","7-18598-82987-2","C/O       ",11.5,null,{"v":87.5,"d":"$87.50"},{"v":175,"d":"$175.00"},{"v":174.95,"d":"$174.95"},0,"Mfw19w1-988-M  M Halden Mid"," ",{"$f":"--ISNUMBER(IFERROR(SEARCH(Orders!$E18,O33,1),\"\"))","v":1},{"$f":"IF(Q33=1,COUNTIF($Q$2:Q33,1),\"\")","v":32},{"$f":"IFERROR(INDEX($O2:$O986,MATCH(ROWS($Q$2:Q33),$R2:$R986,0)),\"\")","v":"Mfw19w1-988-M  M Halden Mid"}]
[9,"MFW19W1 ","988","M  ","M Halden Mid","Tan/Black","7-18598-82988-9","C/O       ",12,null,{"v":87.5,"d":"$87.50"},{"v":175,"d":"$175.00"},{"v":174.95,"d":"$174.95"},0,"Mfw19w1-988-M  M Halden Mid"," ",{"$f":"--ISNUMBER(IFERROR(SEARCH(Orders!$E18,O34,1),\"\"))","v":1},{"$f":"IF(Q34=1,COUNTIF($Q$2:Q34,1),\"\")","v":33},{"$f":"IFERROR(INDEX($O2:$O986,MATCH(ROWS($Q$2:Q34),$R2:$R986,0)),\"\")","v":"Mfw19w1-988-M  M Halden Mid"}]
[9,"MFW19W1 ","988","M  ","M Halden Mid","Tan/Black","7-18598-82989-6","C/O       ",12.5,null,{"v":87.5,"d":"$87.50"},{"v":175,"d":"$175.00"},{"v":174.95,"d":"$174.95"},0,"Mfw19w1-988-M  M Halden Mid"," ",{"$f":"--ISNUMBER(IFERROR(SEARCH(Orders!$E18,O35,1),\"\"))","v":1},{"$f":"IF(Q35=1,COUNTIF($Q$2:Q35,1),\"\")","v":34},{"$f":"IFERROR(INDEX($O2:$O986,MATCH(ROWS($Q$2:Q35),$R2:$R986,0)),\"\")","v":"Mfw19w1-988-M  M Halden Mid"}]
[9,"MFW19W1 ","988","M  ","M Halden Mid","Tan/Black","7-18598-82990-2","C/O       ",13,null,{"v":87.5,"d":"$87.50"},{"v":175,"d":"$175.00"},{"v":174.95,"d":"$174.95"},0,"Mfw19w1-988-M  M Halden Mid"," ",{"$f":"--ISNUMBER(IFERROR(SEARCH(Orders!$E18,O36,1),\"\"))","v":1},{"$f":"IF(Q36=1,COUNTIF($Q$2:Q36,1),\"\")","v":35},{"$f":"IFERROR(INDEX($O2:$O986,MATCH(ROWS($Q$2:Q36),$R2:$R986,0)),\"\")","v":"Mfw19w1-988-M  M Halden Mid"}]
[9,"MFW19W1 ","988","M  ","M Halden Mid","Tan/Black","7-18598-82991-9","C/O       ",14,null,{"v":87.5,"d":"$87.50"},{"v":175,"d":"$175.00"},{"v":174.95,"d":"$174.95"},0,"Mfw19w1-988-M  M Halden Mid"," ",{"$f":"--ISNUMBER(IFERROR(SEARCH(Orders!$E18,O37,1),\"\"))","v":1},{"$f":"IF(Q37=1,COUNTIF($Q$2:Q37,1),\"\")","v":36},{"$f":"IFERROR(INDEX($O2:$O986,MATCH(ROWS($Q$2:Q37),$R2:$R986,0)),\"\")","v":"Mfw19w1-988-M  M Halden Mid"}]
[9,"MFW19W4 ","219","M  ","M Halden","Mocha Mlti","8-40221-90095-2","C/O       ",8,null,{"v":87.5,"d":"$87.50"},{"v":175,"d":"$175.00"},{"v":174.95,"d":"$174.95"},0,"Mfw19w4-219-M  M Halden"," ",{"$f":"--ISNUMBER(IFERROR(SEARCH(Orders!$E18,O38,1),\"\"))","v":1},{"$f":"IF(Q38=1,COUNTIF($Q$2:Q38,1),\"\")","v":37},{"$f":"IFERROR(INDEX($O2:$O986,MATCH(ROWS($Q$2:Q38),$R2:$R986,0)),\"\")","v":"Mfw19w4-219-M  M Halden"}]
[9,"MFW19W4 ","219","M  ","M Halden","Mocha Mlti","8-40221-90096-9","C/O       ",8.5,null,{"v":87.5,"d":"$87.50"},{"v":175,"d":"$175.00"},{"v":174.95,"d":"$174.95"},0,"Mfw19w4-219-M  M Halden"," ",{"$f":"--ISNUMBER(IFERROR(SEARCH(Orders!$E18,O39,1),\"\"))","v":1},{"$f":"IF(Q39=1,COUNTIF($Q$2:Q39,1),\"\")","v":38},{"$f":"IFERROR(INDEX($O2:$O986,MATCH(ROWS($Q$2:Q39),$R2:$R986,0)),\"\")","v":"Mfw19w4-219-M  M Halden"}]
[9,"MFW19W4 ","219","M  ","M Halden","Mocha Mlti","8-40221-90097-6","C/O       ",9,null,{"v":87.5,"d":"$87.50"},{"v":175,"d":"$175.00"},{"v":174.95,"d":"$174.95"},0,"Mfw19w4-219-M  M Halden"," ",{"$f":"--ISNUMBER(IFERROR(SEARCH(Orders!$E18,O40,1),\"\"))","v":1},{"$f":"IF(Q40=1,COUNTIF($Q$2:Q40,1),\"\")","v":39},{"$f":"IFERROR(INDEX($O2:$O986,MATCH(ROWS($Q$2:Q40),$R2:$R986,0)),\"\")","v":"Mfw19w4-219-M  M Halden"}]
[9,"MFW19W4 ","219","M  ","M Halden","Mocha Mlti","8-40221-90098-3","C/O       ",9.5,null,{"v":87.5,"d":"$87.50"},{"v":175,"d":"$175.00"},{"v":174.95,"d":"$174.95"},0,"Mfw19w4-219-M  M Halden"," ",{"$f":"--ISNUMBER(IFERROR(SEARCH(Orders!$E18,O41,1),\"\"))","v":1},{"$f":"IF(Q41=1,COUNTIF($Q$2:Q41,1),\"\")","v":40},{"$f":"IFERROR(INDEX($O2:$O986,MATCH(ROWS($Q$2:Q41),$R2:$R986,0)),\"\")","v":"Mfw19w4-219-M  M Halden"}]
[9,"MFW19W4 ","219","M  ","M Halden","Mocha Mlti","8-40221-90099-0","C/O       ",10,null,{"v":87.5,"d":"$87.50"},{"v":175,"d":"$175.00"},{"v":174.95,"d":"$174.95"},0,"Mfw19w4-219-M  M Halden"," ",{"$f":"--ISNUMBER(IFERROR(SEARCH(Orders!$E18,O42,1),\"\"))","v":1},{"$f":"IF(Q42=1,COUNTIF($Q$2:Q42,1),\"\")","v":41},{"$f":"IFERROR(INDEX($O2:$O986,MATCH(ROWS($Q$2:Q42),$R2:$R986,0)),\"\")","v":"Mfw19w4-219-M  M Halden"}]
[9,"MFW19W4 ","219","M  ","M Halden","Mocha Mlti","8-40221-90100-3","C/O       ",10.5,null,{"v":87.5,"d":"$87.50"},{"v":175,"d":"$175.00"},{"v":174.95,"d":"$174.95"},0,"Mfw19w4-219-M  M Halden"," ",{"$f":"--ISNUMBER(IFERROR(SEARCH(Orders!$E18,O43,1),\"\"))","v":1},{"$f":"IF(Q43=1,COUNTIF($Q$2:Q43,1),\"\")","v":42},{"$f":"IFERROR(INDEX($O2:$O986,MATCH(ROWS($Q$2:Q43),$R2:$R986,0)),\"\")","v":"Mfw19w4-219-M  M Halden"}]
[9,"MFW19W4 ","219","M  ","M Halden","Mocha Mlti","8-40221-90101-0","C/O       ",11,null,{"v":87.5,"d":"$87.50"},{"v":175,"d":"$175.00"},{"v":174.95,"d":"$174.95"},0,"Mfw19w4-219-M  M Halden"," ",{"$f":"--ISNUMBER(IFERROR(SEARCH(Orders!$E18,O44,1),\"\"))","v":1},{"$f":"IF(Q44=1,COUNTIF($Q$2:Q44,1),\"\")","v":43},{"$f":"IFERROR(INDEX($O2:$O986,MATCH(ROWS($Q$2:Q44),$R2:$R986,0)),\"\")","v":"Mfw19w4-219-M  M Halden"}]
[9,"MFW19W4 ","219","M  ","M Halden","Mocha Mlti","8-40221-90102-7","C/O       ",11.5,null,{"v":87.5,"d":"$87.50"},{"v":175,"d":"$175.00"},{"v":174.95,"d":"$174.95"},0,"Mfw19w4-219-M  M Halden"," ",{"$f":"--ISNUMBER(IFERROR(SEARCH(Orders!$E18,O45,1),\"\"))","v":1},{"$f":"IF(Q45=1,COUNTIF($Q$2:Q45,1),\"\")","v":44},{"$f":"IFERROR(INDEX($O2:$O986,MATCH(ROWS($Q$2:Q45),$R2:$R986,0)),\"\")","v":"Mfw19w4-219-M  M Halden"}]
[9,"MFW19W4 ","219","M  ","M Halden","Mocha Mlti","8-40221-90103-4","C/O       ",12,null,{"v":87.5,"d":"$87.50"},{"v":175,"d":"$175.00"},{"v":174.95,"d":"$174.95"},0,"Mfw19w4-219-M  M Halden"," ",{"$f":"--ISNUMBER(IFERROR(SEARCH(Orders!$E18,O46,1),\"\"))","v":1},{"$f":"IF(Q46=1,COUNTIF($Q$2:Q46,1),\"\")","v":45},{"$f":"IFERROR(INDEX($O2:$O986,MATCH(ROWS($Q$2:Q46),$R2:$R986,0)),\"\")","v":"Mfw19w4-219-M  M Halden"}]
[9,"MFW19W4 ","219","M  ","M Halden","Mocha Mlti","8-40221-90104-1","C/O       ",12.5,null,{"v":87.5,"d":"$87.50"},{"v":175,"d":"$175.00"},{"v":174.95,"d":"$174.95"},0,"Mfw19w4-219-M  M Halden"," ",{"$f":"--ISNUMBER(IFERROR(SEARCH(Orders!$E18,O47,1),\"\"))","v":1},{"$f":"IF(Q47=1,COUNTIF($Q$2:Q47,1),\"\")","v":46},{"$f":"IFERROR(INDEX($O2:$O986,MATCH(ROWS($Q$2:Q47),$R2:$R986,0)),\"\")","v":"Mfw19w4-219-M  M Halden"}]
[9,"MFW19W4 ","219","M  ","M Halden","Mocha Mlti","8-40221-90105-8","C/O       ",13,null,{"v":87.5,"d":"$87.50"},{"v":175,"d":"$175.00"},{"v":174.95,"d":"$174.95"},0,"Mfw19w4-219-M  M Halden"," ",{"$f":"--ISNUMBER(IFERROR(SEARCH(Orders!$E18,O48,1),\"\"))","v":1},{"$f":"IF(Q48=1,COUNTIF($Q$2:Q48,1),\"\")","v":47},{"$f":"IFERROR(INDEX($O2:$O986,MATCH(ROWS($Q$2:Q48),$R2:$R986,0)),\"\")","v":"Mfw19w4-219-M  M Halden"}]
[9,"MFW19W4 ","219","M  ","M Halden","Mocha Mlti","8-40221-90106-5","C/O       ",14,null,{"v":87.5,"d":"$87.50"},{"v":175,"d":"$175.00"},{"v":174.95,"d":"$174.95"},0,"Mfw19w4-219-M  M Halden"," ",{"$f":"--ISNUMBER(IFERROR(SEARCH(Orders!$E18,O49,1),\"\"))","v":1},{"$f":"IF(Q49=1,COUNTIF($Q$2:Q49,1),\"\")","v":48},{"$f":"IFERROR(INDEX($O2:$O986,MATCH(ROWS($Q$2:Q49),$R2:$R986,0)),\"\")","v":"Mfw19w4-219-M  M Halden"}]
[11,"MFW20DH2","216","M  ","M Davos High","Mocha","7-52505-95228-4","C/O       ",8,null,{"v":95,"d":"$95.00"},{"v":190,"d":"$190.00"},{"v":189.95,"d":"$189.95"},0,"Mfw20dh2-216-M  M Davos High"," ",{"$f":"--ISNUMBER(IFERROR(SEARCH(Orders!$E18,O50,1),\"\"))","v":1},{"$f":"IF(Q50=1,COUNTIF($Q$2:Q50,1),\"\")","v":49},{"$f":"IFERROR(INDEX($O2:$O986,MATCH(ROWS($Q$2:Q50),$R2:$R986,0)),\"\")","v":"Mfw20dh2-216-M  M Davos High"}]
[11,"MFW20DH2","216","M  ","M Davos High","Mocha","7-52505-95229-1","C/O       ",8.5,null,{"v":95,"d":"$95.00"},{"v":190,"d":"$190.00"},{"v":189.95,"d":"$189.95"},0,"Mfw20dh2-216-M  M Davos High"," ",{"$f":"--ISNUMBER(IFERROR(SEARCH(Orders!$E18,O51,1),\"\"))","v":1},{"$f":"IF(Q51=1,COUNTIF($Q$2:Q51,1),\"\")","v":50},{"$f":"IFERROR(INDEX($O2:$O986,MATCH(ROWS($Q$2:Q51),$R2:$R986,0)),\"\")","v":"Mfw20dh2-216-M  M Davos High"}]
[11,"MFW20DH2","216","M  ","M Davos High","Mocha","7-52505-95230-7","C/O       ",9,null,{"v":95,"d":"$95.00"},{"v":190,"d":"$190.00"},{"v":189.95,"d":"$189.95"},0,"Mfw20dh2-216-M  M Davos High"," ",{"$f":"--ISNUMBER(IFERROR(SEARCH(Orders!$E18,O52,1),\"\"))","v":1},{"$f":"IF(Q52=1,COUNTIF($Q$2:Q52,1),\"\")","v":51},{"$f":"IFERROR(INDEX($O2:$O986,MATCH(ROWS($Q$2:Q52),$R2:$R986,0)),\"\")","v":"Mfw20dh2-216-M  M Davos High"}]
[11,"MFW20DH2","216","M  ","M Davos High","Mocha","7-52505-95231-4","C/O       ",9.5,null,{"v":95,"d":"$95.00"},{"v":190,"d":"$190.00"},{"v":189.95,"d":"$189.95"},0,"Mfw20dh2-216-M  M Davos High"," ",{"$f":"--ISNUMBER(IFERROR(SEARCH(Orders!$E18,O53,1),\"\"))","v":1},{"$f":"IF(Q53=1,COUNTIF($Q$2:Q53,1),\"\")","v":52},{"$f":"IFERROR(INDEX($O2:$O986,MATCH(ROWS($Q$2:Q53),$R2:$R986,0)),\"\")","v":"Mfw20dh2-216-M  M Davos High"}]
[11,"MFW20DH2","216","M  ","M Davos High","Mocha","7-52505-95232-1","C/O       ",10,null,{"v":95,"d":"$95.00"},{"v":190,"d":"$190.00"},{"v":189.95,"d":"$189.95"},0,"Mfw20dh2-216-M  M Davos High"," ",{"$f":"--ISNUMBER(IFERROR(SEARCH(Orders!$E18,O54,1),\"\"))","v":1},{"$f":"IF(Q54=1,COUNTIF($Q$2:Q54,1),\"\")","v":53},{"$f":"IFERROR(INDEX($O2:$O986,MATCH(ROWS($Q$2:Q54),$R2:$R986,0)),\"\")","v":"Mfw20dh2-216-M  M Davos High"}]
[11,"MFW20DH2","216","M  ","M Davos High","Mocha","7-52505-95233-8","C/O       ",10.5,null,{"v":95,"d":"$95.00"},{"v":190,"d":"$190.00"},{"v":189.95,"d":"$189.95"},0,"Mfw20dh2-216-M  M Davos High"," ",{"$f":"--ISNUMBER(IFERROR(SEARCH(Orders!$E18,O55,1),\"\"))","v":1},{"$f":"IF(Q55=1,COUNTIF($Q$2:Q55,1),\"\")","v":54},{"$f":"IFERROR(INDEX($O2:$O986,MATCH(ROWS($Q$2:Q55),$R2:$R986,0)),\"\")","v":"Mfw20dh2-216-M  M Davos High"}]
[11,"MFW20DH2","216","M  ","M Davos High","Mocha","7-52505-95234-5","C/O       ",11,null,{"v":95,"d":"$95.00"},{"v":190,"d":"$190.00"},{"v":189.95,"d":"$189.95"},0,"Mfw20dh2-216-M  M Davos High"," ",{"$f":"--ISNUMBER(IFERROR(SEARCH(Orders!$E18,O56,1),\"\"))","v":1},{"$f":"IF(Q56=1,COUNTIF($Q$2:Q56,1),\"\")","v":55},{"$f":"IFERROR(INDEX($O2:$O986,MATCH(ROWS($Q$2:Q56),$R2:$R986,0)),\"\")","v":"Mfw20dh2-216-M  M Davos High"}]
[11,"MFW20DH2","216","M  ","M Davos High","Mocha","7-52505-95235-2","C/O       ",11.5,null,{"v":95,"d":"$95.00"},{"v":190,"d":"$190.00"},{"v":189.95,"d":"$189.95"},0,"Mfw20dh2-216-M  M Davos High"," ",{"$f":"--ISNUMBER(IFERROR(SEARCH(Orders!$E18,O57,1),\"\"))","v":1},{"$f":"IF(Q57=1,COUNTIF($Q$2:Q57,1),\"\")","v":56},{"$f":"IFERROR(INDEX($O2:$O986,MATCH(ROWS($Q$2:Q57),$R2:$R986,0)),\"\")","v":"Mfw20dh2-216-M  M Davos High"}]
[11,"MFW20DH2","216","M  ","M Davos High","Mocha","7-52505-95236-9","C/O       ",12,null,{"v":95,"d":"$95.00"},{"v":190,"d":"$190.00"},{"v":189.95,"d":"$189.95"},0,"Mfw20dh2-216-M  M Davos High"," ",{"$f":"--ISNUMBER(IFERROR(SEARCH(Orders!$E18,O58,1),\"\"))","v":1},{"$f":"IF(Q58=1,COUNTIF($Q$2:Q58,1),\"\")","v":57},{"$f":"IFERROR(INDEX($O2:$O986,MATCH(ROWS($Q$2:Q58),$R2:$R986,0)),\"\")","v":"Mfw20dh2-216-M  M Davos High"}]
[11,"MFW20DH2","216","M  ","M Davos High","Mocha","7-52505-95237-6","C/O       ",12.5,null,{"v":95,"d":"$95.00"},{"v":190,"d":"$190.00"},{"v":189.95,"d":"$189.95"},0,"Mfw20dh2-216-M  M Davos High"," ",{"$f":"--ISNUMBER(IFERROR(SEARCH(Orders!$E18,O59,1),\"\"))","v":1},{"$f":"IF(Q59=1,COUNTIF($Q$2:Q59,1),\"\")","v":58},{"$f":"IFERROR(INDEX($O2:$O986,MATCH(ROWS($Q$2:Q59),$R2:$R986,0)),\"\")","v":"Mfw20dh2-216-M  M Davos High"}]
[11,"MFW20DH2","216","M  ","M Davos High","Mocha","7-52505-95238-3","C/O       ",13,null,{"v":95,"d":"$95.00"},{"v":190,"d":"$190.00"},{"v":189.95,"d":"$189.95"},0,"Mfw20dh2-216-M  M Davos High"," ",{"$f":"--ISNUMBER(IFERROR(SEARCH(Orders!$E18,O60,1),\"\"))","v":1},{"$f":"IF(Q60=1,COUNTIF($Q$2:Q60,1),\"\")","v":59},{"$f":"IFERROR(INDEX($O2:$O986,MATCH(ROWS($Q$2:Q60),$R2:$R986,0)),\"\")","v":"Mfw20dh2-216-M  M Davos High"}]
[11,"MFW20DH2","216","M  ","M Davos High","Mocha","7-52505-95239-0","C/O       ",14,null,{"v":95,"d":"$95.00"},{"v":190,"d":"$190.00"},{"v":189.95,"d":"$189.95"},0,"Mfw20dh2-216-M  M Davos High"," ",{"$f":"--ISNUMBER(IFERROR(SEARCH(Orders!$E18,O61,1),\"\"))","v":1},{"$f":"IF(Q61=1,COUNTIF($Q$2:Q61,1),\"\")","v":60},{"$f":"IFERROR(INDEX($O2:$O986,MATCH(ROWS($Q$2:Q61),$R2:$R986,0)),\"\")","v":"Mfw20dh2-216-M  M Davos High"}]
[11,"MFW20DH3","235","M  ","M Davos High","Toffee","7-52505-95242-0","C/O       ",8,null,{"v":95,"d":"$95.00"},{"v":190,"d":"$190.00"},{"v":189.95,"d":"$189.95"},0,"Mfw20dh3-235-M  M Davos High"," ",{"$f":"--ISNUMBER(IFERROR(SEARCH(Orders!$E18,O62,1),\"\"))","v":1},{"$f":"IF(Q62=1,COUNTIF($Q$2:Q62,1),\"\")","v":61},{"$f":"IFERROR(INDEX($O2:$O986,MATCH(ROWS($Q$2:Q62),$R2:$R986,0)),\"\")","v":"Mfw20dh3-235-M  M Davos High"}]
[11,"MFW20DH3","235","M  ","M Davos High","Toffee","7-52505-95243-7","C/O       ",8.5,null,{"v":95,"d":"$95.00"},{"v":190,"d":"$190.00"},{"v":189.95,"d":"$189.95"},0,"Mfw20dh3-235-M  M Davos High"," ",{"$f":"--ISNUMBER(IFERROR(SEARCH(Orders!$E18,O63,1),\"\"))","v":1},{"$f":"IF(Q63=1,COUNTIF($Q$2:Q63,1),\"\")","v":62},{"$f":"IFERROR(INDEX($O2:$O986,MATCH(ROWS($Q$2:Q63),$R2:$R986,0)),\"\")","v":"Mfw20dh3-235-M  M Davos High"}]
[11,"MFW20DH3","235","M  ","M Davos High","Toffee","7-52505-95244-4","C/O       ",9,null,{"v":95,"d":"$95.00"},{"v":190,"d":"$190.00"},{"v":189.95,"d":"$189.95"},0,"Mfw20dh3-235-M  M Davos High"," ",{"$f":"--ISNUMBER(IFERROR(SEARCH(Orders!$E18,O64,1),\"\"))","v":1},{"$f":"IF(Q64=1,COUNTIF($Q$2:Q64,1),\"\")","v":63},{"$f":"IFERROR(INDEX($O2:$O986,MATCH(ROWS($Q$2:Q64),$R2:$R986,0)),\"\")","v":"Mfw20dh3-235-M  M Davos High"}]
[11,"MFW20DH3","235","M  ","M Davos High","Toffee","7-52505-95245-1","C/O       ",9.5,null,{"v":95,"d":"$95.00"},{"v":190,"d":"$190.00"},{"v":189.95,"d":"$189.95"},0,"Mfw20dh3-235-M  M Davos High"," ",{"$f":"--ISNUMBER(IFERROR(SEARCH(Orders!$E18,O65,1),\"\"))","v":1},{"$f":"IF(Q65=1,COUNTIF($Q$2:Q65,1),\"\")","v":64},{"$f":"IFERROR(INDEX($O2:$O986,MATCH(ROWS($Q$2:Q65),$R2:$R986,0)),\"\")","v":"Mfw20dh3-235-M  M Davos High"}]
[11,"MFW20DH3","235","M  ","M Davos High","Toffee","7-52505-95246-8","C/O       ",10,null,{"v":95,"d":"$95.00"},{"v":190,"d":"$190.00"},{"v":189.95,"d":"$189.95"},{"$f":"J66*K66","v":0},"Mfw20dh3-235-M  M Davos High"," ",{"$f":"--ISNUMBER(IFERROR(SEARCH(Orders!$E18,O66,1),\"\"))","v":1},{"$f":"IF(Q66=1,COUNTIF($Q$2:Q66,1),\"\")","v":65},{"$f":"IFERROR(INDEX($O2:$O986,MATCH(ROWS($Q$2:Q66),$R2:$R986,0)),\"\")","v":"Mfw20dh3-235-M  M Davos High"}]
[11,"MFW20DH3","235","M  ","M Davos High","Toffee","7-52505-95247-5","C/O       ",10.5,null,{"v":95,"d":"$95.00"},{"v":190,"d":"$190.00"},{"v":189.95,"d":"$189.95"},0,"Mfw20dh3-235-M  M Davos High"," ",{"$f":"--ISNUMBER(IFERROR(SEARCH(Orders!$E18,O67,1),\"\"))","v":1},{"$f":"IF(Q67=1,COUNTIF($Q$2:Q67,1),\"\")","v":66},{"$f":"IFERROR(INDEX($O2:$O986,MATCH(ROWS($Q$2:Q67),$R2:$R986,0)),\"\")","v":"Mfw20dh3-235-M  M Davos High"}]
[11,"MFW20DH3","235","M  ","M Davos High","Toffee","7-52505-95248-2","C/O       ",11,null,{"v":95,"d":"$95.00"},{"v":190,"d":"$190.00"},{"v":189.95,"d":"$189.95"},0,"Mfw20dh3-235-M  M Davos High"," ",{"$f":"--ISNUMBER(IFERROR(SEARCH(Orders!$E18,O68,1),\"\"))","v":1},{"$f":"IF(Q68=1,COUNTIF($Q$2:Q68,1),\"\")","v":67},{"$f":"IFERROR(INDEX($O2:$O986,MATCH(ROWS($Q$2:Q68),$R2:$R986,0)),\"\")","v":"Mfw20dh3-235-M  M Davos High"}]
[11,"MFW20DH3","235","M  ","M Davos High","Toffee","7-52505-95249-9","C/O       ",11.5,null,{"v":95,"d":"$95.00"},{"v":190,"d":"$190.00"},{"v":189.95,"d":"$189.95"},0,"Mfw20dh3-235-M  M Davos High"," ",{"$f":"--ISNUMBER(IFERROR(SEARCH(Orders!$E18,O69,1),\"\"))","v":1},{"$f":"IF(Q69=1,COUNTIF($Q$2:Q69,1),\"\")","v":68},{"$f":"IFERROR(INDEX($O2:$O986,MATCH(ROWS($Q$2:Q69),$R2:$R986,0)),\"\")","v":"Mfw20dh3-235-M  M Davos High"}]
[11,"MFW20DH3","235","M  ","M Davos High","Toffee","7-52505-95250-5","C/O       ",12,null,{"v":95,"d":"$95.00"},{"v":190,"d":"$190.00"},{"v":189.95,"d":"$189.95"},0,"Mfw20dh3-235-M  M Davos High"," ",{"$f":"--ISNUMBER(IFERROR(SEARCH(Orders!$E18,O70,1),\"\"))","v":1},{"$f":"IF(Q70=1,COUNTIF($Q$2:Q70,1),\"\")","v":69},{"$f":"IFERROR(INDEX($O2:$O986,MATCH(ROWS($Q$2:Q70),$R2:$R986,0)),\"\")","v":"Mfw20dh3-235-M  M Davos High"}]
[11,"MFW20DH3","235","M  ","M Davos High","Toffee","7-52505-95251-2","C/O       ",12.5,null,{"v":95,"d":"$95.00"},{"v":190,"d":"$190.00"},{"v":189.95,"d":"$189.95"},0,"Mfw20dh3-235-M  M Davos High"," ",{"$f":"--ISNUMBER(IFERROR(SEARCH(Orders!$E18,O71,1),\"\"))","v":1},{"$f":"IF(Q71=1,COUNTIF($Q$2:Q71,1),\"\")","v":70},{"$f":"IFERROR(INDEX($O2:$O986,MATCH(ROWS($Q$2:Q71),$R2:$R986,0)),\"\")","v":"Mfw20dh3-235-M  M Davos High"}]
[11,"MFW20DH3","235","M  ","M Davos High","Toffee","7-52505-95252-9","C/O       ",13,null,{"v":95,"d":"$95.00"},{"v":190,"d":"$190.00"},{"v":189.95,"d":"$189.95"},0,"Mfw20dh3-235-M  M Davos High"," ",{"$f":"--ISNUMBER(IFERROR(SEARCH(Orders!$E18,O72,1),\"\"))","v":1},{"$f":"IF(Q72=1,COUNTIF($Q$2:Q72,1),\"\")","v":71},{"$f":"IFERROR(INDEX($O2:$O986,MATCH(ROWS($Q$2:Q72),$R2:$R986,0)),\"\")","v":"Mfw20dh3-235-M  M Davos High"}]
[11,"MFW20DH3","235","M  ","M Davos High","Toffee","7-52505-95253-6","C/O       ",14,null,{"v":95,"d":"$95.00"},{"v":190,"d":"$190.00"},{"v":189.95,"d":"$189.95"},0,"Mfw20dh3-235-M  M Davos High"," ",{"$f":"--ISNUMBER(IFERROR(SEARCH(Orders!$E18,O73,1),\"\"))","v":1},{"$f":"IF(Q73=1,COUNTIF($Q$2:Q73,1),\"\")","v":72},{"$f":"IFERROR(INDEX($O2:$O986,MATCH(ROWS($Q$2:Q73),$R2:$R986,0)),\"\")","v":"Mfw20dh3-235-M  M Davos High"}]
[11,"MFW20DH4","025","M  ","M Davos High","Gunmetal","8-40221-90081-5","C/O       ",8,null,{"v":95,"d":"$95.00"},{"v":190,"d":"$190.00"},{"v":189.95,"d":"$189.95"},0,"Mfw20dh4-025-M  M Davos High"," ",{"$f":"--ISNUMBER(IFERROR(SEARCH(Orders!$E18,O74,1),\"\"))","v":1},{"$f":"IF(Q74=1,COUNTIF($Q$2:Q74,1),\"\")","v":73},{"$f":"IFERROR(INDEX($O2:$O986,MATCH(ROWS($Q$2:Q74),$R2:$R986,0)),\"\")","v":"Mfw20dh4-025-M  M Davos High"}]
[11,"MFW20DH4","025","M  ","M Davos High","Gunmetal","8-40221-90082-2","C/O       ",8.5,null,{"v":95,"d":"$95.00"},{"v":190,"d":"$190.00"},{"v":189.95,"d":"$189.95"},0,"Mfw20dh4-025-M  M Davos High"," ",{"$f":"--ISNUMBER(IFERROR(SEARCH(Orders!$E18,O75,1),\"\"))","v":1},{"$f":"IF(Q75=1,COUNTIF($Q$2:Q75,1),\"\")","v":74},{"$f":"IFERROR(INDEX($O2:$O986,MATCH(ROWS($Q$2:Q75),$R2:$R986,0)),\"\")","v":"Mfw20dh4-025-M  M Davos High"}]
[11,"MFW20DH4","025","M  ","M Davos High","Gunmetal","8-40221-90083-9","C/O       ",9,null,{"v":95,"d":"$95.00"},{"v":190,"d":"$190.00"},{"v":189.95,"d":"$189.95"},0,"Mfw20dh4-025-M  M Davos High"," ",{"$f":"--ISNUMBER(IFERROR(SEARCH(Orders!$E18,O76,1),\"\"))","v":1},{"$f":"IF(Q76=1,COUNTIF($Q$2:Q76,1),\"\")","v":75},{"$f":"IFERROR(INDEX($O2:$O986,MATCH(ROWS($Q$2:Q76),$R2:$R986,0)),\"\")","v":"Mfw20dh4-025-M  M Davos High"}]
[11,"MFW20DH4","025","M  ","M Davos High","Gunmetal","8-40221-90084-6","C/O       ",9.5,null,{"v":95,"d":"$95.00"},{"v":190,"d":"$190.00"},{"v":189.95,"d":"$189.95"},0,"Mfw20dh4-025-M  M Davos High"," ",{"$f":"--ISNUMBER(IFERROR(SEARCH(Orders!$E18,O77,1),\"\"))","v":1},{"$f":"IF(Q77=1,COUNTIF($Q$2:Q77,1),\"\")","v":76},{"$f":"IFERROR(INDEX($O2:$O986,MATCH(ROWS($Q$2:Q77),$R2:$R986,0)),\"\")","v":"Mfw20dh4-025-M  M Davos High"}]
[11,"MFW20DH4","025","M  ","M Davos High","Gunmetal","8-40221-90085-3","C/O       ",10,null,{"v":95,"d":"$95.00"},{"v":190,"d":"$190.00"},{"v":189.95,"d":"$189.95"},0,"Mfw20dh4-025-M  M Davos High"," ",{"$f":"--ISNUMBER(IFERROR(SEARCH(Orders!$E18,O78,1),\"\"))","v":1},{"$f":"IF(Q78=1,COUNTIF($Q$2:Q78,1),\"\")","v":77},{"$f":"IFERROR(INDEX($O2:$O986,MATCH(ROWS($Q$2:Q78),$R2:$R986,0)),\"\")","v":"Mfw20dh4-025-M  M Davos High"}]
[11,"MFW20DH4","025","M  ","M Davos High","Gunmetal","8-40221-90086-0","C/O       ",10.5,null,{"v":95,"d":"$95.00"},{"v":190,"d":"$190.00"},{"v":189.95,"d":"$189.95"},0,"Mfw20dh4-025-M  M Davos High"," ",{"$f":"--ISNUMBER(IFERROR(SEARCH(Orders!$E18,O79,1),\"\"))","v":1},{"$f":"IF(Q79=1,COUNTIF($Q$2:Q79,1),\"\")","v":78},{"$f":"IFERROR(INDEX($O2:$O986,MATCH(ROWS($Q$2:Q79),$R2:$R986,0)),\"\")","v":"Mfw20dh4-025-M  M Davos High"}]
[11,"MFW20DH4","025","M  ","M Davos High","Gunmetal","8-40221-90087-7","C/O       ",11,null,{"v":95,"d":"$95.00"},{"v":190,"d":"$190.00"},{"v":189.95,"d":"$189.95"},0,"Mfw20dh4-025-M  M Davos High"," ",{"$f":"--ISNUMBER(IFERROR(SEARCH(Orders!$E18,O80,1),\"\"))","v":1},{"$f":"IF(Q80=1,COUNTIF($Q$2:Q80,1),\"\")","v":79},{"$f":"IFERROR(INDEX($O2:$O986,MATCH(ROWS($Q$2:Q80),$R2:$R986,0)),\"\")","v":"Mfw20dh4-025-M  M Davos High"}]
[11,"MFW20DH4","025","M  ","M Davos High","Gunmetal","8-40221-90088-4","C/O       ",11.5,null,{"v":95,"d":"$95.00"},{"v":190,"d":"$190.00"},{"v":189.95,"d":"$189.95"},0,"Mfw20dh4-025-M  M Davos High"," ",{"$f":"--ISNUMBER(IFERROR(SEARCH(Orders!$E18,O81,1),\"\"))","v":1},{"$f":"IF(Q81=1,COUNTIF($Q$2:Q81,1),\"\")","v":80},{"$f":"IFERROR(INDEX($O2:$O986,MATCH(ROWS($Q$2:Q81),$R2:$R986,0)),\"\")","v":"Mfw20dh4-025-M  M Davos High"}]
[11,"MFW20DH4","025","M  ","M Davos High","Gunmetal","8-40221-90089-1","C/O       ",12,null,{"v":95,"d":"$95.00"},{"v":190,"d":"$190.00"},{"v":189.95,"d":"$189.95"},0,"Mfw20dh4-025-M  M Davos High"," ",{"$f":"--ISNUMBER(IFERROR(SEARCH(Orders!$E18,O82,1),\"\"))","v":1},{"$f":"IF(Q82=1,COUNTIF($Q$2:Q82,1),\"\")","v":81},{"$f":"IFERROR(INDEX($O2:$O986,MATCH(ROWS($Q$2:Q82),$R2:$R986,0)),\"\")","v":"Mfw20dh4-025-M  M Davos High"}]
[11,"MFW20DH4","025","M  ","M Davos High","Gunmetal","8-40221-90090-7","C/O       ",12.5,null,{"v":95,"d":"$95.00"},{"v":190,"d":"$190.00"},{"v":189.95,"d":"$189.95"},0,"Mfw20dh4-025-M  M Davos High"," ",{"$f":"--ISNUMBER(IFERROR(SEARCH(Orders!$E18,O83,1),\"\"))","v":1},{"$f":"IF(Q83=1,COUNTIF($Q$2:Q83,1),\"\")","v":82},{"$f":"IFERROR(INDEX($O2:$O986,MATCH(ROWS($Q$2:Q83),$R2:$R986,0)),\"\")","v":"Mfw20dh4-025-M  M Davos High"}]
[11,"MFW20DH4","025","M  ","M Davos High","Gunmetal","8-40221-90091-4","C/O       ",13,null,{"v":95,"d":"$95.00"},{"v":190,"d":"$190.00"},{"v":189.95,"d":"$189.95"},0,"Mfw20dh4-025-M  M Davos High"," ",{"$f":"--ISNUMBER(IFERROR(SEARCH(Orders!$E18,O84,1),\"\"))","v":1},{"$f":"IF(Q84=1,COUNTIF($Q$2:Q84,1),\"\")","v":83},{"$f":"IFERROR(INDEX($O2:$O986,MATCH(ROWS($Q$2:Q84),$R2:$R986,0)),\"\")","v":"Mfw20dh4-025-M  M Davos High"}]
[11,"MFW20DH4","025","M  ","M Davos High","Gunmetal","8-40221-90092-1","C/O       ",14,null,{"v":95,"d":"$95.00"},{"v":190,"d":"$190.00"},{"v":189.95,"d":"$189.95"},0,"Mfw20dh4-025-M  M Davos High"," ",{"$f":"--ISNUMBER(IFERROR(SEARCH(Orders!$E18,O85,1),\"\"))","v":1},{"$f":"IF(Q85=1,COUNTIF($Q$2:Q85,1),\"\")","v":84},{"$f":"IFERROR(INDEX($O2:$O986,MATCH(ROWS($Q$2:Q85),$R2:$R986,0)),\"\")","v":"Mfw20dh4-025-M  M Davos High"}]
[12,"MFW21DM1","235","M  ","M Davos Mid Top","Toffee","8-40221-90387-8","C/O       ",8,null,{"v":85,"d":"$85.00"},{"v":170,"d":"$170.00"},{"v":169.95,"d":"$169.95"},0,"Mfw21dm1-235-M  M Davos Mid Top"," ",{"$f":"--ISNUMBER(IFERROR(SEARCH(Orders!$E18,O86,1),\"\"))","v":1},{"$f":"IF(Q86=1,COUNTIF($Q$2:Q86,1),\"\")","v":85},{"$f":"IFERROR(INDEX($O2:$O986,MATCH(ROWS($Q$2:Q86),$R2:$R986,0)),\"\")","v":"Mfw21dm1-235-M  M Davos Mid Top"}]
[12,"MFW21DM1","235","M  ","M Davos Mid Top","Toffee","8-40221-90388-5","C/O       ",8.5,null,{"v":85,"d":"$85.00"},{"v":170,"d":"$170.00"},{"v":169.95,"d":"$169.95"},0,"Mfw21dm1-235-M  M Davos Mid Top"," ",{"$f":"--ISNUMBER(IFERROR(SEARCH(Orders!$E18,O87,1),\"\"))","v":1},{"$f":"IF(Q87=1,COUNTIF($Q$2:Q87,1),\"\")","v":86},{"$f":"IFERROR(INDEX($O2:$O986,MATCH(ROWS($Q$2:Q87),$R2:$R986,0)),\"\")","v":"Mfw21dm1-235-M  M Davos Mid Top"}]
[12,"MFW21DM1","235","M  ","M Davos Mid Top","Toffee","8-40221-90389-2","C/O       ",9,null,{"v":85,"d":"$85.00"},{"v":170,"d":"$170.00"},{"v":169.95,"d":"$169.95"},0,"Mfw21dm1-235-M  M Davos Mid Top"," ",{"$f":"--ISNUMBER(IFERROR(SEARCH(Orders!$E18,O88,1),\"\"))","v":1},{"$f":"IF(Q88=1,COUNTIF($Q$2:Q88,1),\"\")","v":87},{"$f":"IFERROR(INDEX($O2:$O986,MATCH(ROWS($Q$2:Q88),$R2:$R986,0)),\"\")","v":"Mfw21dm1-235-M  M Davos Mid Top"}]
[12,"MFW21DM1","235","M  ","M Davos Mid Top","Toffee","8-40221-90390-8","C/O       ",9.5,null,{"v":85,"d":"$85.00"},{"v":170,"d":"$170.00"},{"v":169.95,"d":"$169.95"},0,"Mfw21dm1-235-M  M Davos Mid Top"," ",{"$f":"--ISNUMBER(IFERROR(SEARCH(Orders!$E18,O89,1),\"\"))","v":1},{"$f":"IF(Q89=1,COUNTIF($Q$2:Q89,1),\"\")","v":88},{"$f":"IFERROR(INDEX($O2:$O986,MATCH(ROWS($Q$2:Q89),$R2:$R986,0)),\"\")","v":"Mfw21dm1-235-M  M Davos Mid Top"}]
[12,"MFW21DM1","235","M  ","M Davos Mid Top","Toffee","8-40221-90391-5","C/O       ",10,null,{"v":85,"d":"$85.00"},{"v":170,"d":"$170.00"},{"v":169.95,"d":"$169.95"},0,"Mfw21dm1-235-M  M Davos Mid Top"," ",{"$f":"--ISNUMBER(IFERROR(SEARCH(Orders!$E18,O90,1),\"\"))","v":1},{"$f":"IF(Q90=1,COUNTIF($Q$2:Q90,1),\"\")","v":89},{"$f":"IFERROR(INDEX($O2:$O986,MATCH(ROWS($Q$2:Q90),$R2:$R986,0)),\"\")","v":"Mfw21dm1-235-M  M Davos Mid Top"}]
[12,"MFW21DM1","235","M  ","M Davos Mid Top","Toffee","8-40221-90392-2","C/O       ",10.5,null,{"v":85,"d":"$85.00"},{"v":170,"d":"$170.00"},{"v":169.95,"d":"$169.95"},0,"Mfw21dm1-235-M  M Davos Mid Top"," ",{"$f":"--ISNUMBER(IFERROR(SEARCH(Orders!$E18,O91,1),\"\"))","v":1},{"$f":"IF(Q91=1,COUNTIF($Q$2:Q91,1),\"\")","v":90},{"$f":"IFERROR(INDEX($O2:$O986,MATCH(ROWS($Q$2:Q91),$R2:$R986,0)),\"\")","v":"Mfw21dm1-235-M  M Davos Mid Top"}]
[12,"MFW21DM1","235","M  ","M Davos Mid Top","Toffee","8-40221-90393-9","C/O       ",11,null,{"v":85,"d":"$85.00"},{"v":170,"d":"$170.00"},{"v":169.95,"d":"$169.95"},0,"Mfw21dm1-235-M  M Davos Mid Top"," ",{"$f":"--ISNUMBER(IFERROR(SEARCH(Orders!$E18,O92,1),\"\"))","v":1},{"$f":"IF(Q92=1,COUNTIF($Q$2:Q92,1),\"\")","v":91},{"$f":"IFERROR(INDEX($O2:$O986,MATCH(ROWS($Q$2:Q92),$R2:$R986,0)),\"\")","v":"Mfw21dm1-235-M  M Davos Mid Top"}]
[12,"MFW21DM1","235","M  ","M Davos Mid Top","Toffee","8-40221-90394-6","C/O       ",11.5,null,{"v":85,"d":"$85.00"},{"v":170,"d":"$170.00"},{"v":169.95,"d":"$169.95"},0,"Mfw21dm1-235-M  M Davos Mid Top"," ",{"$f":"--ISNUMBER(IFERROR(SEARCH(Orders!$E18,O93,1),\"\"))","v":1},{"$f":"IF(Q93=1,COUNTIF($Q$2:Q93,1),\"\")","v":92},{"$f":"IFERROR(INDEX($O2:$O986,MATCH(ROWS($Q$2:Q93),$R2:$R986,0)),\"\")","v":"Mfw21dm1-235-M  M Davos Mid Top"}]
[12,"MFW21DM1","235","M  ","M Davos Mid Top","Toffee","8-40221-90395-3","C/O       ",12,null,{"v":85,"d":"$85.00"},{"v":170,"d":"$170.00"},{"v":169.95,"d":"$169.95"},0,"Mfw21dm1-235-M  M Davos Mid Top"," ",{"$f":"--ISNUMBER(IFERROR(SEARCH(Orders!$E18,O94,1),\"\"))","v":1},{"$f":"IF(Q94=1,COUNTIF($Q$2:Q94,1),\"\")","v":93},{"$f":"IFERROR(INDEX($O2:$O986,MATCH(ROWS($Q$2:Q94),$R2:$R986,0)),\"\")","v":"Mfw21dm1-235-M  M Davos Mid Top"}]
[12,"MFW21DM1","235","M  ","M Davos Mid Top","Toffee","8-40221-90396-0","C/O       ",12.5,null,{"v":85,"d":"$85.00"},{"v":170,"d":"$170.00"},{"v":169.95,"d":"$169.95"},0,"Mfw21dm1-235-M  M Davos Mid Top"," ",{"$f":"--ISNUMBER(IFERROR(SEARCH(Orders!$E18,O95,1),\"\"))","v":1},{"$f":"IF(Q95=1,COUNTIF($Q$2:Q95,1),\"\")","v":94},{"$f":"IFERROR(INDEX($O2:$O986,MATCH(ROWS($Q$2:Q95),$R2:$R986,0)),\"\")","v":"Mfw21dm1-235-M  M Davos Mid Top"}]
[12,"MFW21DM1","235","M  ","M Davos Mid Top","Toffee","8-40221-90397-7","C/O       ",13,null,{"v":85,"d":"$85.00"},{"v":170,"d":"$170.00"},{"v":169.95,"d":"$169.95"},0,"Mfw21dm1-235-M  M Davos Mid Top"," ",{"$f":"--ISNUMBER(IFERROR(SEARCH(Orders!$E18,O96,1),\"\"))","v":1},{"$f":"IF(Q96=1,COUNTIF($Q$2:Q96,1),\"\")","v":95},{"$f":"IFERROR(INDEX($O2:$O986,MATCH(ROWS($Q$2:Q96),$R2:$R986,0)),\"\")","v":"Mfw21dm1-235-M  M Davos Mid Top"}]
[12,"MFW21DM1","235","M  ","M Davos Mid Top","Toffee","8-40221-90398-4","C/O       ",14,null,{"v":85,"d":"$85.00"},{"v":170,"d":"$170.00"},{"v":169.95,"d":"$169.95"},0,"Mfw21dm1-235-M  M Davos Mid Top"," ",{"$f":"--ISNUMBER(IFERROR(SEARCH(Orders!$E18,O97,1),\"\"))","v":1},{"$f":"IF(Q97=1,COUNTIF($Q$2:Q97,1),\"\")","v":96},{"$f":"IFERROR(INDEX($O2:$O986,MATCH(ROWS($Q$2:Q97),$R2:$R986,0)),\"\")","v":"Mfw21dm1-235-M  M Davos Mid Top"}]
[2,"MFW21D1 ","235","M  ","M Dispatch","Toffee","8-40221-90109-6","C/O       ",8,null,{"v":85,"d":"$85.00"},{"v":170,"d":"$170.00"},{"v":169.95,"d":"$169.95"},0,"Mfw21d1-235-M  M Dispatch"," ",{"$f":"--ISNUMBER(IFERROR(SEARCH(Orders!$E18,O98,1),\"\"))","v":1},{"$f":"IF(Q98=1,COUNTIF($Q$2:Q98,1),\"\")","v":97},{"$f":"IFERROR(INDEX($O2:$O986,MATCH(ROWS($Q$2:Q98),$R2:$R986,0)),\"\")","v":"Mfw21d1-235-M  M Dispatch"}]
[2,"MFW21D1 ","235","M  ","M Dispatch","Toffee","8-40221-90110-2","C/O       ",8.5,null,{"v":85,"d":"$85.00"},{"v":170,"d":"$170.00"},{"v":169.95,"d":"$169.95"},0,"Mfw21d1-235-M  M Dispatch"," ",{"$f":"--ISNUMBER(IFERROR(SEARCH(Orders!$E18,O99,1),\"\"))","v":1},{"$f":"IF(Q99=1,COUNTIF($Q$2:Q99,1),\"\")","v":98},{"$f":"IFERROR(INDEX($O2:$O986,MATCH(ROWS($Q$2:Q99),$R2:$R986,0)),\"\")","v":"Mfw21d1-235-M  M Dispatch"}]
[2,"MFW21D1 ","235","M  ","M Dispatch","Toffee","8-40221-90111-9","C/O       ",9,null,{"v":85,"d":"$85.00"},{"v":170,"d":"$170.00"},{"v":169.95,"d":"$169.95"},0,"Mfw21d1-235-M  M Dispatch"," ",{"$f":"--ISNUMBER(IFERROR(SEARCH(Orders!$E18,O100,1),\"\"))","v":1},{"$f":"IF(Q100=1,COUNTIF($Q$2:Q100,1),\"\")","v":99},{"$f":"IFERROR(INDEX($O2:$O986,MATCH(ROWS($Q$2:Q100),$R2:$R986,0)),\"\")","v":"Mfw21d1-235-M  M Dispatch"}]
[2,"MFW21D1 ","235","M  ","M Dispatch","Toffee","8-40221-90112-6","C/O       ",9.5,null,{"v":85,"d":"$85.00"},{"v":170,"d":"$170.00"},{"v":169.95,"d":"$169.95"},0,"Mfw21d1-235-M  M Dispatch"," ",{"$f":"--ISNUMBER(IFERROR(SEARCH(Orders!$E18,O101,1),\"\"))","v":1},{"$f":"IF(Q101=1,COUNTIF($Q$2:Q101,1),\"\")","v":100},{"$f":"IFERROR(INDEX($O2:$O986,MATCH(ROWS($Q$2:Q101),$R2:$R986,0)),\"\")","v":"Mfw21d1-235-M  M Dispatch"}]
[2,"MFW21D1 ","235","M  ","M Dispatch","Toffee","8-40221-90113-3","C/O       ",10,null,{"v":85,"d":"$85.00"},{"v":170,"d":"$170.00"},{"v":169.95,"d":"$169.95"},0,"Mfw21d1-235-M  M Dispatch"," ",{"$f":"--ISNUMBER(IFERROR(SEARCH(Orders!$E18,O102,1),\"\"))","v":1},{"$f":"IF(Q102=1,COUNTIF($Q$2:Q102,1),\"\")","v":101},{"$f":"IFERROR(INDEX($O2:$O986,MATCH(ROWS($Q$2:Q102),$R2:$R986,0)),\"\")","v":"Mfw21d1-235-M  M Dispatch"}]
[2,"MFW21D1 ","235","M  ","M Dispatch","Toffee","8-40221-90114-0","C/O       ",10.5,null,{"v":85,"d":"$85.00"},{"v":170,"d":"$170.00"},{"v":169.95,"d":"$169.95"},0,"Mfw21d1-235-M  M Dispatch"," ",{"$f":"--ISNUMBER(IFERROR(SEARCH(Orders!$E18,O103,1),\"\"))","v":1},{"$f":"IF(Q103=1,COUNTIF($Q$2:Q103,1),\"\")","v":102},{"$f":"IFERROR(INDEX($O2:$O986,MATCH(ROWS($Q$2:Q103),$R2:$R986,0)),\"\")","v":"Mfw21d1-235-M  M Dispatch"}]
[2,"MFW21D1 ","235","M  ","M Dispatch","Toffee","8-40221-90115-7","C/O       ",11,null,{"v":85,"d":"$85.00"},{"v":170,"d":"$170.00"},{"v":169.95,"d":"$169.95"},0,"Mfw21d1-235-M  M Dispatch"," ",{"$f":"--ISNUMBER(IFERROR(SEARCH(Orders!$E18,O104,1),\"\"))","v":1},{"$f":"IF(Q104=1,COUNTIF($Q$2:Q104,1),\"\")","v":103},{"$f":"IFERROR(INDEX($O2:$O986,MATCH(ROWS($Q$2:Q104),$R2:$R986,0)),\"\")","v":"Mfw21d1-235-M  M Dispatch"}]
[2,"MFW21D1 ","235","M  ","M Dispatch","Toffee","8-40221-90116-4","C/O       ",11.5,null,{"v":85,"d":"$85.00"},{"v":170,"d":"$170.00"},{"v":169.95,"d":"$169.95"},0,"Mfw21d1-235-M  M Dispatch"," ",{"$f":"--ISNUMBER(IFERROR(SEARCH(Orders!$E18,O105,1),\"\"))","v":1},{"$f":"IF(Q105=1,COUNTIF($Q$2:Q105,1),\"\")","v":104},{"$f":"IFERROR(INDEX($O2:$O986,MATCH(ROWS($Q$2:Q105),$R2:$R986,0)),\"\")","v":"Mfw21d1-235-M  M Dispatch"}]
[2,"MFW21D1 ","235","M  ","M Dispatch","Toffee","8-40221-90117-1","C/O       ",12,null,{"v":85,"d":"$85.00"},{"v":170,"d":"$170.00"},{"v":169.95,"d":"$169.95"},0,"Mfw21d1-235-M  M Dispatch"," ",{"$f":"--ISNUMBER(IFERROR(SEARCH(Orders!$E18,O106,1),\"\"))","v":1},{"$f":"IF(Q106=1,COUNTIF($Q$2:Q106,1),\"\")","v":105},{"$f":"IFERROR(INDEX($O2:$O986,MATCH(ROWS($Q$2:Q106),$R2:$R986,0)),\"\")","v":"Mfw21d1-235-M  M Dispatch"}]
[2,"MFW21D1 ","235","M  ","M Dispatch","Toffee","8-40221-90118-8","C/O       ",12.5,null,{"v":85,"d":"$85.00"},{"v":170,"d":"$170.00"},{"v":169.95,"d":"$169.95"},0,"Mfw21d1-235-M  M Dispatch"," ",{"$f":"--ISNUMBER(IFERROR(SEARCH(Orders!$E18,O107,1),\"\"))","v":1},{"$f":"IF(Q107=1,COUNTIF($Q$2:Q107,1),\"\")","v":106},{"$f":"IFERROR(INDEX($O2:$O986,MATCH(ROWS($Q$2:Q107),$R2:$R986,0)),\"\")","v":"Mfw21d1-235-M  M Dispatch"}]
[2,"MFW21D1 ","235","M  ","M Dispatch","Toffee","8-40221-90119-5","C/O       ",13,null,{"v":85,"d":"$85.00"},{"v":170,"d":"$170.00"},{"v":169.95,"d":"$169.95"},0,"Mfw21d1-235-M  M Dispatch"," ",{"$f":"--ISNUMBER(IFERROR(SEARCH(Orders!$E18,O108,1),\"\"))","v":1},{"$f":"IF(Q108=1,COUNTIF($Q$2:Q108,1),\"\")","v":107},{"$f":"IFERROR(INDEX($O2:$O986,MATCH(ROWS($Q$2:Q108),$R2:$R986,0)),\"\")","v":"Mfw21d1-235-M  M Dispatch"}]
[2,"MFW21D1 ","235","M  ","M Dispatch","Toffee","8-40221-90120-1","C/O       ",14,null,{"v":85,"d":"$85.00"},{"v":170,"d":"$170.00"},{"v":169.95,"d":"$169.95"},0,"Mfw21d1-235-M  M Dispatch"," ",{"$f":"--ISNUMBER(IFERROR(SEARCH(Orders!$E18,O109,1),\"\"))","v":1},{"$f":"IF(Q109=1,COUNTIF($Q$2:Q109,1),\"\")","v":108},{"$f":"IFERROR(INDEX($O2:$O986,MATCH(ROWS($Q$2:Q109),$R2:$R986,0)),\"\")","v":"Mfw21d1-235-M  M Dispatch"}]
[2,"MFW21D3 ","410","M  ","M Dispatch","Navy","8-40221-90137-9","C/O       ",8,null,{"v":85,"d":"$85.00"},{"v":170,"d":"$170.00"},{"v":169.95,"d":"$169.95"},0,"Mfw21d3-410-M  M Dispatch"," ",{"$f":"--ISNUMBER(IFERROR(SEARCH(Orders!$E18,O110,1),\"\"))","v":1},{"$f":"IF(Q110=1,COUNTIF($Q$2:Q110,1),\"\")","v":109},{"$f":"IFERROR(INDEX($O2:$O986,MATCH(ROWS($Q$2:Q110),$R2:$R986,0)),\"\")","v":"Mfw21d3-410-M  M Dispatch"}]
[2,"MFW21D3 ","410","M  ","M Dispatch","Navy","8-40221-90138-6","C/O       ",8.5,null,{"v":85,"d":"$85.00"},{"v":170,"d":"$170.00"},{"v":169.95,"d":"$169.95"},0,"Mfw21d3-410-M  M Dispatch"," ",{"$f":"--ISNUMBER(IFERROR(SEARCH(Orders!$E18,O111,1),\"\"))","v":1},{"$f":"IF(Q111=1,COUNTIF($Q$2:Q111,1),\"\")","v":110},{"$f":"IFERROR(INDEX($O2:$O986,MATCH(ROWS($Q$2:Q111),$R2:$R986,0)),\"\")","v":"Mfw21d3-410-M  M Dispatch"}]
[2,"MFW21D3 ","410","M  ","M Dispatch","Navy","8-40221-90139-3","C/O       ",9,null,{"v":85,"d":"$85.00"},{"v":170,"d":"$170.00"},{"v":169.95,"d":"$169.95"},0,"Mfw21d3-410-M  M Dispatch"," ",{"$f":"--ISNUMBER(IFERROR(SEARCH(Orders!$E18,O112,1),\"\"))","v":1},{"$f":"IF(Q112=1,COUNTIF($Q$2:Q112,1),\"\")","v":111},{"$f":"IFERROR(INDEX($O2:$O986,MATCH(ROWS($Q$2:Q112),$R2:$R986,0)),\"\")","v":"Mfw21d3-410-M  M Dispatch"}]
[2,"MFW21D3 ","410","M  ","M Dispatch","Navy","8-40221-90140-9","C/O       ",9.5,null,{"v":85,"d":"$85.00"},{"v":170,"d":"$170.00"},{"v":169.95,"d":"$169.95"},0,"Mfw21d3-410-M  M Dispatch"," ",{"$f":"--ISNUMBER(IFERROR(SEARCH(Orders!$E18,O113,1),\"\"))","v":1},{"$f":"IF(Q113=1,COUNTIF($Q$2:Q113,1),\"\")","v":112},{"$f":"IFERROR(INDEX($O2:$O986,MATCH(ROWS($Q$2:Q113),$R2:$R986,0)),\"\")","v":"Mfw21d3-410-M  M Dispatch"}]
[2,"MFW21D3 ","410","M  ","M Dispatch","Navy","8-40221-90141-6","C/O       ",10,null,{"v":85,"d":"$85.00"},{"v":170,"d":"$170.00"},{"v":169.95,"d":"$169.95"},0,"Mfw21d3-410-M  M Dispatch"," ",{"$f":"--ISNUMBER(IFERROR(SEARCH(Orders!$E18,O114,1),\"\"))","v":1},{"$f":"IF(Q114=1,COUNTIF($Q$2:Q114,1),\"\")","v":113},{"$f":"IFERROR(INDEX($O2:$O986,MATCH(ROWS($Q$2:Q114),$R2:$R986,0)),\"\")","v":"Mfw21d3-410-M  M Dispatch"}]
[2,"MFW21D3 ","410","M  ","M Dispatch","Navy","8-40221-90142-3","C/O       ",10.5,null,{"v":85,"d":"$85.00"},{"v":170,"d":"$170.00"},{"v":169.95,"d":"$169.95"},0,"Mfw21d3-410-M  M Dispatch"," ",{"$f":"--ISNUMBER(IFERROR(SEARCH(Orders!$E18,O115,1),\"\"))","v":1},{"$f":"IF(Q115=1,COUNTIF($Q$2:Q115,1),\"\")","v":114},{"$f":"IFERROR(INDEX($O2:$O986,MATCH(ROWS($Q$2:Q115),$R2:$R986,0)),\"\")","v":"Mfw21d3-410-M  M Dispatch"}]
[2,"MFW21D3 ","410","M  ","M Dispatch","Navy","8-40221-90143-0","C/O       ",11,null,{"v":85,"d":"$85.00"},{"v":170,"d":"$170.00"},{"v":169.95,"d":"$169.95"},0,"Mfw21d3-410-M  M Dispatch"," ",{"$f":"--ISNUMBER(IFERROR(SEARCH(Orders!$E18,O116,1),\"\"))","v":1},{"$f":"IF(Q116=1,COUNTIF($Q$2:Q116,1),\"\")","v":115},{"$f":"IFERROR(INDEX($O2:$O986,MATCH(ROWS($Q$2:Q116),$R2:$R986,0)),\"\")","v":"Mfw21d3-410-M  M Dispatch"}]
[2,"MFW21D3 ","410","M  ","M Dispatch","Navy","8-40221-90144-7","C/O       ",11.5,null,{"v":85,"d":"$85.00"},{"v":170,"d":"$170.00"},{"v":169.95,"d":"$169.95"},0,"Mfw21d3-410-M  M Dispatch"," ",{"$f":"--ISNUMBER(IFERROR(SEARCH(Orders!$E18,O117,1),\"\"))","v":1},{"$f":"IF(Q117=1,COUNTIF($Q$2:Q117,1),\"\")","v":116},{"$f":"IFERROR(INDEX($O2:$O986,MATCH(ROWS($Q$2:Q117),$R2:$R986,0)),\"\")","v":"Mfw21d3-410-M  M Dispatch"}]
[2,"MFW21D3 ","410","M  ","M Dispatch","Navy","8-40221-90145-4","C/O       ",12,null,{"v":85,"d":"$85.00"},{"v":170,"d":"$170.00"},{"v":169.95,"d":"$169.95"},0,"Mfw21d3-410-M  M Dispatch"," ",{"$f":"--ISNUMBER(IFERROR(SEARCH(Orders!$E18,O118,1),\"\"))","v":1},{"$f":"IF(Q118=1,COUNTIF($Q$2:Q118,1),\"\")","v":117},{"$f":"IFERROR(INDEX($O2:$O986,MATCH(ROWS($Q$2:Q118),$R2:$R986,0)),\"\")","v":"Mfw21d3-410-M  M Dispatch"}]
[2,"MFW21D3 ","410","M  ","M Dispatch","Navy","8-40221-90146-1","C/O       ",12.5,null,{"v":85,"d":"$85.00"},{"v":170,"d":"$170.00"},{"v":169.95,"d":"$169.95"},0,"Mfw21d3-410-M  M Dispatch"," ",{"$f":"--ISNUMBER(IFERROR(SEARCH(Orders!$E18,O119,1),\"\"))","v":1},{"$f":"IF(Q119=1,COUNTIF($Q$2:Q119,1),\"\")","v":118},{"$f":"IFERROR(INDEX($O2:$O986,MATCH(ROWS($Q$2:Q119),$R2:$R986,0)),\"\")","v":"Mfw21d3-410-M  M Dispatch"}]
[2,"MFW21D3 ","410","M  ","M Dispatch","Navy","8-40221-90147-8","C/O       ",13,null,{"v":85,"d":"$85.00"},{"v":170,"d":"$170.00"},{"v":169.95,"d":"$169.95"},0,"Mfw21d3-410-M  M Dispatch"," ",{"$f":"--ISNUMBER(IFERROR(SEARCH(Orders!$E18,O120,1),\"\"))","v":1},{"$f":"IF(Q120=1,COUNTIF($Q$2:Q120,1),\"\")","v":119},{"$f":"IFERROR(INDEX($O2:$O986,MATCH(ROWS($Q$2:Q120),$R2:$R986,0)),\"\")","v":"Mfw21d3-410-M  M Dispatch"}]
[2,"MFW21D3 ","410","M  ","M Dispatch","Navy","8-40221-90148-5","C/O       ",14,null,{"v":85,"d":"$85.00"},{"v":170,"d":"$170.00"},{"v":169.95,"d":"$169.95"},0,"Mfw21d3-410-M  M Dispatch"," ",{"$f":"--ISNUMBER(IFERROR(SEARCH(Orders!$E18,O121,1),\"\"))","v":1},{"$f":"IF(Q121=1,COUNTIF($Q$2:Q121,1),\"\")","v":120},{"$f":"IFERROR(INDEX($O2:$O986,MATCH(ROWS($Q$2:Q121),$R2:$R986,0)),\"\")","v":"Mfw21d3-410-M  M Dispatch"}]
[14,"MFW21MC1","001","M  ","M Mason Chukka","Black","8-40221-90193-5","C/O       ",8,null,{"v":65,"d":"$65.00"},{"v":130,"d":"$130.00"},{"v":129.95,"d":"$129.95"},0,"Mfw21mc1-001-M  M Mason Chukka"," ",{"$f":"--ISNUMBER(IFERROR(SEARCH(Orders!$E18,O122,1),\"\"))","v":1},{"$f":"IF(Q122=1,COUNTIF($Q$2:Q122,1),\"\")","v":121},{"$f":"IFERROR(INDEX($O2:$O986,MATCH(ROWS($Q$2:Q122),$R2:$R986,0)),\"\")","v":"Mfw21mc1-001-M  M Mason Chukka"}]
[14,"MFW21MC1","001","M  ","M Mason Chukka","Black","8-40221-90194-2","C/O       ",8.5,null,{"v":65,"d":"$65.00"},{"v":130,"d":"$130.00"},{"v":129.95,"d":"$129.95"},0,"Mfw21mc1-001-M  M Mason Chukka"," ",{"$f":"--ISNUMBER(IFERROR(SEARCH(Orders!$E18,O123,1),\"\"))","v":1},{"$f":"IF(Q123=1,COUNTIF($Q$2:Q123,1),\"\")","v":122},{"$f":"IFERROR(INDEX($O2:$O986,MATCH(ROWS($Q$2:Q123),$R2:$R986,0)),\"\")","v":"Mfw21mc1-001-M  M Mason Chukka"}]
[14,"MFW21MC1","001","M  ","M Mason Chukka","Black","8-40221-90195-9","C/O       ",9,null,{"v":65,"d":"$65.00"},{"v":130,"d":"$130.00"},{"v":129.95,"d":"$129.95"},0,"Mfw21mc1-001-M  M Mason Chukka"," ",{"$f":"--ISNUMBER(IFERROR(SEARCH(Orders!$E18,O124,1),\"\"))","v":1},{"$f":"IF(Q124=1,COUNTIF($Q$2:Q124,1),\"\")","v":123},{"$f":"IFERROR(INDEX($O2:$O986,MATCH(ROWS($Q$2:Q124),$R2:$R986,0)),\"\")","v":"Mfw21mc1-001-M  M Mason Chukka"}]
[14,"MFW21MC1","001","M  ","M Mason Chukka","Black","8-40221-90196-6","C/O       ",9.5,null,{"v":65,"d":"$65.00"},{"v":130,"d":"$130.00"},{"v":129.95,"d":"$129.95"},0,"Mfw21mc1-001-M  M Mason Chukka"," ",{"$f":"--ISNUMBER(IFERROR(SEARCH(Orders!$E18,O125,1),\"\"))","v":1},{"$f":"IF(Q125=1,COUNTIF($Q$2:Q125,1),\"\")","v":124},{"$f":"IFERROR(INDEX($O2:$O986,MATCH(ROWS($Q$2:Q125),$R2:$R986,0)),\"\")","v":"Mfw21mc1-001-M  M Mason Chukka"}]
[14,"MFW21MC1","001","M  ","M Mason Chukka","Black","8-40221-90197-3","C/O       ",10,null,{"v":65,"d":"$65.00"},{"v":130,"d":"$130.00"},{"v":129.95,"d":"$129.95"},0,"Mfw21mc1-001-M  M Mason Chukka"," ",{"$f":"--ISNUMBER(IFERROR(SEARCH(Orders!$E18,O126,1),\"\"))","v":1},{"$f":"IF(Q126=1,COUNTIF($Q$2:Q126,1),\"\")","v":125},{"$f":"IFERROR(INDEX($O2:$O986,MATCH(ROWS($Q$2:Q126),$R2:$R986,0)),\"\")","v":"Mfw21mc1-001-M  M Mason Chukka"}]
[14,"MFW21MC1","001","M  ","M Mason Chukka","Black","8-40221-90198-0","C/O       ",10.5,null,{"v":65,"d":"$65.00"},{"v":130,"d":"$130.00"},{"v":129.95,"d":"$129.95"},0,"Mfw21mc1-001-M  M Mason Chukka"," ",{"$f":"--ISNUMBER(IFERROR(SEARCH(Orders!$E18,O127,1),\"\"))","v":1},{"$f":"IF(Q127=1,COUNTIF($Q$2:Q127,1),\"\")","v":126},{"$f":"IFERROR(INDEX($O2:$O986,MATCH(ROWS($Q$2:Q127),$R2:$R986,0)),\"\")","v":"Mfw21mc1-001-M  M Mason Chukka"}]
[14,"MFW21MC1","001","M  ","M Mason Chukka","Black","8-40221-90199-7","C/O       ",11,null,{"v":65,"d":"$65.00"},{"v":130,"d":"$130.00"},{"v":129.95,"d":"$129.95"},0,"Mfw21mc1-001-M  M Mason Chukka"," ",{"$f":"--ISNUMBER(IFERROR(SEARCH(Orders!$E18,O128,1),\"\"))","v":1},{"$f":"IF(Q128=1,COUNTIF($Q$2:Q128,1),\"\")","v":127},{"$f":"IFERROR(INDEX($O2:$O986,MATCH(ROWS($Q$2:Q128),$R2:$R986,0)),\"\")","v":"Mfw21mc1-001-M  M Mason Chukka"}]
[14,"MFW21MC1","001","M  ","M Mason Chukka","Black","8-40221-90200-0","C/O       ",11.5,null,{"v":65,"d":"$65.00"},{"v":130,"d":"$130.00"},{"v":129.95,"d":"$129.95"},0,"Mfw21mc1-001-M  M Mason Chukka"," ",{"$f":"--ISNUMBER(IFERROR(SEARCH(Orders!$E18,O129,1),\"\"))","v":1},{"$f":"IF(Q129=1,COUNTIF($Q$2:Q129,1),\"\")","v":128},{"$f":"IFERROR(INDEX($O2:$O986,MATCH(ROWS($Q$2:Q129),$R2:$R986,0)),\"\")","v":"Mfw21mc1-001-M  M Mason Chukka"}]
[14,"MFW21MC1","001","M  ","M Mason Chukka","Black","8-40221-90201-7","C/O       ",12,null,{"v":65,"d":"$65.00"},{"v":130,"d":"$130.00"},{"v":129.95,"d":"$129.95"},{"$f":"J130*K130","v":0},"Mfw21mc1-001-M  M Mason Chukka"," ",{"$f":"--ISNUMBER(IFERROR(SEARCH(Orders!$E18,O130,1),\"\"))","v":1},{"$f":"IF(Q130=1,COUNTIF($Q$2:Q130,1),\"\")","v":129},{"$f":"IFERROR(INDEX($O2:$O986,MATCH(ROWS($Q$2:Q130),$R2:$R986,0)),\"\")","v":"Mfw21mc1-001-M  M Mason Chukka"}]
[14,"MFW21MC1","001","M  ","M Mason Chukka","Black","8-40221-90202-4","C/O       ",12.5,null,{"v":65,"d":"$65.00"},{"v":130,"d":"$130.00"},{"v":129.95,"d":"$129.95"},0,"Mfw21mc1-001-M  M Mason Chukka"," ",{"$f":"--ISNUMBER(IFERROR(SEARCH(Orders!$E18,O131,1),\"\"))","v":1},{"$f":"IF(Q131=1,COUNTIF($Q$2:Q131,1),\"\")","v":130},{"$f":"IFERROR(INDEX($O2:$O986,MATCH(ROWS($Q$2:Q131),$R2:$R986,0)),\"\")","v":"Mfw21mc1-001-M  M Mason Chukka"}]
[14,"MFW21MC1","001","M  ","M Mason Chukka","Black","8-40221-90203-1","C/O       ",13,null,{"v":65,"d":"$65.00"},{"v":130,"d":"$130.00"},{"v":129.95,"d":"$129.95"},0,"Mfw21mc1-001-M  M Mason Chukka"," ",{"$f":"--ISNUMBER(IFERROR(SEARCH(Orders!$E18,O132,1),\"\"))","v":1},{"$f":"IF(Q132=1,COUNTIF($Q$2:Q132,1),\"\")","v":131},{"$f":"IFERROR(INDEX($O2:$O986,MATCH(ROWS($Q$2:Q132),$R2:$R986,0)),\"\")","v":"Mfw21mc1-001-M  M Mason Chukka"}]
[14,"MFW21MC1","001","M  ","M Mason Chukka","Black","8-40221-90204-8","C/O       ",14,null,{"v":65,"d":"$65.00"},{"v":130,"d":"$130.00"},{"v":129.95,"d":"$129.95"},0,"Mfw21mc1-001-M  M Mason Chukka"," ",{"$f":"--ISNUMBER(IFERROR(SEARCH(Orders!$E18,O133,1),\"\"))","v":1},{"$f":"IF(Q133=1,COUNTIF($Q$2:Q133,1),\"\")","v":132},{"$f":"IFERROR(INDEX($O2:$O986,MATCH(ROWS($Q$2:Q133),$R2:$R986,0)),\"\")","v":"Mfw21mc1-001-M  M Mason Chukka"}]
[14,"MFW21MC2","201","M  ","M Mason Chukka","Dark Brown","8-40221-90207-9","C/O       ",8,null,{"v":65,"d":"$65.00"},{"v":130,"d":"$130.00"},{"v":129.95,"d":"$129.95"},0,"Mfw21mc2-201-M  M Mason Chukka"," ",{"$f":"--ISNUMBER(IFERROR(SEARCH(Orders!$E18,O134,1),\"\"))","v":1},{"$f":"IF(Q134=1,COUNTIF($Q$2:Q134,1),\"\")","v":133},{"$f":"IFERROR(INDEX($O2:$O986,MATCH(ROWS($Q$2:Q134),$R2:$R986,0)),\"\")","v":"Mfw21mc2-201-M  M Mason Chukka"}]
[14,"MFW21MC2","201","M  ","M Mason Chukka","Dark Brown","8-40221-90208-6","C/O       ",8.5,null,{"v":65,"d":"$65.00"},{"v":130,"d":"$130.00"},{"v":129.95,"d":"$129.95"},0,"Mfw21mc2-201-M  M Mason Chukka"," ",{"$f":"--ISNUMBER(IFERROR(SEARCH(Orders!$E18,O135,1),\"\"))","v":1},{"$f":"IF(Q135=1,COUNTIF($Q$2:Q135,1),\"\")","v":134},{"$f":"IFERROR(INDEX($O2:$O986,MATCH(ROWS($Q$2:Q135),$R2:$R986,0)),\"\")","v":"Mfw21mc2-201-M  M Mason Chukka"}]
[14,"MFW21MC2","201","M  ","M Mason Chukka","Dark Brown","8-40221-90209-3","C/O       ",9,null,{"v":65,"d":"$65.00"},{"v":130,"d":"$130.00"},{"v":129.95,"d":"$129.95"},0,"Mfw21mc2-201-M  M Mason Chukka"," ",{"$f":"--ISNUMBER(IFERROR(SEARCH(Orders!$E18,O136,1),\"\"))","v":1},{"$f":"IF(Q136=1,COUNTIF($Q$2:Q136,1),\"\")","v":135},{"$f":"IFERROR(INDEX($O2:$O986,MATCH(ROWS($Q$2:Q136),$R2:$R986,0)),\"\")","v":"Mfw21mc2-201-M  M Mason Chukka"}]
[14,"MFW21MC2","201","M  ","M Mason Chukka","Dark Brown","8-40221-90210-9","C/O       ",9.5,null,{"v":65,"d":"$65.00"},{"v":130,"d":"$130.00"},{"v":129.95,"d":"$129.95"},0,"Mfw21mc2-201-M  M Mason Chukka"," ",{"$f":"--ISNUMBER(IFERROR(SEARCH(Orders!$E18,O137,1),\"\"))","v":1},{"$f":"IF(Q137=1,COUNTIF($Q$2:Q137,1),\"\")","v":136},{"$f":"IFERROR(INDEX($O2:$O986,MATCH(ROWS($Q$2:Q137),$R2:$R986,0)),\"\")","v":"Mfw21mc2-201-M  M Mason Chukka"}]
[14,"MFW21MC2","201","M  ","M Mason Chukka","Dark Brown","8-40221-90211-6","C/O       ",10,null,{"v":65,"d":"$65.00"},{"v":130,"d":"$130.00"},{"v":129.95,"d":"$129.95"},0,"Mfw21mc2-201-M  M Mason Chukka"," ",{"$f":"--ISNUMBER(IFERROR(SEARCH(Orders!$E18,O138,1),\"\"))","v":1},{"$f":"IF(Q138=1,COUNTIF($Q$2:Q138,1),\"\")","v":137},{"$f":"IFERROR(INDEX($O2:$O986,MATCH(ROWS($Q$2:Q138),$R2:$R986,0)),\"\")","v":"Mfw21mc2-201-M  M Mason Chukka"}]
[14,"MFW21MC2","201","M  ","M Mason Chukka","Dark Brown","8-40221-90212-3","C/O       ",10.5,null,{"v":65,"d":"$65.00"},{"v":130,"d":"$130.00"},{"v":129.95,"d":"$129.95"},0,"Mfw21mc2-201-M  M Mason Chukka"," ",{"$f":"--ISNUMBER(IFERROR(SEARCH(Orders!$E18,O139,1),\"\"))","v":1},{"$f":"IF(Q139=1,COUNTIF($Q$2:Q139,1),\"\")","v":138},{"$f":"IFERROR(INDEX($O2:$O986,MATCH(ROWS($Q$2:Q139),$R2:$R986,0)),\"\")","v":"Mfw21mc2-201-M  M Mason Chukka"}]
[14,"MFW21MC2","201","M  ","M Mason Chukka","Dark Brown","8-40221-90213-0","C/O       ",11,null,{"v":65,"d":"$65.00"},{"v":130,"d":"$130.00"},{"v":129.95,"d":"$129.95"},0,"Mfw21mc2-201-M  M Mason Chukka"," ",{"$f":"--ISNUMBER(IFERROR(SEARCH(Orders!$E18,O140,1),\"\"))","v":1},{"$f":"IF(Q140=1,COUNTIF($Q$2:Q140,1),\"\")","v":139},{"$f":"IFERROR(INDEX($O2:$O986,MATCH(ROWS($Q$2:Q140),$R2:$R986,0)),\"\")","v":"Mfw21mc2-201-M  M Mason Chukka"}]
[14,"MFW21MC2","201","M  ","M Mason Chukka","Dark Brown","8-40221-90214-7","C/O       ",11.5,null,{"v":65,"d":"$65.00"},{"v":130,"d":"$130.00"},{"v":129.95,"d":"$129.95"},0,"Mfw21mc2-201-M  M Mason Chukka"," ",{"$f":"--ISNUMBER(IFERROR(SEARCH(Orders!$E18,O141,1),\"\"))","v":1},{"$f":"IF(Q141=1,COUNTIF($Q$2:Q141,1),\"\")","v":140},{"$f":"IFERROR(INDEX($O2:$O986,MATCH(ROWS($Q$2:Q141),$R2:$R986,0)),\"\")","v":"Mfw21mc2-201-M  M Mason Chukka"}]
[14,"MFW21MC2","201","M  ","M Mason Chukka","Dark Brown","8-40221-90215-4","C/O       ",12,null,{"v":65,"d":"$65.00"},{"v":130,"d":"$130.00"},{"v":129.95,"d":"$129.95"},0,"Mfw21mc2-201-M  M Mason Chukka"," ",{"$f":"--ISNUMBER(IFERROR(SEARCH(Orders!$E18,O142,1),\"\"))","v":1},{"$f":"IF(Q142=1,COUNTIF($Q$2:Q142,1),\"\")","v":141},{"$f":"IFERROR(INDEX($O2:$O986,MATCH(ROWS($Q$2:Q142),$R2:$R986,0)),\"\")","v":"Mfw21mc2-201-M  M Mason Chukka"}]
[14,"MFW21MC2","201","M  ","M Mason Chukka","Dark Brown","8-40221-90216-1","C/O       ",12.5,null,{"v":65,"d":"$65.00"},{"v":130,"d":"$130.00"},{"v":129.95,"d":"$129.95"},0,"Mfw21mc2-201-M  M Mason Chukka"," ",{"$f":"--ISNUMBER(IFERROR(SEARCH(Orders!$E18,O143,1),\"\"))","v":1},{"$f":"IF(Q143=1,COUNTIF($Q$2:Q143,1),\"\")","v":142},{"$f":"IFERROR(INDEX($O2:$O986,MATCH(ROWS($Q$2:Q143),$R2:$R986,0)),\"\")","v":"Mfw21mc2-201-M  M Mason Chukka"}]
[14,"MFW21MC2","201","M  ","M Mason Chukka","Dark Brown","8-40221-90217-8","C/O       ",13,null,{"v":65,"d":"$65.00"},{"v":130,"d":"$130.00"},{"v":129.95,"d":"$129.95"},0,"Mfw21mc2-201-M  M Mason Chukka"," ",{"$f":"--ISNUMBER(IFERROR(SEARCH(Orders!$E18,O144,1),\"\"))","v":1},{"$f":"IF(Q144=1,COUNTIF($Q$2:Q144,1),\"\")","v":143},{"$f":"IFERROR(INDEX($O2:$O986,MATCH(ROWS($Q$2:Q144),$R2:$R986,0)),\"\")","v":"Mfw21mc2-201-M  M Mason Chukka"}]
[14,"MFW21MC2","201","M  ","M Mason Chukka","Dark Brown","8-40221-90218-5","C/O       ",14,null,{"v":65,"d":"$65.00"},{"v":130,"d":"$130.00"},{"v":129.95,"d":"$129.95"},0,"Mfw21mc2-201-M  M Mason Chukka"," ",{"$f":"--ISNUMBER(IFERROR(SEARCH(Orders!$E18,O145,1),\"\"))","v":1},{"$f":"IF(Q145=1,COUNTIF($Q$2:Q145,1),\"\")","v":144},{"$f":"IFERROR(INDEX($O2:$O986,MATCH(ROWS($Q$2:Q145),$R2:$R986,0)),\"\")","v":"Mfw21mc2-201-M  M Mason Chukka"}]
[13,"MFW21MM1","001","M  ","M Mason Mid","Black","8-40221-90151-5","C/O       ",8,null,{"v":82.5,"d":"$82.50"},{"v":165,"d":"$165.00"},{"v":164.95,"d":"$164.95"},0,"Mfw21mm1-001-M  M Mason Mid"," ",{"$f":"--ISNUMBER(IFERROR(SEARCH(Orders!$E18,O146,1),\"\"))","v":1},{"$f":"IF(Q146=1,COUNTIF($Q$2:Q146,1),\"\")","v":145},{"$f":"IFERROR(INDEX($O2:$O986,MATCH(ROWS($Q$2:Q146),$R2:$R986,0)),\"\")","v":"Mfw21mm1-001-M  M Mason Mid"}]
[13,"MFW21MM1","001","M  ","M Mason Mid","Black","8-40221-90152-2","C/O       ",8.5,null,{"v":82.5,"d":"$82.50"},{"v":165,"d":"$165.00"},{"v":164.95,"d":"$164.95"},0,"Mfw21mm1-001-M  M Mason Mid"," ",{"$f":"--ISNUMBER(IFERROR(SEARCH(Orders!$E18,O147,1),\"\"))","v":1},{"$f":"IF(Q147=1,COUNTIF($Q$2:Q147,1),\"\")","v":146},{"$f":"IFERROR(INDEX($O2:$O986,MATCH(ROWS($Q$2:Q147),$R2:$R986,0)),\"\")","v":"Mfw21mm1-001-M  M Mason Mid"}]
[13,"MFW21MM1","001","M  ","M Mason Mid","Black","8-40221-90153-9","C/O       ",9,null,{"v":82.5,"d":"$82.50"},{"v":165,"d":"$165.00"},{"v":164.95,"d":"$164.95"},0,"Mfw21mm1-001-M  M Mason Mid"," ",{"$f":"--ISNUMBER(IFERROR(SEARCH(Orders!$E18,O148,1),\"\"))","v":1},{"$f":"IF(Q148=1,COUNTIF($Q$2:Q148,1),\"\")","v":147},{"$f":"IFERROR(INDEX($O2:$O986,MATCH(ROWS($Q$2:Q148),$R2:$R986,0)),\"\")","v":"Mfw21mm1-001-M  M Mason Mid"}]
[13,"MFW21MM1","001","M  ","M Mason Mid","Black","8-40221-90154-6","C/O       ",9.5,null,{"v":82.5,"d":"$82.50"},{"v":165,"d":"$165.00"},{"v":164.95,"d":"$164.95"},0,"Mfw21mm1-001-M  M Mason Mid"," ",{"$f":"--ISNUMBER(IFERROR(SEARCH(Orders!$E18,O149,1),\"\"))","v":1},{"$f":"IF(Q149=1,COUNTIF($Q$2:Q149,1),\"\")","v":148},{"$f":"IFERROR(INDEX($O2:$O986,MATCH(ROWS($Q$2:Q149),$R2:$R986,0)),\"\")","v":"Mfw21mm1-001-M  M Mason Mid"}]
[13,"MFW21MM1","001","M  ","M Mason Mid","Black","8-40221-90155-3","C/O       ",10,null,{"v":82.5,"d":"$82.50"},{"v":165,"d":"$165.00"},{"v":164.95,"d":"$164.95"},0,"Mfw21mm1-001-M  M Mason Mid"," ",{"$f":"--ISNUMBER(IFERROR(SEARCH(Orders!$E18,O150,1),\"\"))","v":1},{"$f":"IF(Q150=1,COUNTIF($Q$2:Q150,1),\"\")","v":149},{"$f":"IFERROR(INDEX($O2:$O986,MATCH(ROWS($Q$2:Q150),$R2:$R986,0)),\"\")","v":"Mfw21mm1-001-M  M Mason Mid"}]
[13,"MFW21MM1","001","M  ","M Mason Mid","Black","8-40221-90156-0","C/O       ",10.5,null,{"v":82.5,"d":"$82.50"},{"v":165,"d":"$165.00"},{"v":164.95,"d":"$164.95"},0,"Mfw21mm1-001-M  M Mason Mid"," ",{"$f":"--ISNUMBER(IFERROR(SEARCH(Orders!$E18,O151,1),\"\"))","v":1},{"$f":"IF(Q151=1,COUNTIF($Q$2:Q151,1),\"\")","v":150},{"$f":"IFERROR(INDEX($O2:$O986,MATCH(ROWS($Q$2:Q151),$R2:$R986,0)),\"\")","v":"Mfw21mm1-001-M  M Mason Mid"}]
[13,"MFW21MM1","001","M  ","M Mason Mid","Black","8-40221-90157-7","C/O       ",11,null,{"v":82.5,"d":"$82.50"},{"v":165,"d":"$165.00"},{"v":164.95,"d":"$164.95"},0,"Mfw21mm1-001-M  M Mason Mid"," ",{"$f":"--ISNUMBER(IFERROR(SEARCH(Orders!$E18,O152,1),\"\"))","v":1},{"$f":"IF(Q152=1,COUNTIF($Q$2:Q152,1),\"\")","v":151},{"$f":"IFERROR(INDEX($O2:$O986,MATCH(ROWS($Q$2:Q152),$R2:$R986,0)),\"\")","v":"Mfw21mm1-001-M  M Mason Mid"}]
[13,"MFW21MM1","001","M  ","M Mason Mid","Black","8-40221-90158-4","C/O       ",11.5,null,{"v":82.5,"d":"$82.50"},{"v":165,"d":"$165.00"},{"v":164.95,"d":"$164.95"},0,"Mfw21mm1-001-M  M Mason Mid"," ",{"$f":"--ISNUMBER(IFERROR(SEARCH(Orders!$E18,O153,1),\"\"))","v":1},{"$f":"IF(Q153=1,COUNTIF($Q$2:Q153,1),\"\")","v":152},{"$f":"IFERROR(INDEX($O2:$O986,MATCH(ROWS($Q$2:Q153),$R2:$R986,0)),\"\")","v":"Mfw21mm1-001-M  M Mason Mid"}]
[13,"MFW21MM1","001","M  ","M Mason Mid","Black","8-40221-90159-1","C/O       ",12,null,{"v":82.5,"d":"$82.50"},{"v":165,"d":"$165.00"},{"v":164.95,"d":"$164.95"},0,"Mfw21mm1-001-M  M Mason Mid"," ",{"$f":"--ISNUMBER(IFERROR(SEARCH(Orders!$E18,O154,1),\"\"))","v":1},{"$f":"IF(Q154=1,COUNTIF($Q$2:Q154,1),\"\")","v":153},{"$f":"IFERROR(INDEX($O2:$O986,MATCH(ROWS($Q$2:Q154),$R2:$R986,0)),\"\")","v":"Mfw21mm1-001-M  M Mason Mid"}]
[13,"MFW21MM1","001","M  ","M Mason Mid","Black","8-40221-90160-7","C/O       ",12.5,null,{"v":82.5,"d":"$82.50"},{"v":165,"d":"$165.00"},{"v":164.95,"d":"$164.95"},0,"Mfw21mm1-001-M  M Mason Mid"," ",{"$f":"--ISNUMBER(IFERROR(SEARCH(Orders!$E18,O155,1),\"\"))","v":1},{"$f":"IF(Q155=1,COUNTIF($Q$2:Q155,1),\"\")","v":154},{"$f":"IFERROR(INDEX($O2:$O986,MATCH(ROWS($Q$2:Q155),$R2:$R986,0)),\"\")","v":"Mfw21mm1-001-M  M Mason Mid"}]
[13,"MFW21MM1","001","M  ","M Mason Mid","Black","8-40221-90161-4","C/O       ",13,null,{"v":82.5,"d":"$82.50"},{"v":165,"d":"$165.00"},{"v":164.95,"d":"$164.95"},0,"Mfw21mm1-001-M  M Mason Mid"," ",{"$f":"--ISNUMBER(IFERROR(SEARCH(Orders!$E18,O156,1),\"\"))","v":1},{"$f":"IF(Q156=1,COUNTIF($Q$2:Q156,1),\"\")","v":155},{"$f":"IFERROR(INDEX($O2:$O986,MATCH(ROWS($Q$2:Q156),$R2:$R986,0)),\"\")","v":"Mfw21mm1-001-M  M Mason Mid"}]
[13,"MFW21MM1","001","M  ","M Mason Mid","Black","8-40221-90162-1","C/O       ",14,null,{"v":82.5,"d":"$82.50"},{"v":165,"d":"$165.00"},{"v":164.95,"d":"$164.95"},0,"Mfw21mm1-001-M  M Mason Mid"," ",{"$f":"--ISNUMBER(IFERROR(SEARCH(Orders!$E18,O157,1),\"\"))","v":1},{"$f":"IF(Q157=1,COUNTIF($Q$2:Q157,1),\"\")","v":156},{"$f":"IFERROR(INDEX($O2:$O986,MATCH(ROWS($Q$2:Q157),$R2:$R986,0)),\"\")","v":"Mfw21mm1-001-M  M Mason Mid"}]
[10,"MSS18RL2","302","M  ","M Range Low","Olive Mlti","7-54697-65732-9","C/O       ",8,null,{"v":77.5,"d":"$77.50"},{"v":155,"d":"$155.00"},{"v":154.95,"d":"$154.95"},0,"Mss18rl2-302-M  M Range Low"," ",{"$f":"--ISNUMBER(IFERROR(SEARCH(Orders!$E18,O158,1),\"\"))","v":1},{"$f":"IF(Q158=1,COUNTIF($Q$2:Q158,1),\"\")","v":157},{"$f":"IFERROR(INDEX($O2:$O986,MATCH(ROWS($Q$2:Q158),$R2:$R986,0)),\"\")","v":"Mss18rl2-302-M  M Range Low"}]
[10,"MSS18RL2","302","M  ","M Range Low","Olive Mlti","7-54697-65733-6","C/O       ",8.5,null,{"v":77.5,"d":"$77.50"},{"v":155,"d":"$155.00"},{"v":154.95,"d":"$154.95"},0,"Mss18rl2-302-M  M Range Low"," ",{"$f":"--ISNUMBER(IFERROR(SEARCH(Orders!$E18,O159,1),\"\"))","v":1},{"$f":"IF(Q159=1,COUNTIF($Q$2:Q159,1),\"\")","v":158},{"$f":"IFERROR(INDEX($O2:$O986,MATCH(ROWS($Q$2:Q159),$R2:$R986,0)),\"\")","v":"Mss18rl2-302-M  M Range Low"}]
[10,"MSS18RL2","302","M  ","M Range Low","Olive Mlti","7-54697-65734-3","C/O       ",9,null,{"v":77.5,"d":"$77.50"},{"v":155,"d":"$155.00"},{"v":154.95,"d":"$154.95"},0,"Mss18rl2-302-M  M Range Low"," ",{"$f":"--ISNUMBER(IFERROR(SEARCH(Orders!$E18,O160,1),\"\"))","v":1},{"$f":"IF(Q160=1,COUNTIF($Q$2:Q160,1),\"\")","v":159},{"$f":"IFERROR(INDEX($O2:$O986,MATCH(ROWS($Q$2:Q160),$R2:$R986,0)),\"\")","v":"Mss18rl2-302-M  M Range Low"}]
[10,"MSS18RL2","302","M  ","M Range Low","Olive Mlti","7-54697-65735-0","C/O       ",9.5,null,{"v":77.5,"d":"$77.50"},{"v":155,"d":"$155.00"},{"v":154.95,"d":"$154.95"},0,"Mss18rl2-302-M  M Range Low"," ",{"$f":"--ISNUMBER(IFERROR(SEARCH(Orders!$E18,O161,1),\"\"))","v":1},{"$f":"IF(Q161=1,COUNTIF($Q$2:Q161,1),\"\")","v":160},{"$f":"IFERROR(INDEX($O2:$O986,MATCH(ROWS($Q$2:Q161),$R2:$R986,0)),\"\")","v":"Mss18rl2-302-M  M Range Low"}]
[10,"MSS18RL2","302","M  ","M Range Low","Olive Mlti","7-54697-65736-7","C/O       ",10,null,{"v":77.5,"d":"$77.50"},{"v":155,"d":"$155.00"},{"v":154.95,"d":"$154.95"},0,"Mss18rl2-302-M  M Range Low"," ",{"$f":"--ISNUMBER(IFERROR(SEARCH(Orders!$E18,O162,1),\"\"))","v":1},{"$f":"IF(Q162=1,COUNTIF($Q$2:Q162,1),\"\")","v":161},{"$f":"IFERROR(INDEX($O2:$O986,MATCH(ROWS($Q$2:Q162),$R2:$R986,0)),\"\")","v":"Mss18rl2-302-M  M Range Low"}]
[10,"MSS18RL2","302","M  ","M Range Low","Olive Mlti","7-54697-65737-4","C/O       ",10.5,null,{"v":77.5,"d":"$77.50"},{"v":155,"d":"$155.00"},{"v":154.95,"d":"$154.95"},0,"Mss18rl2-302-M  M Range Low"," ",{"$f":"--ISNUMBER(IFERROR(SEARCH(Orders!$E18,O163,1),\"\"))","v":1},{"$f":"IF(Q163=1,COUNTIF($Q$2:Q163,1),\"\")","v":162},{"$f":"IFERROR(INDEX($O2:$O986,MATCH(ROWS($Q$2:Q163),$R2:$R986,0)),\"\")","v":"Mss18rl2-302-M  M Range Low"}]
[10,"MSS18RL2","302","M  ","M Range Low","Olive Mlti","7-54697-65738-1","C/O       ",11,null,{"v":77.5,"d":"$77.50"},{"v":155,"d":"$155.00"},{"v":154.95,"d":"$154.95"},0,"Mss18rl2-302-M  M Range Low"," ",{"$f":"--ISNUMBER(IFERROR(SEARCH(Orders!$E18,O164,1),\"\"))","v":1},{"$f":"IF(Q164=1,COUNTIF($Q$2:Q164,1),\"\")","v":163},{"$f":"IFERROR(INDEX($O2:$O986,MATCH(ROWS($Q$2:Q164),$R2:$R986,0)),\"\")","v":"Mss18rl2-302-M  M Range Low"}]
[10,"MSS18RL2","302","M  ","M Range Low","Olive Mlti","7-54697-65739-8","C/O       ",11.5,null,{"v":77.5,"d":"$77.50"},{"v":155,"d":"$155.00"},{"v":154.95,"d":"$154.95"},0,"Mss18rl2-302-M  M Range Low"," ",{"$f":"--ISNUMBER(IFERROR(SEARCH(Orders!$E18,O165,1),\"\"))","v":1},{"$f":"IF(Q165=1,COUNTIF($Q$2:Q165,1),\"\")","v":164},{"$f":"IFERROR(INDEX($O2:$O986,MATCH(ROWS($Q$2:Q165),$R2:$R986,0)),\"\")","v":"Mss18rl2-302-M  M Range Low"}]
[10,"MSS18RL2","302","M  ","M Range Low","Olive Mlti","7-54697-65740-4","C/O       ",12,null,{"v":77.5,"d":"$77.50"},{"v":155,"d":"$155.00"},{"v":154.95,"d":"$154.95"},0,"Mss18rl2-302-M  M Range Low"," ",{"$f":"--ISNUMBER(IFERROR(SEARCH(Orders!$E18,O166,1),\"\"))","v":1},{"$f":"IF(Q166=1,COUNTIF($Q$2:Q166,1),\"\")","v":165},{"$f":"IFERROR(INDEX($O2:$O986,MATCH(ROWS($Q$2:Q166),$R2:$R986,0)),\"\")","v":"Mss18rl2-302-M  M Range Low"}]
[10,"MSS18RL2","302","M  ","M Range Low","Olive Mlti","7-54697-65741-1","C/O       ",12.5,null,{"v":77.5,"d":"$77.50"},{"v":155,"d":"$155.00"},{"v":154.95,"d":"$154.95"},0,"Mss18rl2-302-M  M Range Low"," ",{"$f":"--ISNUMBER(IFERROR(SEARCH(Orders!$E18,O167,1),\"\"))","v":1},{"$f":"IF(Q167=1,COUNTIF($Q$2:Q167,1),\"\")","v":166},{"$f":"IFERROR(INDEX($O2:$O986,MATCH(ROWS($Q$2:Q167),$R2:$R986,0)),\"\")","v":"Mss18rl2-302-M  M Range Low"}]
[10,"MSS18RL2","302","M  ","M Range Low","Olive Mlti","7-54697-65742-8","C/O       ",13,null,{"v":77.5,"d":"$77.50"},{"v":155,"d":"$155.00"},{"v":154.95,"d":"$154.95"},0,"Mss18rl2-302-M  M Range Low"," ",{"$f":"--ISNUMBER(IFERROR(SEARCH(Orders!$E18,O168,1),\"\"))","v":1},{"$f":"IF(Q168=1,COUNTIF($Q$2:Q168,1),\"\")","v":167},{"$f":"IFERROR(INDEX($O2:$O986,MATCH(ROWS($Q$2:Q168),$R2:$R986,0)),\"\")","v":"Mss18rl2-302-M  M Range Low"}]
[10,"MSS18RL2","302","M  ","M Range Low","Olive Mlti","7-54697-65743-5","C/O       ",14,null,{"v":77.5,"d":"$77.50"},{"v":155,"d":"$155.00"},{"v":154.95,"d":"$154.95"},0,"Mss18rl2-302-M  M Range Low"," ",{"$f":"--ISNUMBER(IFERROR(SEARCH(Orders!$E18,O169,1),\"\"))","v":1},{"$f":"IF(Q169=1,COUNTIF($Q$2:Q169,1),\"\")","v":168},{"$f":"IFERROR(INDEX($O2:$O986,MATCH(ROWS($Q$2:Q169),$R2:$R986,0)),\"\")","v":"Mss18rl2-302-M  M Range Low"}]
[8,"MSS21B1 ","492","M  ","M Banks Low Top","Navy Multi","8-40221-90000-6","C/O       ",8,null,{"v":65,"d":"$65.00"},{"v":130,"d":"$130.00"},{"v":129.95,"d":"$129.95"},0,"Mss21b1-492-M  M Banks Low Top"," ",{"$f":"--ISNUMBER(IFERROR(SEARCH(Orders!$E18,O170,1),\"\"))","v":1},{"$f":"IF(Q170=1,COUNTIF($Q$2:Q170,1),\"\")","v":169},{"$f":"IFERROR(INDEX($O2:$O986,MATCH(ROWS($Q$2:Q170),$R2:$R986,0)),\"\")","v":"Mss21b1-492-M  M Banks Low Top"}]
[8,"MSS21B1 ","492","M  ","M Banks Low Top","Navy Multi","8-40221-90001-3","C/O       ",8.5,null,{"v":65,"d":"$65.00"},{"v":130,"d":"$130.00"},{"v":129.95,"d":"$129.95"},0,"Mss21b1-492-M  M Banks Low Top"," ",{"$f":"--ISNUMBER(IFERROR(SEARCH(Orders!$E18,O171,1),\"\"))","v":1},{"$f":"IF(Q171=1,COUNTIF($Q$2:Q171,1),\"\")","v":170},{"$f":"IFERROR(INDEX($O2:$O986,MATCH(ROWS($Q$2:Q171),$R2:$R986,0)),\"\")","v":"Mss21b1-492-M  M Banks Low Top"}]
[8,"MSS21B1 ","492","M  ","M Banks Low Top","Navy Multi","8-40221-90002-0","C/O       ",9,null,{"v":65,"d":"$65.00"},{"v":130,"d":"$130.00"},{"v":129.95,"d":"$129.95"},0,"Mss21b1-492-M  M Banks Low Top"," ",{"$f":"--ISNUMBER(IFERROR(SEARCH(Orders!$E18,O172,1),\"\"))","v":1},{"$f":"IF(Q172=1,COUNTIF($Q$2:Q172,1),\"\")","v":171},{"$f":"IFERROR(INDEX($O2:$O986,MATCH(ROWS($Q$2:Q172),$R2:$R986,0)),\"\")","v":"Mss21b1-492-M  M Banks Low Top"}]
[8,"MSS21B1 ","492","M  ","M Banks Low Top","Navy Multi","8-40221-90003-7","C/O       ",9.5,null,{"v":65,"d":"$65.00"},{"v":130,"d":"$130.00"},{"v":129.95,"d":"$129.95"},0,"Mss21b1-492-M  M Banks Low Top"," ",{"$f":"--ISNUMBER(IFERROR(SEARCH(Orders!$E18,O173,1),\"\"))","v":1},{"$f":"IF(Q173=1,COUNTIF($Q$2:Q173,1),\"\")","v":172},{"$f":"IFERROR(INDEX($O2:$O986,MATCH(ROWS($Q$2:Q173),$R2:$R986,0)),\"\")","v":"Mss21b1-492-M  M Banks Low Top"}]
[8,"MSS21B1 ","492","M  ","M Banks Low Top","Navy Multi","8-40221-90004-4","C/O       ",10,null,{"v":65,"d":"$65.00"},{"v":130,"d":"$130.00"},{"v":129.95,"d":"$129.95"},0,"Mss21b1-492-M  M Banks Low Top"," ",{"$f":"--ISNUMBER(IFERROR(SEARCH(Orders!$E18,O174,1),\"\"))","v":1},{"$f":"IF(Q174=1,COUNTIF($Q$2:Q174,1),\"\")","v":173},{"$f":"IFERROR(INDEX($O2:$O986,MATCH(ROWS($Q$2:Q174),$R2:$R986,0)),\"\")","v":"Mss21b1-492-M  M Banks Low Top"}]
[8,"MSS21B1 ","492","M  ","M Banks Low Top","Navy Multi","8-40221-90005-1","C/O       ",10.5,null,{"v":65,"d":"$65.00"},{"v":130,"d":"$130.00"},{"v":129.95,"d":"$129.95"},0,"Mss21b1-492-M  M Banks Low Top"," ",{"$f":"--ISNUMBER(IFERROR(SEARCH(Orders!$E18,O175,1),\"\"))","v":1},{"$f":"IF(Q175=1,COUNTIF($Q$2:Q175,1),\"\")","v":174},{"$f":"IFERROR(INDEX($O2:$O986,MATCH(ROWS($Q$2:Q175),$R2:$R986,0)),\"\")","v":"Mss21b1-492-M  M Banks Low Top"}]
[8,"MSS21B1 ","492","M  ","M Banks Low Top","Navy Multi","8-40221-90006-8","C/O       ",11,null,{"v":65,"d":"$65.00"},{"v":130,"d":"$130.00"},{"v":129.95,"d":"$129.95"},0,"Mss21b1-492-M  M Banks Low Top"," ",{"$f":"--ISNUMBER(IFERROR(SEARCH(Orders!$E18,O176,1),\"\"))","v":1},{"$f":"IF(Q176=1,COUNTIF($Q$2:Q176,1),\"\")","v":175},{"$f":"IFERROR(INDEX($O2:$O986,MATCH(ROWS($Q$2:Q176),$R2:$R986,0)),\"\")","v":"Mss21b1-492-M  M Banks Low Top"}]
[8,"MSS21B1 ","492","M  ","M Banks Low Top","Navy Multi","8-40221-90007-5","C/O       ",11.5,null,{"v":65,"d":"$65.00"},{"v":130,"d":"$130.00"},{"v":129.95,"d":"$129.95"},0,"Mss21b1-492-M  M Banks Low Top"," ",{"$f":"--ISNUMBER(IFERROR(SEARCH(Orders!$E18,O177,1),\"\"))","v":1},{"$f":"IF(Q177=1,COUNTIF($Q$2:Q177,1),\"\")","v":176},{"$f":"IFERROR(INDEX($O2:$O986,MATCH(ROWS($Q$2:Q177),$R2:$R986,0)),\"\")","v":"Mss21b1-492-M  M Banks Low Top"}]
[8,"MSS21B1 ","492","M  ","M Banks Low Top","Navy Multi","8-40221-90008-2","C/O       ",12,null,{"v":65,"d":"$65.00"},{"v":130,"d":"$130.00"},{"v":129.95,"d":"$129.95"},0,"Mss21b1-492-M  M Banks Low Top"," ",{"$f":"--ISNUMBER(IFERROR(SEARCH(Orders!$E18,O178,1),\"\"))","v":1},{"$f":"IF(Q178=1,COUNTIF($Q$2:Q178,1),\"\")","v":177},{"$f":"IFERROR(INDEX($O2:$O986,MATCH(ROWS($Q$2:Q178),$R2:$R986,0)),\"\")","v":"Mss21b1-492-M  M Banks Low Top"}]
[8,"MSS21B1 ","492","M  ","M Banks Low Top","Navy Multi","8-40221-90009-9","C/O       ",12.5,null,{"v":65,"d":"$65.00"},{"v":130,"d":"$130.00"},{"v":129.95,"d":"$129.95"},0,"Mss21b1-492-M  M Banks Low Top"," ",{"$f":"--ISNUMBER(IFERROR(SEARCH(Orders!$E18,O179,1),\"\"))","v":1},{"$f":"IF(Q179=1,COUNTIF($Q$2:Q179,1),\"\")","v":178},{"$f":"IFERROR(INDEX($O2:$O986,MATCH(ROWS($Q$2:Q179),$R2:$R986,0)),\"\")","v":"Mss21b1-492-M  M Banks Low Top"}]
[8,"MSS21B1 ","492","M  ","M Banks Low Top","Navy Multi","8-40221-90010-5","C/O       ",13,null,{"v":65,"d":"$65.00"},{"v":130,"d":"$130.00"},{"v":129.95,"d":"$129.95"},0,"Mss21b1-492-M  M Banks Low Top"," ",{"$f":"--ISNUMBER(IFERROR(SEARCH(Orders!$E18,O180,1),\"\"))","v":1},{"$f":"IF(Q180=1,COUNTIF($Q$2:Q180,1),\"\")","v":179},{"$f":"IFERROR(INDEX($O2:$O986,MATCH(ROWS($Q$2:Q180),$R2:$R986,0)),\"\")","v":"Mss21b1-492-M  M Banks Low Top"}]
[8,"MSS21B1 ","492","M  ","M Banks Low Top","Navy Multi","8-40221-90011-2","C/O       ",14,null,{"v":65,"d":"$65.00"},{"v":130,"d":"$130.00"},{"v":129.95,"d":"$129.95"},0,"Mss21b1-492-M  M Banks Low Top"," ",{"$f":"--ISNUMBER(IFERROR(SEARCH(Orders!$E18,O181,1),\"\"))","v":1},{"$f":"IF(Q181=1,COUNTIF($Q$2:Q181,1),\"\")","v":180},{"$f":"IFERROR(INDEX($O2:$O986,MATCH(ROWS($Q$2:Q181),$R2:$R986,0)),\"\")","v":"Mss21b1-492-M  M Banks Low Top"}]
[8,"MSS21B3 ","978","M  ","M Banks Low","Blk/Green","8-40221-90012-9","C/O       ",8,null,{"v":65,"d":"$65.00"},{"v":130,"d":"$130.00"},{"v":129.95,"d":"$129.95"},0,"Mss21b3-978-M  M Banks Low"," ",{"$f":"--ISNUMBER(IFERROR(SEARCH(Orders!$E18,O182,1),\"\"))","v":1},{"$f":"IF(Q182=1,COUNTIF($Q$2:Q182,1),\"\")","v":181},{"$f":"IFERROR(INDEX($O2:$O986,MATCH(ROWS($Q$2:Q182),$R2:$R986,0)),\"\")","v":"Mss21b3-978-M  M Banks Low"}]
[8,"MSS21B3 ","978","M  ","M Banks Low","Blk/Green","8-40221-90013-6","C/O       ",8.5,null,{"v":65,"d":"$65.00"},{"v":130,"d":"$130.00"},{"v":129.95,"d":"$129.95"},0,"Mss21b3-978-M  M Banks Low"," ",{"$f":"--ISNUMBER(IFERROR(SEARCH(Orders!$E18,O183,1),\"\"))","v":1},{"$f":"IF(Q183=1,COUNTIF($Q$2:Q183,1),\"\")","v":182},{"$f":"IFERROR(INDEX($O2:$O986,MATCH(ROWS($Q$2:Q183),$R2:$R986,0)),\"\")","v":"Mss21b3-978-M  M Banks Low"}]
[8,"MSS21B3 ","978","M  ","M Banks Low","Blk/Green","8-40221-90014-3","C/O       ",9,null,{"v":65,"d":"$65.00"},{"v":130,"d":"$130.00"},{"v":129.95,"d":"$129.95"},0,"Mss21b3-978-M  M Banks Low"," ",{"$f":"--ISNUMBER(IFERROR(SEARCH(Orders!$E18,O184,1),\"\"))","v":1},{"$f":"IF(Q184=1,COUNTIF($Q$2:Q184,1),\"\")","v":183},{"$f":"IFERROR(INDEX($O2:$O986,MATCH(ROWS($Q$2:Q184),$R2:$R986,0)),\"\")","v":"Mss21b3-978-M  M Banks Low"}]
[8,"MSS21B3 ","978","M  ","M Banks Low","Blk/Green","8-40221-90015-0","C/O       ",9.5,null,{"v":65,"d":"$65.00"},{"v":130,"d":"$130.00"},{"v":129.95,"d":"$129.95"},0,"Mss21b3-978-M  M Banks Low"," ",{"$f":"--ISNUMBER(IFERROR(SEARCH(Orders!$E18,O185,1),\"\"))","v":1},{"$f":"IF(Q185=1,COUNTIF($Q$2:Q185,1),\"\")","v":184},{"$f":"IFERROR(INDEX($O2:$O986,MATCH(ROWS($Q$2:Q185),$R2:$R986,0)),\"\")","v":"Mss21b3-978-M  M Banks Low"}]
[8,"MSS21B3 ","978","M  ","M Banks Low","Blk/Green","8-40221-90016-7","C/O       ",10,null,{"v":65,"d":"$65.00"},{"v":130,"d":"$130.00"},{"v":129.95,"d":"$129.95"},0,"Mss21b3-978-M  M Banks Low"," ",{"$f":"--ISNUMBER(IFERROR(SEARCH(Orders!$E18,O186,1),\"\"))","v":1},{"$f":"IF(Q186=1,COUNTIF($Q$2:Q186,1),\"\")","v":185},{"$f":"IFERROR(INDEX($O2:$O986,MATCH(ROWS($Q$2:Q186),$R2:$R986,0)),\"\")","v":"Mss21b3-978-M  M Banks Low"}]
[8,"MSS21B3 ","978","M  ","M Banks Low","Blk/Green","8-40221-90017-4","C/O       ",10.5,null,{"v":65,"d":"$65.00"},{"v":130,"d":"$130.00"},{"v":129.95,"d":"$129.95"},0,"Mss21b3-978-M  M Banks Low"," ",{"$f":"--ISNUMBER(IFERROR(SEARCH(Orders!$E18,O187,1),\"\"))","v":1},{"$f":"IF(Q187=1,COUNTIF($Q$2:Q187,1),\"\")","v":186},{"$f":"IFERROR(INDEX($O2:$O986,MATCH(ROWS($Q$2:Q187),$R2:$R986,0)),\"\")","v":"Mss21b3-978-M  M Banks Low"}]
[8,"MSS21B3 ","978","M  ","M Banks Low","Blk/Green","8-40221-90018-1","C/O       ",11,null,{"v":65,"d":"$65.00"},{"v":130,"d":"$130.00"},{"v":129.95,"d":"$129.95"},0,"Mss21b3-978-M  M Banks Low"," ",{"$f":"--ISNUMBER(IFERROR(SEARCH(Orders!$E18,O188,1),\"\"))","v":1},{"$f":"IF(Q188=1,COUNTIF($Q$2:Q188,1),\"\")","v":187},{"$f":"IFERROR(INDEX($O2:$O986,MATCH(ROWS($Q$2:Q188),$R2:$R986,0)),\"\")","v":"Mss21b3-978-M  M Banks Low"}]
[8,"MSS21B3 ","978","M  ","M Banks Low","Blk/Green","8-40221-90019-8","C/O       ",11.5,null,{"v":65,"d":"$65.00"},{"v":130,"d":"$130.00"},{"v":129.95,"d":"$129.95"},0,"Mss21b3-978-M  M Banks Low"," ",{"$f":"--ISNUMBER(IFERROR(SEARCH(Orders!$E18,O189,1),\"\"))","v":1},{"$f":"IF(Q189=1,COUNTIF($Q$2:Q189,1),\"\")","v":188},{"$f":"IFERROR(INDEX($O2:$O986,MATCH(ROWS($Q$2:Q189),$R2:$R986,0)),\"\")","v":"Mss21b3-978-M  M Banks Low"}]
[8,"MSS21B3 ","978","M  ","M Banks Low","Blk/Green","8-40221-90020-4","C/O       ",12,null,{"v":65,"d":"$65.00"},{"v":130,"d":"$130.00"},{"v":129.95,"d":"$129.95"},0,"Mss21b3-978-M  M Banks Low"," ",{"$f":"--ISNUMBER(IFERROR(SEARCH(Orders!$E18,O190,1),\"\"))","v":1},{"$f":"IF(Q190=1,COUNTIF($Q$2:Q190,1),\"\")","v":189},{"$f":"IFERROR(INDEX($O2:$O986,MATCH(ROWS($Q$2:Q190),$R2:$R986,0)),\"\")","v":"Mss21b3-978-M  M Banks Low"}]
[8,"MSS21B3 ","978","M  ","M Banks Low","Blk/Green","8-40221-90021-1","C/O       ",12.5,null,{"v":65,"d":"$65.00"},{"v":130,"d":"$130.00"},{"v":129.95,"d":"$129.95"},0,"Mss21b3-978-M  M Banks Low"," ",{"$f":"--ISNUMBER(IFERROR(SEARCH(Orders!$E18,O191,1),\"\"))","v":1},{"$f":"IF(Q191=1,COUNTIF($Q$2:Q191,1),\"\")","v":190},{"$f":"IFERROR(INDEX($O2:$O986,MATCH(ROWS($Q$2:Q191),$R2:$R986,0)),\"\")","v":"Mss21b3-978-M  M Banks Low"}]
[8,"MSS21B3 ","978","M  ","M Banks Low","Blk/Green","8-40221-90022-8","C/O       ",13,null,{"v":65,"d":"$65.00"},{"v":130,"d":"$130.00"},{"v":129.95,"d":"$129.95"},0,"Mss21b3-978-M  M Banks Low"," ",{"$f":"--ISNUMBER(IFERROR(SEARCH(Orders!$E18,O192,1),\"\"))","v":1},{"$f":"IF(Q192=1,COUNTIF($Q$2:Q192,1),\"\")","v":191},{"$f":"IFERROR(INDEX($O2:$O986,MATCH(ROWS($Q$2:Q192),$R2:$R986,0)),\"\")","v":"Mss21b3-978-M  M Banks Low"}]
[8,"MSS21B3 ","978","M  ","M Banks Low","Blk/Green","8-40221-90023-5","C/O       ",14,null,{"v":65,"d":"$65.00"},{"v":130,"d":"$130.00"},{"v":129.95,"d":"$129.95"},0,"Mss21b3-978-M  M Banks Low"," ",{"$f":"--ISNUMBER(IFERROR(SEARCH(Orders!$E18,O193,1),\"\"))","v":1},{"$f":"IF(Q193=1,COUNTIF($Q$2:Q193,1),\"\")","v":192},{"$f":"IFERROR(INDEX($O2:$O986,MATCH(ROWS($Q$2:Q193),$R2:$R986,0)),\"\")","v":"Mss21b3-978-M  M Banks Low"}]
[3,"M80001  ","020","M  ","M Dispatch Low Top","Gray","0-21033-49473-4","          ",8,null,{"v":77.5,"d":"$77.50"},{"v":155,"d":"$155.00"},{"v":154.95,"d":"$154.95"},{"$f":"J194*K194","v":0},"M80001-020-M  M Dispatch Low Top"," ",{"$f":"--ISNUMBER(IFERROR(SEARCH(Orders!$E18,O194,1),\"\"))","v":1},{"$f":"IF(Q194=1,COUNTIF($Q$2:Q194,1),\"\")","v":193},{"$f":"IFERROR(INDEX($O2:$O986,MATCH(ROWS($Q$2:Q194),$R2:$R986,0)),\"\")","v":"M80001-020-M  M Dispatch Low Top"}]
[3,"M80001  ","020","M  ","M Dispatch Low Top","Gray","0-21033-49474-1","          ",8.5,null,{"v":77.5,"d":"$77.50"},{"v":155,"d":"$155.00"},{"v":154.95,"d":"$154.95"},0,"M80001-020-M  M Dispatch Low Top"," ",{"$f":"--ISNUMBER(IFERROR(SEARCH(Orders!$E18,O195,1),\"\"))","v":1},{"$f":"IF(Q195=1,COUNTIF($Q$2:Q195,1),\"\")","v":194},{"$f":"IFERROR(INDEX($O2:$O986,MATCH(ROWS($Q$2:Q195),$R2:$R986,0)),\"\")","v":"M80001-020-M  M Dispatch Low Top"}]
[3,"M80001  ","020","M  ","M Dispatch Low Top","Gray","0-21033-49475-8","          ",9,null,{"v":77.5,"d":"$77.50"},{"v":155,"d":"$155.00"},{"v":154.95,"d":"$154.95"},0,"M80001-020-M  M Dispatch Low Top"," ",{"$f":"--ISNUMBER(IFERROR(SEARCH(Orders!$E18,O196,1),\"\"))","v":1},{"$f":"IF(Q196=1,COUNTIF($Q$2:Q196,1),\"\")","v":195},{"$f":"IFERROR(INDEX($O2:$O986,MATCH(ROWS($Q$2:Q196),$R2:$R986,0)),\"\")","v":"M80001-020-M  M Dispatch Low Top"}]
[3,"M80001  ","020","M  ","M Dispatch Low Top","Gray","0-21033-49476-5","          ",9.5,null,{"v":77.5,"d":"$77.50"},{"v":155,"d":"$155.00"},{"v":154.95,"d":"$154.95"},0,"M80001-020-M  M Dispatch Low Top"," ",{"$f":"--ISNUMBER(IFERROR(SEARCH(Orders!$E18,O197,1),\"\"))","v":1},{"$f":"IF(Q197=1,COUNTIF($Q$2:Q197,1),\"\")","v":196},{"$f":"IFERROR(INDEX($O2:$O986,MATCH(ROWS($Q$2:Q197),$R2:$R986,0)),\"\")","v":"M80001-020-M  M Dispatch Low Top"}]
[3,"M80001  ","020","M  ","M Dispatch Low Top","Gray","0-21033-49477-2","          ",10,null,{"v":77.5,"d":"$77.50"},{"v":155,"d":"$155.00"},{"v":154.95,"d":"$154.95"},0,"M80001-020-M  M Dispatch Low Top"," ",{"$f":"--ISNUMBER(IFERROR(SEARCH(Orders!$E18,O198,1),\"\"))","v":1},{"$f":"IF(Q198=1,COUNTIF($Q$2:Q198,1),\"\")","v":197},{"$f":"IFERROR(INDEX($O2:$O986,MATCH(ROWS($Q$2:Q198),$R2:$R986,0)),\"\")","v":"M80001-020-M  M Dispatch Low Top"}]
[3,"M80001  ","020","M  ","M Dispatch Low Top","Gray","0-21033-49478-9","          ",10.5,null,{"v":77.5,"d":"$77.50"},{"v":155,"d":"$155.00"},{"v":154.95,"d":"$154.95"},0,"M80001-020-M  M Dispatch Low Top"," ",{"$f":"--ISNUMBER(IFERROR(SEARCH(Orders!$E18,O199,1),\"\"))","v":1},{"$f":"IF(Q199=1,COUNTIF($Q$2:Q199,1),\"\")","v":198},{"$f":"IFERROR(INDEX($O2:$O986,MATCH(ROWS($Q$2:Q199),$R2:$R986,0)),\"\")","v":"M80001-020-M  M Dispatch Low Top"}]
[3,"M80001  ","020","M  ","M Dispatch Low Top","Gray","0-21033-49479-6","          ",11,null,{"v":77.5,"d":"$77.50"},{"v":155,"d":"$155.00"},{"v":154.95,"d":"$154.95"},0,"M80001-020-M  M Dispatch Low Top"," ",{"$f":"--ISNUMBER(IFERROR(SEARCH(Orders!$E18,O200,1),\"\"))","v":1},{"$f":"IF(Q200=1,COUNTIF($Q$2:Q200,1),\"\")","v":199},{"$f":"IFERROR(INDEX($O2:$O986,MATCH(ROWS($Q$2:Q200),$R2:$R986,0)),\"\")","v":"M80001-020-M  M Dispatch Low Top"}]
[3,"M80001  ","020","M  ","M Dispatch Low Top","Gray","0-21033-49480-2","          ",11.5,null,{"v":77.5,"d":"$77.50"},{"v":155,"d":"$155.00"},{"v":154.95,"d":"$154.95"},0,"M80001-020-M  M Dispatch Low Top"," ",{"$f":"--ISNUMBER(IFERROR(SEARCH(Orders!$E18,O201,1),\"\"))","v":1},{"$f":"IF(Q201=1,COUNTIF($Q$2:Q201,1),\"\")","v":200},{"$f":"IFERROR(INDEX($O2:$O986,MATCH(ROWS($Q$2:Q201),$R2:$R986,0)),\"\")","v":"M80001-020-M  M Dispatch Low Top"}]
[3,"M80001  ","020","M  ","M Dispatch Low Top","Gray","0-21033-49481-9","          ",12,null,{"v":77.5,"d":"$77.50"},{"v":155,"d":"$155.00"},{"v":154.95,"d":"$154.95"},0,"M80001-020-M  M Dispatch Low Top"," ",{"$f":"--ISNUMBER(IFERROR(SEARCH(Orders!$E18,O202,1),\"\"))","v":1},{"$f":"IF(Q202=1,COUNTIF($Q$2:Q202,1),\"\")","v":201},{"$f":"IFERROR(INDEX($O2:$O986,MATCH(ROWS($Q$2:Q202),$R2:$R986,0)),\"\")","v":"M80001-020-M  M Dispatch Low Top"}]
[3,"M80001  ","020","M  ","M Dispatch Low Top","Gray","0-21033-49482-6","          ",12.5,null,{"v":77.5,"d":"$77.50"},{"v":155,"d":"$155.00"},{"v":154.95,"d":"$154.95"},0,"M80001-020-M  M Dispatch Low Top"," ",{"$f":"--ISNUMBER(IFERROR(SEARCH(Orders!$E18,O203,1),\"\"))","v":1},{"$f":"IF(Q203=1,COUNTIF($Q$2:Q203,1),\"\")","v":202},{"$f":"IFERROR(INDEX($O2:$O986,MATCH(ROWS($Q$2:Q203),$R2:$R986,0)),\"\")","v":"M80001-020-M  M Dispatch Low Top"}]
[3,"M80001  ","020","M  ","M Dispatch Low Top","Gray","0-21033-49483-3","          ",13,null,{"v":77.5,"d":"$77.50"},{"v":155,"d":"$155.00"},{"v":154.95,"d":"$154.95"},0,"M80001-020-M  M Dispatch Low Top"," ",{"$f":"--ISNUMBER(IFERROR(SEARCH(Orders!$E18,O204,1),\"\"))","v":1},{"$f":"IF(Q204=1,COUNTIF($Q$2:Q204,1),\"\")","v":203},{"$f":"IFERROR(INDEX($O2:$O986,MATCH(ROWS($Q$2:Q204),$R2:$R986,0)),\"\")","v":"M80001-020-M  M Dispatch Low Top"}]
[3,"M80001  ","020","M  ","M Dispatch Low Top","Gray","0-21033-49484-0","          ",14,null,{"v":77.5,"d":"$77.50"},{"v":155,"d":"$155.00"},{"v":154.95,"d":"$154.95"},0,"M80001-020-M  M Dispatch Low Top"," ",{"$f":"--ISNUMBER(IFERROR(SEARCH(Orders!$E18,O205,1),\"\"))","v":1},{"$f":"IF(Q205=1,COUNTIF($Q$2:Q205,1),\"\")","v":204},{"$f":"IFERROR(INDEX($O2:$O986,MATCH(ROWS($Q$2:Q205),$R2:$R986,0)),\"\")","v":"M80001-020-M  M Dispatch Low Top"}]
[3,"M80001  ","025","M  ","M Dispatch Low Top","Gunmetal","0-21033-48674-6","          ",8,null,{"v":77.5,"d":"$77.50"},{"v":155,"d":"$155.00"},{"v":154.95,"d":"$154.95"},0,"M80001-025-M  M Dispatch Low Top"," ",{"$f":"--ISNUMBER(IFERROR(SEARCH(Orders!$E18,O206,1),\"\"))","v":1},{"$f":"IF(Q206=1,COUNTIF($Q$2:Q206,1),\"\")","v":205},{"$f":"IFERROR(INDEX($O2:$O986,MATCH(ROWS($Q$2:Q206),$R2:$R986,0)),\"\")","v":"M80001-025-M  M Dispatch Low Top"}]
[3,"M80001  ","025","M  ","M Dispatch Low Top","Gunmetal","0-21033-48675-3","          ",8.5,null,{"v":77.5,"d":"$77.50"},{"v":155,"d":"$155.00"},{"v":154.95,"d":"$154.95"},0,"M80001-025-M  M Dispatch Low Top"," ",{"$f":"--ISNUMBER(IFERROR(SEARCH(Orders!$E18,O207,1),\"\"))","v":1},{"$f":"IF(Q207=1,COUNTIF($Q$2:Q207,1),\"\")","v":206},{"$f":"IFERROR(INDEX($O2:$O986,MATCH(ROWS($Q$2:Q207),$R2:$R986,0)),\"\")","v":"M80001-025-M  M Dispatch Low Top"}]
[3,"M80001  ","025","M  ","M Dispatch Low Top","Gunmetal","0-21033-48676-0","          ",9,null,{"v":77.5,"d":"$77.50"},{"v":155,"d":"$155.00"},{"v":154.95,"d":"$154.95"},0,"M80001-025-M  M Dispatch Low Top"," ",{"$f":"--ISNUMBER(IFERROR(SEARCH(Orders!$E18,O208,1),\"\"))","v":1},{"$f":"IF(Q208=1,COUNTIF($Q$2:Q208,1),\"\")","v":207},{"$f":"IFERROR(INDEX($O2:$O986,MATCH(ROWS($Q$2:Q208),$R2:$R986,0)),\"\")","v":"M80001-025-M  M Dispatch Low Top"}]
[3,"M80001  ","025","M  ","M Dispatch Low Top","Gunmetal","0-21033-48677-7","          ",9.5,null,{"v":77.5,"d":"$77.50"},{"v":155,"d":"$155.00"},{"v":154.95,"d":"$154.95"},0,"M80001-025-M  M Dispatch Low Top"," ",{"$f":"--ISNUMBER(IFERROR(SEARCH(Orders!$E18,O209,1),\"\"))","v":1},{"$f":"IF(Q209=1,COUNTIF($Q$2:Q209,1),\"\")","v":208},{"$f":"IFERROR(INDEX($O2:$O986,MATCH(ROWS($Q$2:Q209),$R2:$R986,0)),\"\")","v":"M80001-025-M  M Dispatch Low Top"}]
[3,"M80001  ","025","M  ","M Dispatch Low Top","Gunmetal","0-21033-48678-4","          ",10,null,{"v":77.5,"d":"$77.50"},{"v":155,"d":"$155.00"},{"v":154.95,"d":"$154.95"},0,"M80001-025-M  M Dispatch Low Top"," ",{"$f":"--ISNUMBER(IFERROR(SEARCH(Orders!$E18,O210,1),\"\"))","v":1},{"$f":"IF(Q210=1,COUNTIF($Q$2:Q210,1),\"\")","v":209},{"$f":"IFERROR(INDEX($O2:$O986,MATCH(ROWS($Q$2:Q210),$R2:$R986,0)),\"\")","v":"M80001-025-M  M Dispatch Low Top"}]
[3,"M80001  ","025","M  ","M Dispatch Low Top","Gunmetal","0-21033-48679-1","          ",10.5,null,{"v":77.5,"d":"$77.50"},{"v":155,"d":"$155.00"},{"v":154.95,"d":"$154.95"},0,"M80001-025-M  M Dispatch Low Top"," ",{"$f":"--ISNUMBER(IFERROR(SEARCH(Orders!$E18,O211,1),\"\"))","v":1},{"$f":"IF(Q211=1,COUNTIF($Q$2:Q211,1),\"\")","v":210},{"$f":"IFERROR(INDEX($O2:$O986,MATCH(ROWS($Q$2:Q211),$R2:$R986,0)),\"\")","v":"M80001-025-M  M Dispatch Low Top"}]
[3,"M80001  ","025","M  ","M Dispatch Low Top","Gunmetal","0-21033-48680-7","          ",11,null,{"v":77.5,"d":"$77.50"},{"v":155,"d":"$155.00"},{"v":154.95,"d":"$154.95"},0,"M80001-025-M  M Dispatch Low Top"," ",{"$f":"--ISNUMBER(IFERROR(SEARCH(Orders!$E18,O212,1),\"\"))","v":1},{"$f":"IF(Q212=1,COUNTIF($Q$2:Q212,1),\"\")","v":211},{"$f":"IFERROR(INDEX($O2:$O986,MATCH(ROWS($Q$2:Q212),$R2:$R986,0)),\"\")","v":"M80001-025-M  M Dispatch Low Top"}]
[3,"M80001  ","025","M  ","M Dispatch Low Top","Gunmetal","0-21033-48681-4","          ",11.5,null,{"v":77.5,"d":"$77.50"},{"v":155,"d":"$155.00"},{"v":154.95,"d":"$154.95"},0,"M80001-025-M  M Dispatch Low Top"," ",{"$f":"--ISNUMBER(IFERROR(SEARCH(Orders!$E18,O213,1),\"\"))","v":1},{"$f":"IF(Q213=1,COUNTIF($Q$2:Q213,1),\"\")","v":212},{"$f":"IFERROR(INDEX($O2:$O986,MATCH(ROWS($Q$2:Q213),$R2:$R986,0)),\"\")","v":"M80001-025-M  M Dispatch Low Top"}]
[3,"M80001  ","025","M  ","M Dispatch Low Top","Gunmetal","0-21033-48682-1","          ",12,null,{"v":77.5,"d":"$77.50"},{"v":155,"d":"$155.00"},{"v":154.95,"d":"$154.95"},0,"M80001-025-M  M Dispatch Low Top"," ",{"$f":"--ISNUMBER(IFERROR(SEARCH(Orders!$E18,O214,1),\"\"))","v":1},{"$f":"IF(Q214=1,COUNTIF($Q$2:Q214,1),\"\")","v":213},{"$f":"IFERROR(INDEX($O2:$O986,MATCH(ROWS($Q$2:Q214),$R2:$R986,0)),\"\")","v":"M80001-025-M  M Dispatch Low Top"}]
[3,"M80001  ","025","M  ","M Dispatch Low Top","Gunmetal","0-21033-48683-8","          ",12.5,null,{"v":77.5,"d":"$77.50"},{"v":155,"d":"$155.00"},{"v":154.95,"d":"$154.95"},0,"M80001-025-M  M Dispatch Low Top"," ",{"$f":"--ISNUMBER(IFERROR(SEARCH(Orders!$E18,O215,1),\"\"))","v":1},{"$f":"IF(Q215=1,COUNTIF($Q$2:Q215,1),\"\")","v":214},{"$f":"IFERROR(INDEX($O2:$O986,MATCH(ROWS($Q$2:Q215),$R2:$R986,0)),\"\")","v":"M80001-025-M  M Dispatch Low Top"}]
[3,"M80001  ","025","M  ","M Dispatch Low Top","Gunmetal","0-21033-48684-5","          ",13,null,{"v":77.5,"d":"$77.50"},{"v":155,"d":"$155.00"},{"v":154.95,"d":"$154.95"},0,"M80001-025-M  M Dispatch Low Top"," ",{"$f":"--ISNUMBER(IFERROR(SEARCH(Orders!$E18,O216,1),\"\"))","v":1},{"$f":"IF(Q216=1,COUNTIF($Q$2:Q216,1),\"\")","v":215},{"$f":"IFERROR(INDEX($O2:$O986,MATCH(ROWS($Q$2:Q216),$R2:$R986,0)),\"\")","v":"M80001-025-M  M Dispatch Low Top"}]
[3,"M80001  ","025","M  ","M Dispatch Low Top","Gunmetal","0-21033-48685-2","          ",14,null,{"v":77.5,"d":"$77.50"},{"v":155,"d":"$155.00"},{"v":154.95,"d":"$154.95"},0,"M80001-025-M  M Dispatch Low Top"," ",{"$f":"--ISNUMBER(IFERROR(SEARCH(Orders!$E18,O217,1),\"\"))","v":1},{"$f":"IF(Q217=1,COUNTIF($Q$2:Q217,1),\"\")","v":216},{"$f":"IFERROR(INDEX($O2:$O986,MATCH(ROWS($Q$2:Q217),$R2:$R986,0)),\"\")","v":"M80001-025-M  M Dispatch Low Top"}]
[3,"M80001  ","240","M  ","M Dispatch Low Top","Tan","0-21033-48686-9","          ",8,null,{"v":77.5,"d":"$77.50"},{"v":155,"d":"$155.00"},{"v":154.95,"d":"$154.95"},0,"M80001-240-M  M Dispatch Low Top"," ",{"$f":"--ISNUMBER(IFERROR(SEARCH(Orders!$E18,O218,1),\"\"))","v":1},{"$f":"IF(Q218=1,COUNTIF($Q$2:Q218,1),\"\")","v":217},{"$f":"IFERROR(INDEX($O2:$O986,MATCH(ROWS($Q$2:Q218),$R2:$R986,0)),\"\")","v":"M80001-240-M  M Dispatch Low Top"}]
[3,"M80001  ","240","M  ","M Dispatch Low Top","Tan","0-21033-48687-6","          ",8.5,null,{"v":77.5,"d":"$77.50"},{"v":155,"d":"$155.00"},{"v":154.95,"d":"$154.95"},0,"M80001-240-M  M Dispatch Low Top"," ",{"$f":"--ISNUMBER(IFERROR(SEARCH(Orders!$E18,O219,1),\"\"))","v":1},{"$f":"IF(Q219=1,COUNTIF($Q$2:Q219,1),\"\")","v":218},{"$f":"IFERROR(INDEX($O2:$O986,MATCH(ROWS($Q$2:Q219),$R2:$R986,0)),\"\")","v":"M80001-240-M  M Dispatch Low Top"}]
[3,"M80001  ","240","M  ","M Dispatch Low Top","Tan","0-21033-48688-3","          ",9,null,{"v":77.5,"d":"$77.50"},{"v":155,"d":"$155.00"},{"v":154.95,"d":"$154.95"},0,"M80001-240-M  M Dispatch Low Top"," ",{"$f":"--ISNUMBER(IFERROR(SEARCH(Orders!$E18,O220,1),\"\"))","v":1},{"$f":"IF(Q220=1,COUNTIF($Q$2:Q220,1),\"\")","v":219},{"$f":"IFERROR(INDEX($O2:$O986,MATCH(ROWS($Q$2:Q220),$R2:$R986,0)),\"\")","v":"M80001-240-M  M Dispatch Low Top"}]
[3,"M80001  ","240","M  ","M Dispatch Low Top","Tan","0-21033-48689-0","          ",9.5,null,{"v":77.5,"d":"$77.50"},{"v":155,"d":"$155.00"},{"v":154.95,"d":"$154.95"},0,"M80001-240-M  M Dispatch Low Top"," ",{"$f":"--ISNUMBER(IFERROR(SEARCH(Orders!$E18,O221,1),\"\"))","v":1},{"$f":"IF(Q221=1,COUNTIF($Q$2:Q221,1),\"\")","v":220},{"$f":"IFERROR(INDEX($O2:$O986,MATCH(ROWS($Q$2:Q221),$R2:$R986,0)),\"\")","v":"M80001-240-M  M Dispatch Low Top"}]
[3,"M80001  ","240","M  ","M Dispatch Low Top","Tan","0-21033-48690-6","          ",10,null,{"v":77.5,"d":"$77.50"},{"v":155,"d":"$155.00"},{"v":154.95,"d":"$154.95"},0,"M80001-240-M  M Dispatch Low Top"," ",{"$f":"--ISNUMBER(IFERROR(SEARCH(Orders!$E18,O222,1),\"\"))","v":1},{"$f":"IF(Q222=1,COUNTIF($Q$2:Q222,1),\"\")","v":221},{"$f":"IFERROR(INDEX($O2:$O986,MATCH(ROWS($Q$2:Q222),$R2:$R986,0)),\"\")","v":"M80001-240-M  M Dispatch Low Top"}]
[3,"M80001  ","240","M  ","M Dispatch Low Top","Tan","0-21033-48691-3","          ",10.5,null,{"v":77.5,"d":"$77.50"},{"v":155,"d":"$155.00"},{"v":154.95,"d":"$154.95"},0,"M80001-240-M  M Dispatch Low Top"," ",{"$f":"--ISNUMBER(IFERROR(SEARCH(Orders!$E18,O223,1),\"\"))","v":1},{"$f":"IF(Q223=1,COUNTIF($Q$2:Q223,1),\"\")","v":222},{"$f":"IFERROR(INDEX($O2:$O986,MATCH(ROWS($Q$2:Q223),$R2:$R986,0)),\"\")","v":"M80001-240-M  M Dispatch Low Top"}]
[3,"M80001  ","240","M  ","M Dispatch Low Top","Tan","0-21033-48692-0","          ",11,null,{"v":77.5,"d":"$77.50"},{"v":155,"d":"$155.00"},{"v":154.95,"d":"$154.95"},0,"M80001-240-M  M Dispatch Low Top"," ",{"$f":"--ISNUMBER(IFERROR(SEARCH(Orders!$E18,O224,1),\"\"))","v":1},{"$f":"IF(Q224=1,COUNTIF($Q$2:Q224,1),\"\")","v":223},{"$f":"IFERROR(INDEX($O2:$O986,MATCH(ROWS($Q$2:Q224),$R2:$R986,0)),\"\")","v":"M80001-240-M  M Dispatch Low Top"}]
[3,"M80001  ","240","M  ","M Dispatch Low Top","Tan","0-21033-48693-7","          ",11.5,null,{"v":77.5,"d":"$77.50"},{"v":155,"d":"$155.00"},{"v":154.95,"d":"$154.95"},0,"M80001-240-M  M Dispatch Low Top"," ",{"$f":"--ISNUMBER(IFERROR(SEARCH(Orders!$E18,O225,1),\"\"))","v":1},{"$f":"IF(Q225=1,COUNTIF($Q$2:Q225,1),\"\")","v":224},{"$f":"IFERROR(INDEX($O2:$O986,MATCH(ROWS($Q$2:Q225),$R2:$R986,0)),\"\")","v":"M80001-240-M  M Dispatch Low Top"}]
[3,"M80001  ","240","M  ","M Dispatch Low Top","Tan","0-21033-48694-4","          ",12,null,{"v":77.5,"d":"$77.50"},{"v":155,"d":"$155.00"},{"v":154.95,"d":"$154.95"},0,"M80001-240-M  M Dispatch Low Top"," ",{"$f":"--ISNUMBER(IFERROR(SEARCH(Orders!$E18,O226,1),\"\"))","v":1},{"$f":"IF(Q226=1,COUNTIF($Q$2:Q226,1),\"\")","v":225},{"$f":"IFERROR(INDEX($O2:$O986,MATCH(ROWS($Q$2:Q226),$R2:$R986,0)),\"\")","v":"M80001-240-M  M Dispatch Low Top"}]
[3,"M80001  ","240","M  ","M Dispatch Low Top","Tan","0-21033-48695-1","          ",12.5,null,{"v":77.5,"d":"$77.50"},{"v":155,"d":"$155.00"},{"v":154.95,"d":"$154.95"},0,"M80001-240-M  M Dispatch Low Top"," ",{"$f":"--ISNUMBER(IFERROR(SEARCH(Orders!$E18,O227,1),\"\"))","v":1},{"$f":"IF(Q227=1,COUNTIF($Q$2:Q227,1),\"\")","v":226},{"$f":"IFERROR(INDEX($O2:$O986,MATCH(ROWS($Q$2:Q227),$R2:$R986,0)),\"\")","v":"M80001-240-M  M Dispatch Low Top"}]
[3,"M80001  ","240","M  ","M Dispatch Low Top","Tan","0-21033-48696-8","          ",13,null,{"v":77.5,"d":"$77.50"},{"v":155,"d":"$155.00"},{"v":154.95,"d":"$154.95"},0,"M80001-240-M  M Dispatch Low Top"," ",{"$f":"--ISNUMBER(IFERROR(SEARCH(Orders!$E18,O228,1),\"\"))","v":1},{"$f":"IF(Q228=1,COUNTIF($Q$2:Q228,1),\"\")","v":227},{"$f":"IFERROR(INDEX($O2:$O986,MATCH(ROWS($Q$2:Q228),$R2:$R986,0)),\"\")","v":"M80001-240-M  M Dispatch Low Top"}]
[3,"M80001  ","240","M  ","M Dispatch Low Top","Tan","0-21033-48697-5","          ",14,null,{"v":77.5,"d":"$77.50"},{"v":155,"d":"$155.00"},{"v":154.95,"d":"$154.95"},0,"M80001-240-M  M Dispatch Low Top"," ",{"$f":"--ISNUMBER(IFERROR(SEARCH(Orders!$E18,O229,1),\"\"))","v":1},{"$f":"IF(Q229=1,COUNTIF($Q$2:Q229,1),\"\")","v":228},{"$f":"IFERROR(INDEX($O2:$O986,MATCH(ROWS($Q$2:Q229),$R2:$R986,0)),\"\")","v":"M80001-240-M  M Dispatch Low Top"}]
[3,"M80001  ","305","M  ","M Dispatch Low Top","Loden","0-21033-48698-2","          ",8,null,{"v":77.5,"d":"$77.50"},{"v":155,"d":"$155.00"},{"v":154.95,"d":"$154.95"},0,"M80001-305-M  M Dispatch Low Top"," ",{"$f":"--ISNUMBER(IFERROR(SEARCH(Orders!$E18,O230,1),\"\"))","v":1},{"$f":"IF(Q230=1,COUNTIF($Q$2:Q230,1),\"\")","v":229},{"$f":"IFERROR(INDEX($O2:$O986,MATCH(ROWS($Q$2:Q230),$R2:$R986,0)),\"\")","v":"M80001-305-M  M Dispatch Low Top"}]
[3,"M80001  ","305","M  ","M Dispatch Low Top","Loden","0-21033-48699-9","          ",8.5,null,{"v":77.5,"d":"$77.50"},{"v":155,"d":"$155.00"},{"v":154.95,"d":"$154.95"},0,"M80001-305-M  M Dispatch Low Top"," ",{"$f":"--ISNUMBER(IFERROR(SEARCH(Orders!$E18,O231,1),\"\"))","v":1},{"$f":"IF(Q231=1,COUNTIF($Q$2:Q231,1),\"\")","v":230},{"$f":"IFERROR(INDEX($O2:$O986,MATCH(ROWS($Q$2:Q231),$R2:$R986,0)),\"\")","v":"M80001-305-M  M Dispatch Low Top"}]
[3,"M80001  ","305","M  ","M Dispatch Low Top","Loden","0-21033-48700-2","          ",9,null,{"v":77.5,"d":"$77.50"},{"v":155,"d":"$155.00"},{"v":154.95,"d":"$154.95"},0,"M80001-305-M  M Dispatch Low Top"," ",{"$f":"--ISNUMBER(IFERROR(SEARCH(Orders!$E18,O232,1),\"\"))","v":1},{"$f":"IF(Q232=1,COUNTIF($Q$2:Q232,1),\"\")","v":231},{"$f":"IFERROR(INDEX($O2:$O986,MATCH(ROWS($Q$2:Q232),$R2:$R986,0)),\"\")","v":"M80001-305-M  M Dispatch Low Top"}]
[3,"M80001  ","305","M  ","M Dispatch Low Top","Loden","0-21033-48701-9","          ",9.5,null,{"v":77.5,"d":"$77.50"},{"v":155,"d":"$155.00"},{"v":154.95,"d":"$154.95"},0,"M80001-305-M  M Dispatch Low Top"," ",{"$f":"--ISNUMBER(IFERROR(SEARCH(Orders!$E18,O233,1),\"\"))","v":1},{"$f":"IF(Q233=1,COUNTIF($Q$2:Q233,1),\"\")","v":232},{"$f":"IFERROR(INDEX($O2:$O986,MATCH(ROWS($Q$2:Q233),$R2:$R986,0)),\"\")","v":"M80001-305-M  M Dispatch Low Top"}]
[3,"M80001  ","305","M  ","M Dispatch Low Top","Loden","0-21033-48702-6","          ",10,null,{"v":77.5,"d":"$77.50"},{"v":155,"d":"$155.00"},{"v":154.95,"d":"$154.95"},0,"M80001-305-M  M Dispatch Low Top"," ",{"$f":"--ISNUMBER(IFERROR(SEARCH(Orders!$E18,O234,1),\"\"))","v":1},{"$f":"IF(Q234=1,COUNTIF($Q$2:Q234,1),\"\")","v":233},{"$f":"IFERROR(INDEX($O2:$O986,MATCH(ROWS($Q$2:Q234),$R2:$R986,0)),\"\")","v":"M80001-305-M  M Dispatch Low Top"}]
[3,"M80001  ","305","M  ","M Dispatch Low Top","Loden","0-21033-48703-3","          ",10.5,null,{"v":77.5,"d":"$77.50"},{"v":155,"d":"$155.00"},{"v":154.95,"d":"$154.95"},0,"M80001-305-M  M Dispatch Low Top"," ",{"$f":"--ISNUMBER(IFERROR(SEARCH(Orders!$E18,O235,1),\"\"))","v":1},{"$f":"IF(Q235=1,COUNTIF($Q$2:Q235,1),\"\")","v":234},{"$f":"IFERROR(INDEX($O2:$O986,MATCH(ROWS($Q$2:Q235),$R2:$R986,0)),\"\")","v":"M80001-305-M  M Dispatch Low Top"}]
[3,"M80001  ","305","M  ","M Dispatch Low Top","Loden","0-21033-48704-0","          ",11,null,{"v":77.5,"d":"$77.50"},{"v":155,"d":"$155.00"},{"v":154.95,"d":"$154.95"},0,"M80001-305-M  M Dispatch Low Top"," ",{"$f":"--ISNUMBER(IFERROR(SEARCH(Orders!$E18,O236,1),\"\"))","v":1},{"$f":"IF(Q236=1,COUNTIF($Q$2:Q236,1),\"\")","v":235},{"$f":"IFERROR(INDEX($O2:$O986,MATCH(ROWS($Q$2:Q236),$R2:$R986,0)),\"\")","v":"M80001-305-M  M Dispatch Low Top"}]
[3,"M80001  ","305","M  ","M Dispatch Low Top","Loden","0-21033-48705-7","          ",11.5,null,{"v":77.5,"d":"$77.50"},{"v":155,"d":"$155.00"},{"v":154.95,"d":"$154.95"},0,"M80001-305-M  M Dispatch Low Top"," ",{"$f":"--ISNUMBER(IFERROR(SEARCH(Orders!$E18,O237,1),\"\"))","v":1},{"$f":"IF(Q237=1,COUNTIF($Q$2:Q237,1),\"\")","v":236},{"$f":"IFERROR(INDEX($O2:$O986,MATCH(ROWS($Q$2:Q237),$R2:$R986,0)),\"\")","v":"M80001-305-M  M Dispatch Low Top"}]
[3,"M80001  ","305","M  ","M Dispatch Low Top","Loden","0-21033-48706-4","          ",12,null,{"v":77.5,"d":"$77.50"},{"v":155,"d":"$155.00"},{"v":154.95,"d":"$154.95"},0,"M80001-305-M  M Dispatch Low Top"," ",{"$f":"--ISNUMBER(IFERROR(SEARCH(Orders!$E18,O238,1),\"\"))","v":1},{"$f":"IF(Q238=1,COUNTIF($Q$2:Q238,1),\"\")","v":237},{"$f":"IFERROR(INDEX($O2:$O986,MATCH(ROWS($Q$2:Q238),$R2:$R986,0)),\"\")","v":"M80001-305-M  M Dispatch Low Top"}]
[3,"M80001  ","305","M  ","M Dispatch Low Top","Loden","0-21033-48707-1","          ",12.5,null,{"v":77.5,"d":"$77.50"},{"v":155,"d":"$155.00"},{"v":154.95,"d":"$154.95"},0,"M80001-305-M  M Dispatch Low Top"," ",{"$f":"--ISNUMBER(IFERROR(SEARCH(Orders!$E18,O239,1),\"\"))","v":1},{"$f":"IF(Q239=1,COUNTIF($Q$2:Q239,1),\"\")","v":238},{"$f":"IFERROR(INDEX($O2:$O986,MATCH(ROWS($Q$2:Q239),$R2:$R986,0)),\"\")","v":"M80001-305-M  M Dispatch Low Top"}]
[3,"M80001  ","305","M  ","M Dispatch Low Top","Loden","0-21033-48708-8","          ",13,null,{"v":77.5,"d":"$77.50"},{"v":155,"d":"$155.00"},{"v":154.95,"d":"$154.95"},0,"M80001-305-M  M Dispatch Low Top"," ",{"$f":"--ISNUMBER(IFERROR(SEARCH(Orders!$E18,O240,1),\"\"))","v":1},{"$f":"IF(Q240=1,COUNTIF($Q$2:Q240,1),\"\")","v":239},{"$f":"IFERROR(INDEX($O2:$O986,MATCH(ROWS($Q$2:Q240),$R2:$R986,0)),\"\")","v":"M80001-305-M  M Dispatch Low Top"}]
[3,"M80001  ","305","M  ","M Dispatch Low Top","Loden","0-21033-48709-5","          ",14,null,{"v":77.5,"d":"$77.50"},{"v":155,"d":"$155.00"},{"v":154.95,"d":"$154.95"},0,"M80001-305-M  M Dispatch Low Top"," ",{"$f":"--ISNUMBER(IFERROR(SEARCH(Orders!$E18,O241,1),\"\"))","v":1},{"$f":"IF(Q241=1,COUNTIF($Q$2:Q241,1),\"\")","v":240},{"$f":"IFERROR(INDEX($O2:$O986,MATCH(ROWS($Q$2:Q241),$R2:$R986,0)),\"\")","v":"M80001-305-M  M Dispatch Low Top"}]
[0,"M80002  ","009","M  ","M Cascade Trail Low","Blk Multi","0-21033-48710-1","          ",8,null,{"v":65,"d":"$65.00"},{"v":130,"d":"$130.00"},{"v":129.95,"d":"$129.95"},0,"M80002-009-M  M Cascade Trail Low"," ",{"$f":"--ISNUMBER(IFERROR(SEARCH(Orders!$E18,O242,1),\"\"))","v":1},{"$f":"IF(Q242=1,COUNTIF($Q$2:Q242,1),\"\")","v":241},{"$f":"IFERROR(INDEX($O2:$O986,MATCH(ROWS($Q$2:Q242),$R2:$R986,0)),\"\")","v":"M80002-009-M  M Cascade Trail Low"}]
[0,"M80002  ","009","M  ","M Cascade Trail Low","Blk Multi","0-21033-48711-8","          ",8.5,null,{"v":65,"d":"$65.00"},{"v":130,"d":"$130.00"},{"v":129.95,"d":"$129.95"},0,"M80002-009-M  M Cascade Trail Low"," ",{"$f":"--ISNUMBER(IFERROR(SEARCH(Orders!$E18,O243,1),\"\"))","v":1},{"$f":"IF(Q243=1,COUNTIF($Q$2:Q243,1),\"\")","v":242},{"$f":"IFERROR(INDEX($O2:$O986,MATCH(ROWS($Q$2:Q243),$R2:$R986,0)),\"\")","v":"M80002-009-M  M Cascade Trail Low"}]
[0,"M80002  ","009","M  ","M Cascade Trail Low","Blk Multi","0-21033-48712-5","          ",9,null,{"v":65,"d":"$65.00"},{"v":130,"d":"$130.00"},{"v":129.95,"d":"$129.95"},0,"M80002-009-M  M Cascade Trail Low"," ",{"$f":"--ISNUMBER(IFERROR(SEARCH(Orders!$E18,O244,1),\"\"))","v":1},{"$f":"IF(Q244=1,COUNTIF($Q$2:Q244,1),\"\")","v":243},{"$f":"IFERROR(INDEX($O2:$O986,MATCH(ROWS($Q$2:Q244),$R2:$R986,0)),\"\")","v":"M80002-009-M  M Cascade Trail Low"}]
[0,"M80002  ","009","M  ","M Cascade Trail Low","Blk Multi","0-21033-48713-2","          ",9.5,null,{"v":65,"d":"$65.00"},{"v":130,"d":"$130.00"},{"v":129.95,"d":"$129.95"},0,"M80002-009-M  M Cascade Trail Low"," ",{"$f":"--ISNUMBER(IFERROR(SEARCH(Orders!$E18,O245,1),\"\"))","v":1},{"$f":"IF(Q245=1,COUNTIF($Q$2:Q245,1),\"\")","v":244},{"$f":"IFERROR(INDEX($O2:$O986,MATCH(ROWS($Q$2:Q245),$R2:$R986,0)),\"\")","v":"M80002-009-M  M Cascade Trail Low"}]
[0,"M80002  ","009","M  ","M Cascade Trail Low","Blk Multi","0-21033-48714-9","          ",10,null,{"v":65,"d":"$65.00"},{"v":130,"d":"$130.00"},{"v":129.95,"d":"$129.95"},0,"M80002-009-M  M Cascade Trail Low"," ",{"$f":"--ISNUMBER(IFERROR(SEARCH(Orders!$E18,O246,1),\"\"))","v":1},{"$f":"IF(Q246=1,COUNTIF($Q$2:Q246,1),\"\")","v":245},{"$f":"IFERROR(INDEX($O2:$O986,MATCH(ROWS($Q$2:Q246),$R2:$R986,0)),\"\")","v":"M80002-009-M  M Cascade Trail Low"}]
[0,"M80002  ","009","M  ","M Cascade Trail Low","Blk Multi","0-21033-48715-6","          ",10.5,null,{"v":65,"d":"$65.00"},{"v":130,"d":"$130.00"},{"v":129.95,"d":"$129.95"},0,"M80002-009-M  M Cascade Trail Low"," ",{"$f":"--ISNUMBER(IFERROR(SEARCH(Orders!$E18,O247,1),\"\"))","v":1},{"$f":"IF(Q247=1,COUNTIF($Q$2:Q247,1),\"\")","v":246},{"$f":"IFERROR(INDEX($O2:$O986,MATCH(ROWS($Q$2:Q247),$R2:$R986,0)),\"\")","v":"M80002-009-M  M Cascade Trail Low"}]
[0,"M80002  ","009","M  ","M Cascade Trail Low","Blk Multi","0-21033-48716-3","          ",11,null,{"v":65,"d":"$65.00"},{"v":130,"d":"$130.00"},{"v":129.95,"d":"$129.95"},0,"M80002-009-M  M Cascade Trail Low"," ",{"$f":"--ISNUMBER(IFERROR(SEARCH(Orders!$E18,O248,1),\"\"))","v":1},{"$f":"IF(Q248=1,COUNTIF($Q$2:Q248,1),\"\")","v":247},{"$f":"IFERROR(INDEX($O2:$O986,MATCH(ROWS($Q$2:Q248),$R2:$R986,0)),\"\")","v":"M80002-009-M  M Cascade Trail Low"}]
[0,"M80002  ","009","M  ","M Cascade Trail Low","Blk Multi","0-21033-48717-0","          ",11.5,null,{"v":65,"d":"$65.00"},{"v":130,"d":"$130.00"},{"v":129.95,"d":"$129.95"},0,"M80002-009-M  M Cascade Trail Low"," ",{"$f":"--ISNUMBER(IFERROR(SEARCH(Orders!$E18,O249,1),\"\"))","v":1},{"$f":"IF(Q249=1,COUNTIF($Q$2:Q249,1),\"\")","v":248},{"$f":"IFERROR(INDEX($O2:$O986,MATCH(ROWS($Q$2:Q249),$R2:$R986,0)),\"\")","v":"M80002-009-M  M Cascade Trail Low"}]
[0,"M80002  ","009","M  ","M Cascade Trail Low","Blk Multi","0-21033-48718-7","          ",12,null,{"v":65,"d":"$65.00"},{"v":130,"d":"$130.00"},{"v":129.95,"d":"$129.95"},0,"M80002-009-M  M Cascade Trail Low"," ",{"$f":"--ISNUMBER(IFERROR(SEARCH(Orders!$E18,O250,1),\"\"))","v":1},{"$f":"IF(Q250=1,COUNTIF($Q$2:Q250,1),\"\")","v":249},{"$f":"IFERROR(INDEX($O2:$O986,MATCH(ROWS($Q$2:Q250),$R2:$R986,0)),\"\")","v":"M80002-009-M  M Cascade Trail Low"}]
[0,"M80002  ","009","M  ","M Cascade Trail Low","Blk Multi","0-21033-48719-4","          ",12.5,null,{"v":65,"d":"$65.00"},{"v":130,"d":"$130.00"},{"v":129.95,"d":"$129.95"},0,"M80002-009-M  M Cascade Trail Low"," ",{"$f":"--ISNUMBER(IFERROR(SEARCH(Orders!$E18,O251,1),\"\"))","v":1},{"$f":"IF(Q251=1,COUNTIF($Q$2:Q251,1),\"\")","v":250},{"$f":"IFERROR(INDEX($O2:$O986,MATCH(ROWS($Q$2:Q251),$R2:$R986,0)),\"\")","v":"M80002-009-M  M Cascade Trail Low"}]
[0,"M80002  ","009","M  ","M Cascade Trail Low","Blk Multi","0-21033-48720-0","          ",13,null,{"v":65,"d":"$65.00"},{"v":130,"d":"$130.00"},{"v":129.95,"d":"$129.95"},0,"M80002-009-M  M Cascade Trail Low"," ",{"$f":"--ISNUMBER(IFERROR(SEARCH(Orders!$E18,O252,1),\"\"))","v":1},{"$f":"IF(Q252=1,COUNTIF($Q$2:Q252,1),\"\")","v":251},{"$f":"IFERROR(INDEX($O2:$O986,MATCH(ROWS($Q$2:Q252),$R2:$R986,0)),\"\")","v":"M80002-009-M  M Cascade Trail Low"}]
[0,"M80002  ","009","M  ","M Cascade Trail Low","Blk Multi","0-21033-48721-7","          ",14,null,{"v":65,"d":"$65.00"},{"v":130,"d":"$130.00"},{"v":129.95,"d":"$129.95"},0,"M80002-009-M  M Cascade Trail Low"," ",{"$f":"--ISNUMBER(IFERROR(SEARCH(Orders!$E18,O253,1),\"\"))","v":1},{"$f":"IF(Q253=1,COUNTIF($Q$2:Q253,1),\"\")","v":252},{"$f":"IFERROR(INDEX($O2:$O986,MATCH(ROWS($Q$2:Q253),$R2:$R986,0)),\"\")","v":"M80002-009-M  M Cascade Trail Low"}]
[0,"M80002  ","419","M  ","M Cascade Trail Low","Navy/Gray","0-21033-48746-0","          ",8,null,{"v":65,"d":"$65.00"},{"v":130,"d":"$130.00"},{"v":129.95,"d":"$129.95"},0,"M80002-419-M  M Cascade Trail Low"," ",{"$f":"--ISNUMBER(IFERROR(SEARCH(Orders!$E18,O254,1),\"\"))","v":1},{"$f":"IF(Q254=1,COUNTIF($Q$2:Q254,1),\"\")","v":253},{"$f":"IFERROR(INDEX($O2:$O986,MATCH(ROWS($Q$2:Q254),$R2:$R986,0)),\"\")","v":"M80002-419-M  M Cascade Trail Low"}]
[0,"M80002  ","419","M  ","M Cascade Trail Low","Navy/Gray","0-21033-48747-7","          ",8.5,null,{"v":65,"d":"$65.00"},{"v":130,"d":"$130.00"},{"v":129.95,"d":"$129.95"},0,"M80002-419-M  M Cascade Trail Low"," ",{"$f":"--ISNUMBER(IFERROR(SEARCH(Orders!$E18,O255,1),\"\"))","v":1},{"$f":"IF(Q255=1,COUNTIF($Q$2:Q255,1),\"\")","v":254},{"$f":"IFERROR(INDEX($O2:$O986,MATCH(ROWS($Q$2:Q255),$R2:$R986,0)),\"\")","v":"M80002-419-M  M Cascade Trail Low"}]
[0,"M80002  ","419","M  ","M Cascade Trail Low","Navy/Gray","0-21033-48748-4","          ",9,null,{"v":65,"d":"$65.00"},{"v":130,"d":"$130.00"},{"v":129.95,"d":"$129.95"},0,"M80002-419-M  M Cascade Trail Low"," ",{"$f":"--ISNUMBER(IFERROR(SEARCH(Orders!$E18,O256,1),\"\"))","v":1},{"$f":"IF(Q256=1,COUNTIF($Q$2:Q256,1),\"\")","v":255},{"$f":"IFERROR(INDEX($O2:$O986,MATCH(ROWS($Q$2:Q256),$R2:$R986,0)),\"\")","v":"M80002-419-M  M Cascade Trail Low"}]
[0,"M80002  ","419","M  ","M Cascade Trail Low","Navy/Gray","0-21033-48749-1","          ",9.5,null,{"v":65,"d":"$65.00"},{"v":130,"d":"$130.00"},{"v":129.95,"d":"$129.95"},0,"M80002-419-M  M Cascade Trail Low"," ",{"$f":"--ISNUMBER(IFERROR(SEARCH(Orders!$E18,O257,1),\"\"))","v":1},{"$f":"IF(Q257=1,COUNTIF($Q$2:Q257,1),\"\")","v":256},{"$f":"IFERROR(INDEX($O2:$O986,MATCH(ROWS($Q$2:Q257),$R2:$R986,0)),\"\")","v":"M80002-419-M  M Cascade Trail Low"}]
[0,"M80002  ","419","M  ","M Cascade Trail Low","Navy/Gray","0-21033-48750-7","          ",10,null,{"v":65,"d":"$65.00"},{"v":130,"d":"$130.00"},{"v":129.95,"d":"$129.95"},{"$f":"J258*K258","v":0},"M80002-419-M  M Cascade Trail Low"," ",{"$f":"--ISNUMBER(IFERROR(SEARCH(Orders!$E18,O258,1),\"\"))","v":1},{"$f":"IF(Q258=1,COUNTIF($Q$2:Q258,1),\"\")","v":257},{"$f":"IFERROR(INDEX($O2:$O986,MATCH(ROWS($Q$2:Q258),$R2:$R986,0)),\"\")","v":"M80002-419-M  M Cascade Trail Low"}]
[0,"M80002  ","419","M  ","M Cascade Trail Low","Navy/Gray","0-21033-48751-4","          ",10.5,null,{"v":65,"d":"$65.00"},{"v":130,"d":"$130.00"},{"v":129.95,"d":"$129.95"},0,"M80002-419-M  M Cascade Trail Low"," ",{"$f":"--ISNUMBER(IFERROR(SEARCH(Orders!$E18,O259,1),\"\"))","v":1},{"$f":"IF(Q259=1,COUNTIF($Q$2:Q259,1),\"\")","v":258},{"$f":"IFERROR(INDEX($O2:$O986,MATCH(ROWS($Q$2:Q259),$R2:$R986,0)),\"\")","v":"M80002-419-M  M Cascade Trail Low"}]
[0,"M80002  ","419","M  ","M Cascade Trail Low","Navy/Gray","0-21033-48752-1","          ",11,null,{"v":65,"d":"$65.00"},{"v":130,"d":"$130.00"},{"v":129.95,"d":"$129.95"},0,"M80002-419-M  M Cascade Trail Low"," ",{"$f":"--ISNUMBER(IFERROR(SEARCH(Orders!$E18,O260,1),\"\"))","v":1},{"$f":"IF(Q260=1,COUNTIF($Q$2:Q260,1),\"\")","v":259},{"$f":"IFERROR(INDEX($O2:$O986,MATCH(ROWS($Q$2:Q260),$R2:$R986,0)),\"\")","v":"M80002-419-M  M Cascade Trail Low"}]
[0,"M80002  ","419","M  ","M Cascade Trail Low","Navy/Gray","0-21033-48753-8","          ",11.5,null,{"v":65,"d":"$65.00"},{"v":130,"d":"$130.00"},{"v":129.95,"d":"$129.95"},0,"M80002-419-M  M Cascade Trail Low"," ",{"$f":"--ISNUMBER(IFERROR(SEARCH(Orders!$E18,O261,1),\"\"))","v":1},{"$f":"IF(Q261=1,COUNTIF($Q$2:Q261,1),\"\")","v":260},{"$f":"IFERROR(INDEX($O2:$O986,MATCH(ROWS($Q$2:Q261),$R2:$R986,0)),\"\")","v":"M80002-419-M  M Cascade Trail Low"}]
[0,"M80002  ","419","M  ","M Cascade Trail Low","Navy/Gray","0-21033-48754-5","          ",12,null,{"v":65,"d":"$65.00"},{"v":130,"d":"$130.00"},{"v":129.95,"d":"$129.95"},0,"M80002-419-M  M Cascade Trail Low"," ",{"$f":"--ISNUMBER(IFERROR(SEARCH(Orders!$E18,O262,1),\"\"))","v":1},{"$f":"IF(Q262=1,COUNTIF($Q$2:Q262,1),\"\")","v":261},{"$f":"IFERROR(INDEX($O2:$O986,MATCH(ROWS($Q$2:Q262),$R2:$R986,0)),\"\")","v":"M80002-419-M  M Cascade Trail Low"}]
[0,"M80002  ","419","M  ","M Cascade Trail Low","Navy/Gray","0-21033-48755-2","          ",12.5,null,{"v":65,"d":"$65.00"},{"v":130,"d":"$130.00"},{"v":129.95,"d":"$129.95"},0,"M80002-419-M  M Cascade Trail Low"," ",{"$f":"--ISNUMBER(IFERROR(SEARCH(Orders!$E18,O263,1),\"\"))","v":1},{"$f":"IF(Q263=1,COUNTIF($Q$2:Q263,1),\"\")","v":262},{"$f":"IFERROR(INDEX($O2:$O986,MATCH(ROWS($Q$2:Q263),$R2:$R986,0)),\"\")","v":"M80002-419-M  M Cascade Trail Low"}]
[0,"M80002  ","419","M  ","M Cascade Trail Low","Navy/Gray","0-21033-48756-9","          ",13,null,{"v":65,"d":"$65.00"},{"v":130,"d":"$130.00"},{"v":129.95,"d":"$129.95"},0,"M80002-419-M  M Cascade Trail Low"," ",{"$f":"--ISNUMBER(IFERROR(SEARCH(Orders!$E18,O264,1),\"\"))","v":1},{"$f":"IF(Q264=1,COUNTIF($Q$2:Q264,1),\"\")","v":263},{"$f":"IFERROR(INDEX($O2:$O986,MATCH(ROWS($Q$2:Q264),$R2:$R986,0)),\"\")","v":"M80002-419-M  M Cascade Trail Low"}]
[0,"M80002  ","419","M  ","M Cascade Trail Low","Navy/Gray","0-21033-48757-6","          ",14,null,{"v":65,"d":"$65.00"},{"v":130,"d":"$130.00"},{"v":129.95,"d":"$129.95"},0,"M80002-419-M  M Cascade Trail Low"," ",{"$f":"--ISNUMBER(IFERROR(SEARCH(Orders!$E18,O265,1),\"\"))","v":1},{"$f":"IF(Q265=1,COUNTIF($Q$2:Q265,1),\"\")","v":264},{"$f":"IFERROR(INDEX($O2:$O986,MATCH(ROWS($Q$2:Q265),$R2:$R986,0)),\"\")","v":"M80002-419-M  M Cascade Trail Low"}]
[4,"M80007  ","001","M  ","M Cascade Trail Mid","Black","0-21033-48934-1","          ",8,null,{"v":75,"d":"$75.00"},{"v":150,"d":"$150.00"},{"v":149.95,"d":"$149.95"},0,"M80007-001-M  M Cascade Trail Mid"," ",{"$f":"--ISNUMBER(IFERROR(SEARCH(Orders!$E18,O266,1),\"\"))","v":1},{"$f":"IF(Q266=1,COUNTIF($Q$2:Q266,1),\"\")","v":265},{"$f":"IFERROR(INDEX($O2:$O986,MATCH(ROWS($Q$2:Q266),$R2:$R986,0)),\"\")","v":"M80007-001-M  M Cascade Trail Mid"}]
[4,"M80007  ","001","M  ","M Cascade Trail Mid","Black","0-21033-48935-8","          ",8.5,null,{"v":75,"d":"$75.00"},{"v":150,"d":"$150.00"},{"v":149.95,"d":"$149.95"},0,"M80007-001-M  M Cascade Trail Mid"," ",{"$f":"--ISNUMBER(IFERROR(SEARCH(Orders!$E18,O267,1),\"\"))","v":1},{"$f":"IF(Q267=1,COUNTIF($Q$2:Q267,1),\"\")","v":266},{"$f":"IFERROR(INDEX($O2:$O986,MATCH(ROWS($Q$2:Q267),$R2:$R986,0)),\"\")","v":"M80007-001-M  M Cascade Trail Mid"}]
[4,"M80007  ","001","M  ","M Cascade Trail Mid","Black","0-21033-48936-5","          ",9,null,{"v":75,"d":"$75.00"},{"v":150,"d":"$150.00"},{"v":149.95,"d":"$149.95"},0,"M80007-001-M  M Cascade Trail Mid"," ",{"$f":"--ISNUMBER(IFERROR(SEARCH(Orders!$E18,O268,1),\"\"))","v":1},{"$f":"IF(Q268=1,COUNTIF($Q$2:Q268,1),\"\")","v":267},{"$f":"IFERROR(INDEX($O2:$O986,MATCH(ROWS($Q$2:Q268),$R2:$R986,0)),\"\")","v":"M80007-001-M  M Cascade Trail Mid"}]
[4,"M80007  ","001","M  ","M Cascade Trail Mid","Black","0-21033-48937-2","          ",9.5,null,{"v":75,"d":"$75.00"},{"v":150,"d":"$150.00"},{"v":149.95,"d":"$149.95"},0,"M80007-001-M  M Cascade Trail Mid"," ",{"$f":"--ISNUMBER(IFERROR(SEARCH(Orders!$E18,O269,1),\"\"))","v":1},{"$f":"IF(Q269=1,COUNTIF($Q$2:Q269,1),\"\")","v":268},{"$f":"IFERROR(INDEX($O2:$O986,MATCH(ROWS($Q$2:Q269),$R2:$R986,0)),\"\")","v":"M80007-001-M  M Cascade Trail Mid"}]
[4,"M80007  ","001","M  ","M Cascade Trail Mid","Black","0-21033-48938-9","          ",10,null,{"v":75,"d":"$75.00"},{"v":150,"d":"$150.00"},{"v":149.95,"d":"$149.95"},0,"M80007-001-M  M Cascade Trail Mid"," ",{"$f":"--ISNUMBER(IFERROR(SEARCH(Orders!$E18,O270,1),\"\"))","v":1},{"$f":"IF(Q270=1,COUNTIF($Q$2:Q270,1),\"\")","v":269},{"$f":"IFERROR(INDEX($O2:$O986,MATCH(ROWS($Q$2:Q270),$R2:$R986,0)),\"\")","v":"M80007-001-M  M Cascade Trail Mid"}]
[4,"M80007  ","001","M  ","M Cascade Trail Mid","Black","0-21033-48939-6","          ",10.5,null,{"v":75,"d":"$75.00"},{"v":150,"d":"$150.00"},{"v":149.95,"d":"$149.95"},0,"M80007-001-M  M Cascade Trail Mid"," ",{"$f":"--ISNUMBER(IFERROR(SEARCH(Orders!$E18,O271,1),\"\"))","v":1},{"$f":"IF(Q271=1,COUNTIF($Q$2:Q271,1),\"\")","v":270},{"$f":"IFERROR(INDEX($O2:$O986,MATCH(ROWS($Q$2:Q271),$R2:$R986,0)),\"\")","v":"M80007-001-M  M Cascade Trail Mid"}]
[4,"M80007  ","001","M  ","M Cascade Trail Mid","Black","0-21033-48940-2","          ",11,null,{"v":75,"d":"$75.00"},{"v":150,"d":"$150.00"},{"v":149.95,"d":"$149.95"},0,"M80007-001-M  M Cascade Trail Mid"," ",{"$f":"--ISNUMBER(IFERROR(SEARCH(Orders!$E18,O272,1),\"\"))","v":1},{"$f":"IF(Q272=1,COUNTIF($Q$2:Q272,1),\"\")","v":271},{"$f":"IFERROR(INDEX($O2:$O986,MATCH(ROWS($Q$2:Q272),$R2:$R986,0)),\"\")","v":"M80007-001-M  M Cascade Trail Mid"}]
[4,"M80007  ","001","M  ","M Cascade Trail Mid","Black","0-21033-48941-9","          ",11.5,null,{"v":75,"d":"$75.00"},{"v":150,"d":"$150.00"},{"v":149.95,"d":"$149.95"},0,"M80007-001-M  M Cascade Trail Mid"," ",{"$f":"--ISNUMBER(IFERROR(SEARCH(Orders!$E18,O273,1),\"\"))","v":1},{"$f":"IF(Q273=1,COUNTIF($Q$2:Q273,1),\"\")","v":272},{"$f":"IFERROR(INDEX($O2:$O986,MATCH(ROWS($Q$2:Q273),$R2:$R986,0)),\"\")","v":"M80007-001-M  M Cascade Trail Mid"}]
[4,"M80007  ","001","M  ","M Cascade Trail Mid","Black","0-21033-48942-6","          ",12,null,{"v":75,"d":"$75.00"},{"v":150,"d":"$150.00"},{"v":149.95,"d":"$149.95"},0,"M80007-001-M  M Cascade Trail Mid"," ",{"$f":"--ISNUMBER(IFERROR(SEARCH(Orders!$E18,O274,1),\"\"))","v":1},{"$f":"IF(Q274=1,COUNTIF($Q$2:Q274,1),\"\")","v":273},{"$f":"IFERROR(INDEX($O2:$O986,MATCH(ROWS($Q$2:Q274),$R2:$R986,0)),\"\")","v":"M80007-001-M  M Cascade Trail Mid"}]
[4,"M80007  ","001","M  ","M Cascade Trail Mid","Black","0-21033-48943-3","          ",12.5,null,{"v":75,"d":"$75.00"},{"v":150,"d":"$150.00"},{"v":149.95,"d":"$149.95"},0,"M80007-001-M  M Cascade Trail Mid"," ",{"$f":"--ISNUMBER(IFERROR(SEARCH(Orders!$E18,O275,1),\"\"))","v":1},{"$f":"IF(Q275=1,COUNTIF($Q$2:Q275,1),\"\")","v":274},{"$f":"IFERROR(INDEX($O2:$O986,MATCH(ROWS($Q$2:Q275),$R2:$R986,0)),\"\")","v":"M80007-001-M  M Cascade Trail Mid"}]
[4,"M80007  ","001","M  ","M Cascade Trail Mid","Black","0-21033-48944-0","          ",13,null,{"v":75,"d":"$75.00"},{"v":150,"d":"$150.00"},{"v":149.95,"d":"$149.95"},0,"M80007-001-M  M Cascade Trail Mid"," ",{"$f":"--ISNUMBER(IFERROR(SEARCH(Orders!$E18,O276,1),\"\"))","v":1},{"$f":"IF(Q276=1,COUNTIF($Q$2:Q276,1),\"\")","v":275},{"$f":"IFERROR(INDEX($O2:$O986,MATCH(ROWS($Q$2:Q276),$R2:$R986,0)),\"\")","v":"M80007-001-M  M Cascade Trail Mid"}]
[4,"M80007  ","001","M  ","M Cascade Trail Mid","Black","0-21033-48945-7","          ",14,null,{"v":75,"d":"$75.00"},{"v":150,"d":"$150.00"},{"v":149.95,"d":"$149.95"},0,"M80007-001-M  M Cascade Trail Mid"," ",{"$f":"--ISNUMBER(IFERROR(SEARCH(Orders!$E18,O277,1),\"\"))","v":1},{"$f":"IF(Q277=1,COUNTIF($Q$2:Q277,1),\"\")","v":276},{"$f":"IFERROR(INDEX($O2:$O986,MATCH(ROWS($Q$2:Q277),$R2:$R986,0)),\"\")","v":"M80007-001-M  M Cascade Trail Mid"}]
[4,"M80007  ","052","M  ","M Cascade Trail Mid","Misty Gray","0-21033-48946-4","          ",8,null,{"v":75,"d":"$75.00"},{"v":150,"d":"$150.00"},{"v":149.95,"d":"$149.95"},0,"M80007-052-M  M Cascade Trail Mid"," ",{"$f":"--ISNUMBER(IFERROR(SEARCH(Orders!$E18,O278,1),\"\"))","v":1},{"$f":"IF(Q278=1,COUNTIF($Q$2:Q278,1),\"\")","v":277},{"$f":"IFERROR(INDEX($O2:$O986,MATCH(ROWS($Q$2:Q278),$R2:$R986,0)),\"\")","v":"M80007-052-M  M Cascade Trail Mid"}]
[4,"M80007  ","052","M  ","M Cascade Trail Mid","Misty Gray","0-21033-48947-1","          ",8.5,null,{"v":75,"d":"$75.00"},{"v":150,"d":"$150.00"},{"v":149.95,"d":"$149.95"},0,"M80007-052-M  M Cascade Trail Mid"," ",{"$f":"--ISNUMBER(IFERROR(SEARCH(Orders!$E18,O279,1),\"\"))","v":1},{"$f":"IF(Q279=1,COUNTIF($Q$2:Q279,1),\"\")","v":278},{"$f":"IFERROR(INDEX($O2:$O986,MATCH(ROWS($Q$2:Q279),$R2:$R986,0)),\"\")","v":"M80007-052-M  M Cascade Trail Mid"}]
[4,"M80007  ","052","M  ","M Cascade Trail Mid","Misty Gray","0-21033-48948-8","          ",9,null,{"v":75,"d":"$75.00"},{"v":150,"d":"$150.00"},{"v":149.95,"d":"$149.95"},0,"M80007-052-M  M Cascade Trail Mid"," ",{"$f":"--ISNUMBER(IFERROR(SEARCH(Orders!$E18,O280,1),\"\"))","v":1},{"$f":"IF(Q280=1,COUNTIF($Q$2:Q280,1),\"\")","v":279},{"$f":"IFERROR(INDEX($O2:$O986,MATCH(ROWS($Q$2:Q280),$R2:$R986,0)),\"\")","v":"M80007-052-M  M Cascade Trail Mid"}]
[4,"M80007  ","052","M  ","M Cascade Trail Mid","Misty Gray","0-21033-48949-5","          ",9.5,null,{"v":75,"d":"$75.00"},{"v":150,"d":"$150.00"},{"v":149.95,"d":"$149.95"},0,"M80007-052-M  M Cascade Trail Mid"," ",{"$f":"--ISNUMBER(IFERROR(SEARCH(Orders!$E18,O281,1),\"\"))","v":1},{"$f":"IF(Q281=1,COUNTIF($Q$2:Q281,1),\"\")","v":280},{"$f":"IFERROR(INDEX($O2:$O986,MATCH(ROWS($Q$2:Q281),$R2:$R986,0)),\"\")","v":"M80007-052-M  M Cascade Trail Mid"}]
[4,"M80007  ","052","M  ","M Cascade Trail Mid","Misty Gray","0-21033-48950-1","          ",10,null,{"v":75,"d":"$75.00"},{"v":150,"d":"$150.00"},{"v":149.95,"d":"$149.95"},0,"M80007-052-M  M Cascade Trail Mid"," ",{"$f":"--ISNUMBER(IFERROR(SEARCH(Orders!$E18,O282,1),\"\"))","v":1},{"$f":"IF(Q282=1,COUNTIF($Q$2:Q282,1),\"\")","v":281},{"$f":"IFERROR(INDEX($O2:$O986,MATCH(ROWS($Q$2:Q282),$R2:$R986,0)),\"\")","v":"M80007-052-M  M Cascade Trail Mid"}]
[4,"M80007  ","052","M  ","M Cascade Trail Mid","Misty Gray","0-21033-48951-8","          ",10.5,null,{"v":75,"d":"$75.00"},{"v":150,"d":"$150.00"},{"v":149.95,"d":"$149.95"},0,"M80007-052-M  M Cascade Trail Mid"," ",{"$f":"--ISNUMBER(IFERROR(SEARCH(Orders!$E18,O283,1),\"\"))","v":1},{"$f":"IF(Q283=1,COUNTIF($Q$2:Q283,1),\"\")","v":282},{"$f":"IFERROR(INDEX($O2:$O986,MATCH(ROWS($Q$2:Q283),$R2:$R986,0)),\"\")","v":"M80007-052-M  M Cascade Trail Mid"}]
[4,"M80007  ","052","M  ","M Cascade Trail Mid","Misty Gray","0-21033-48952-5","          ",11,null,{"v":75,"d":"$75.00"},{"v":150,"d":"$150.00"},{"v":149.95,"d":"$149.95"},0,"M80007-052-M  M Cascade Trail Mid"," ",{"$f":"--ISNUMBER(IFERROR(SEARCH(Orders!$E18,O284,1),\"\"))","v":1},{"$f":"IF(Q284=1,COUNTIF($Q$2:Q284,1),\"\")","v":283},{"$f":"IFERROR(INDEX($O2:$O986,MATCH(ROWS($Q$2:Q284),$R2:$R986,0)),\"\")","v":"M80007-052-M  M Cascade Trail Mid"}]
[4,"M80007  ","052","M  ","M Cascade Trail Mid","Misty Gray","0-21033-48953-2","          ",11.5,null,{"v":75,"d":"$75.00"},{"v":150,"d":"$150.00"},{"v":149.95,"d":"$149.95"},0,"M80007-052-M  M Cascade Trail Mid"," ",{"$f":"--ISNUMBER(IFERROR(SEARCH(Orders!$E18,O285,1),\"\"))","v":1},{"$f":"IF(Q285=1,COUNTIF($Q$2:Q285,1),\"\")","v":284},{"$f":"IFERROR(INDEX($O2:$O986,MATCH(ROWS($Q$2:Q285),$R2:$R986,0)),\"\")","v":"M80007-052-M  M Cascade Trail Mid"}]
[4,"M80007  ","052","M  ","M Cascade Trail Mid","Misty Gray","0-21033-48954-9","          ",12,null,{"v":75,"d":"$75.00"},{"v":150,"d":"$150.00"},{"v":149.95,"d":"$149.95"},0,"M80007-052-M  M Cascade Trail Mid"," ",{"$f":"--ISNUMBER(IFERROR(SEARCH(Orders!$E18,O286,1),\"\"))","v":1},{"$f":"IF(Q286=1,COUNTIF($Q$2:Q286,1),\"\")","v":285},{"$f":"IFERROR(INDEX($O2:$O986,MATCH(ROWS($Q$2:Q286),$R2:$R986,0)),\"\")","v":"M80007-052-M  M Cascade Trail Mid"}]
[4,"M80007  ","052","M  ","M Cascade Trail Mid","Misty Gray","0-21033-48955-6","          ",12.5,null,{"v":75,"d":"$75.00"},{"v":150,"d":"$150.00"},{"v":149.95,"d":"$149.95"},0,"M80007-052-M  M Cascade Trail Mid"," ",{"$f":"--ISNUMBER(IFERROR(SEARCH(Orders!$E18,O287,1),\"\"))","v":1},{"$f":"IF(Q287=1,COUNTIF($Q$2:Q287,1),\"\")","v":286},{"$f":"IFERROR(INDEX($O2:$O986,MATCH(ROWS($Q$2:Q287),$R2:$R986,0)),\"\")","v":"M80007-052-M  M Cascade Trail Mid"}]
[4,"M80007  ","052","M  ","M Cascade Trail Mid","Misty Gray","0-21033-48956-3","          ",13,null,{"v":75,"d":"$75.00"},{"v":150,"d":"$150.00"},{"v":149.95,"d":"$149.95"},0,"M80007-052-M  M Cascade Trail Mid"," ",{"$f":"--ISNUMBER(IFERROR(SEARCH(Orders!$E18,O288,1),\"\"))","v":1},{"$f":"IF(Q288=1,COUNTIF($Q$2:Q288,1),\"\")","v":287},{"$f":"IFERROR(INDEX($O2:$O986,MATCH(ROWS($Q$2:Q288),$R2:$R986,0)),\"\")","v":"M80007-052-M  M Cascade Trail Mid"}]
[4,"M80007  ","052","M  ","M Cascade Trail Mid","Misty Gray","0-21033-48957-0","          ",14,null,{"v":75,"d":"$75.00"},{"v":150,"d":"$150.00"},{"v":149.95,"d":"$149.95"},0,"M80007-052-M  M Cascade Trail Mid"," ",{"$f":"--ISNUMBER(IFERROR(SEARCH(Orders!$E18,O289,1),\"\"))","v":1},{"$f":"IF(Q289=1,COUNTIF($Q$2:Q289,1),\"\")","v":288},{"$f":"IFERROR(INDEX($O2:$O986,MATCH(ROWS($Q$2:Q289),$R2:$R986,0)),\"\")","v":"M80007-052-M  M Cascade Trail Mid"}]
[4,"M80007  ","349","M  ","M Cascade Trail Mid","Lodenmulti","0-21033-48970-9","          ",8,null,{"v":75,"d":"$75.00"},{"v":150,"d":"$150.00"},{"v":149.95,"d":"$149.95"},0,"M80007-349-M  M Cascade Trail Mid"," ",{"$f":"--ISNUMBER(IFERROR(SEARCH(Orders!$E18,O290,1),\"\"))","v":1},{"$f":"IF(Q290=1,COUNTIF($Q$2:Q290,1),\"\")","v":289},{"$f":"IFERROR(INDEX($O2:$O986,MATCH(ROWS($Q$2:Q290),$R2:$R986,0)),\"\")","v":"M80007-349-M  M Cascade Trail Mid"}]
[4,"M80007  ","349","M  ","M Cascade Trail Mid","Lodenmulti","0-21033-48971-6","          ",8.5,null,{"v":75,"d":"$75.00"},{"v":150,"d":"$150.00"},{"v":149.95,"d":"$149.95"},0,"M80007-349-M  M Cascade Trail Mid"," ",{"$f":"--ISNUMBER(IFERROR(SEARCH(Orders!$E18,O291,1),\"\"))","v":1},{"$f":"IF(Q291=1,COUNTIF($Q$2:Q291,1),\"\")","v":290},{"$f":"IFERROR(INDEX($O2:$O986,MATCH(ROWS($Q$2:Q291),$R2:$R986,0)),\"\")","v":"M80007-349-M  M Cascade Trail Mid"}]
[4,"M80007  ","349","M  ","M Cascade Trail Mid","Lodenmulti","0-21033-48972-3","          ",9,null,{"v":75,"d":"$75.00"},{"v":150,"d":"$150.00"},{"v":149.95,"d":"$149.95"},0,"M80007-349-M  M Cascade Trail Mid"," ",{"$f":"--ISNUMBER(IFERROR(SEARCH(Orders!$E18,O292,1),\"\"))","v":1},{"$f":"IF(Q292=1,COUNTIF($Q$2:Q292,1),\"\")","v":291},{"$f":"IFERROR(INDEX($O2:$O986,MATCH(ROWS($Q$2:Q292),$R2:$R986,0)),\"\")","v":"M80007-349-M  M Cascade Trail Mid"}]
[4,"M80007  ","349","M  ","M Cascade Trail Mid","Lodenmulti","0-21033-48973-0","          ",9.5,null,{"v":75,"d":"$75.00"},{"v":150,"d":"$150.00"},{"v":149.95,"d":"$149.95"},0,"M80007-349-M  M Cascade Trail Mid"," ",{"$f":"--ISNUMBER(IFERROR(SEARCH(Orders!$E18,O293,1),\"\"))","v":1},{"$f":"IF(Q293=1,COUNTIF($Q$2:Q293,1),\"\")","v":292},{"$f":"IFERROR(INDEX($O2:$O986,MATCH(ROWS($Q$2:Q293),$R2:$R986,0)),\"\")","v":"M80007-349-M  M Cascade Trail Mid"}]
[4,"M80007  ","349","M  ","M Cascade Trail Mid","Lodenmulti","0-21033-48974-7","          ",10,null,{"v":75,"d":"$75.00"},{"v":150,"d":"$150.00"},{"v":149.95,"d":"$149.95"},0,"M80007-349-M  M Cascade Trail Mid"," ",{"$f":"--ISNUMBER(IFERROR(SEARCH(Orders!$E18,O294,1),\"\"))","v":1},{"$f":"IF(Q294=1,COUNTIF($Q$2:Q294,1),\"\")","v":293},{"$f":"IFERROR(INDEX($O2:$O986,MATCH(ROWS($Q$2:Q294),$R2:$R986,0)),\"\")","v":"M80007-349-M  M Cascade Trail Mid"}]
[4,"M80007  ","349","M  ","M Cascade Trail Mid","Lodenmulti","0-21033-48975-4","          ",10.5,null,{"v":75,"d":"$75.00"},{"v":150,"d":"$150.00"},{"v":149.95,"d":"$149.95"},0,"M80007-349-M  M Cascade Trail Mid"," ",{"$f":"--ISNUMBER(IFERROR(SEARCH(Orders!$E18,O295,1),\"\"))","v":1},{"$f":"IF(Q295=1,COUNTIF($Q$2:Q295,1),\"\")","v":294},{"$f":"IFERROR(INDEX($O2:$O986,MATCH(ROWS($Q$2:Q295),$R2:$R986,0)),\"\")","v":"M80007-349-M  M Cascade Trail Mid"}]
[4,"M80007  ","349","M  ","M Cascade Trail Mid","Lodenmulti","0-21033-48976-1","          ",11,null,{"v":75,"d":"$75.00"},{"v":150,"d":"$150.00"},{"v":149.95,"d":"$149.95"},0,"M80007-349-M  M Cascade Trail Mid"," ",{"$f":"--ISNUMBER(IFERROR(SEARCH(Orders!$E18,O296,1),\"\"))","v":1},{"$f":"IF(Q296=1,COUNTIF($Q$2:Q296,1),\"\")","v":295},{"$f":"IFERROR(INDEX($O2:$O986,MATCH(ROWS($Q$2:Q296),$R2:$R986,0)),\"\")","v":"M80007-349-M  M Cascade Trail Mid"}]
[4,"M80007  ","349","M  ","M Cascade Trail Mid","Lodenmulti","0-21033-48977-8","          ",11.5,null,{"v":75,"d":"$75.00"},{"v":150,"d":"$150.00"},{"v":149.95,"d":"$149.95"},0,"M80007-349-M  M Cascade Trail Mid"," ",{"$f":"--ISNUMBER(IFERROR(SEARCH(Orders!$E18,O297,1),\"\"))","v":1},{"$f":"IF(Q297=1,COUNTIF($Q$2:Q297,1),\"\")","v":296},{"$f":"IFERROR(INDEX($O2:$O986,MATCH(ROWS($Q$2:Q297),$R2:$R986,0)),\"\")","v":"M80007-349-M  M Cascade Trail Mid"}]
[4,"M80007  ","349","M  ","M Cascade Trail Mid","Lodenmulti","0-21033-48978-5","          ",12,null,{"v":75,"d":"$75.00"},{"v":150,"d":"$150.00"},{"v":149.95,"d":"$149.95"},0,"M80007-349-M  M Cascade Trail Mid"," ",{"$f":"--ISNUMBER(IFERROR(SEARCH(Orders!$E18,O298,1),\"\"))","v":1},{"$f":"IF(Q298=1,COUNTIF($Q$2:Q298,1),\"\")","v":297},{"$f":"IFERROR(INDEX($O2:$O986,MATCH(ROWS($Q$2:Q298),$R2:$R986,0)),\"\")","v":"M80007-349-M  M Cascade Trail Mid"}]
[4,"M80007  ","349","M  ","M Cascade Trail Mid","Lodenmulti","0-21033-48979-2","          ",12.5,null,{"v":75,"d":"$75.00"},{"v":150,"d":"$150.00"},{"v":149.95,"d":"$149.95"},0,"M80007-349-M  M Cascade Trail Mid"," ",{"$f":"--ISNUMBER(IFERROR(SEARCH(Orders!$E18,O299,1),\"\"))","v":1},{"$f":"IF(Q299=1,COUNTIF($Q$2:Q299,1),\"\")","v":298},{"$f":"IFERROR(INDEX($O2:$O986,MATCH(ROWS($Q$2:Q299),$R2:$R986,0)),\"\")","v":"M80007-349-M  M Cascade Trail Mid"}]
[4,"M80007  ","349","M  ","M Cascade Trail Mid","Lodenmulti","0-21033-48980-8","          ",13,null,{"v":75,"d":"$75.00"},{"v":150,"d":"$150.00"},{"v":149.95,"d":"$149.95"},0,"M80007-349-M  M Cascade Trail Mid"," ",{"$f":"--ISNUMBER(IFERROR(SEARCH(Orders!$E18,O300,1),\"\"))","v":1},{"$f":"IF(Q300=1,COUNTIF($Q$2:Q300,1),\"\")","v":299},{"$f":"IFERROR(INDEX($O2:$O986,MATCH(ROWS($Q$2:Q300),$R2:$R986,0)),\"\")","v":"M80007-349-M  M Cascade Trail Mid"}]
[4,"M80007  ","349","M  ","M Cascade Trail Mid","Lodenmulti","0-21033-48981-5","          ",14,null,{"v":75,"d":"$75.00"},{"v":150,"d":"$150.00"},{"v":149.95,"d":"$149.95"},0,"M80007-349-M  M Cascade Trail Mid"," ",{"$f":"--ISNUMBER(IFERROR(SEARCH(Orders!$E18,O301,1),\"\"))","v":1},{"$f":"IF(Q301=1,COUNTIF($Q$2:Q301,1),\"\")","v":300},{"$f":"IFERROR(INDEX($O2:$O986,MATCH(ROWS($Q$2:Q301),$R2:$R986,0)),\"\")","v":"M80007-349-M  M Cascade Trail Mid"}]
[7,"M80008  ","001","M  ","M Banks Mid","Black","0-21033-48982-2","          ",8,null,{"v":77.5,"d":"$77.50"},{"v":155,"d":"$155.00"},{"v":154.95,"d":"$154.95"},0,"M80008-001-M  M Banks Mid"," ",{"$f":"--ISNUMBER(IFERROR(SEARCH(Orders!$E18,O302,1),\"\"))","v":1},{"$f":"IF(Q302=1,COUNTIF($Q$2:Q302,1),\"\")","v":301},{"$f":"IFERROR(INDEX($O2:$O986,MATCH(ROWS($Q$2:Q302),$R2:$R986,0)),\"\")","v":"M80008-001-M  M Banks Mid"}]
[7,"M80008  ","001","M  ","M Banks Mid","Black","0-21033-48983-9","          ",8.5,null,{"v":77.5,"d":"$77.50"},{"v":155,"d":"$155.00"},{"v":154.95,"d":"$154.95"},0,"M80008-001-M  M Banks Mid"," ",{"$f":"--ISNUMBER(IFERROR(SEARCH(Orders!$E18,O303,1),\"\"))","v":1},{"$f":"IF(Q303=1,COUNTIF($Q$2:Q303,1),\"\")","v":302},{"$f":"IFERROR(INDEX($O2:$O986,MATCH(ROWS($Q$2:Q303),$R2:$R986,0)),\"\")","v":"M80008-001-M  M Banks Mid"}]
[7,"M80008  ","001","M  ","M Banks Mid","Black","0-21033-48984-6","          ",9,null,{"v":77.5,"d":"$77.50"},{"v":155,"d":"$155.00"},{"v":154.95,"d":"$154.95"},0,"M80008-001-M  M Banks Mid"," ",{"$f":"--ISNUMBER(IFERROR(SEARCH(Orders!$E18,O304,1),\"\"))","v":1},{"$f":"IF(Q304=1,COUNTIF($Q$2:Q304,1),\"\")","v":303},{"$f":"IFERROR(INDEX($O2:$O986,MATCH(ROWS($Q$2:Q304),$R2:$R986,0)),\"\")","v":"M80008-001-M  M Banks Mid"}]
[7,"M80008  ","001","M  ","M Banks Mid","Black","0-21033-48985-3","          ",9.5,null,{"v":77.5,"d":"$77.50"},{"v":155,"d":"$155.00"},{"v":154.95,"d":"$154.95"},0,"M80008-001-M  M Banks Mid"," ",{"$f":"--ISNUMBER(IFERROR(SEARCH(Orders!$E18,O305,1),\"\"))","v":1},{"$f":"IF(Q305=1,COUNTIF($Q$2:Q305,1),\"\")","v":304},{"$f":"IFERROR(INDEX($O2:$O986,MATCH(ROWS($Q$2:Q305),$R2:$R986,0)),\"\")","v":"M80008-001-M  M Banks Mid"}]
[7,"M80008  ","001","M  ","M Banks Mid","Black","0-21033-48986-0","          ",10,null,{"v":77.5,"d":"$77.50"},{"v":155,"d":"$155.00"},{"v":154.95,"d":"$154.95"},0,"M80008-001-M  M Banks Mid"," ",{"$f":"--ISNUMBER(IFERROR(SEARCH(Orders!$E18,O306,1),\"\"))","v":1},{"$f":"IF(Q306=1,COUNTIF($Q$2:Q306,1),\"\")","v":305},{"$f":"IFERROR(INDEX($O2:$O986,MATCH(ROWS($Q$2:Q306),$R2:$R986,0)),\"\")","v":"M80008-001-M  M Banks Mid"}]
[7,"M80008  ","001","M  ","M Banks Mid","Black","0-21033-48987-7","          ",10.5,null,{"v":77.5,"d":"$77.50"},{"v":155,"d":"$155.00"},{"v":154.95,"d":"$154.95"},0,"M80008-001-M  M Banks Mid"," ",{"$f":"--ISNUMBER(IFERROR(SEARCH(Orders!$E18,O307,1),\"\"))","v":1},{"$f":"IF(Q307=1,COUNTIF($Q$2:Q307,1),\"\")","v":306},{"$f":"IFERROR(INDEX($O2:$O986,MATCH(ROWS($Q$2:Q307),$R2:$R986,0)),\"\")","v":"M80008-001-M  M Banks Mid"}]
[7,"M80008  ","001","M  ","M Banks Mid","Black","0-21033-48988-4","          ",11,null,{"v":77.5,"d":"$77.50"},{"v":155,"d":"$155.00"},{"v":154.95,"d":"$154.95"},0,"M80008-001-M  M Banks Mid"," ",{"$f":"--ISNUMBER(IFERROR(SEARCH(Orders!$E18,O308,1),\"\"))","v":1},{"$f":"IF(Q308=1,COUNTIF($Q$2:Q308,1),\"\")","v":307},{"$f":"IFERROR(INDEX($O2:$O986,MATCH(ROWS($Q$2:Q308),$R2:$R986,0)),\"\")","v":"M80008-001-M  M Banks Mid"}]
[7,"M80008  ","001","M  ","M Banks Mid","Black","0-21033-48989-1","          ",11.5,null,{"v":77.5,"d":"$77.50"},{"v":155,"d":"$155.00"},{"v":154.95,"d":"$154.95"},0,"M80008-001-M  M Banks Mid"," ",{"$f":"--ISNUMBER(IFERROR(SEARCH(Orders!$E18,O309,1),\"\"))","v":1},{"$f":"IF(Q309=1,COUNTIF($Q$2:Q309,1),\"\")","v":308},{"$f":"IFERROR(INDEX($O2:$O986,MATCH(ROWS($Q$2:Q309),$R2:$R986,0)),\"\")","v":"M80008-001-M  M Banks Mid"}]
[7,"M80008  ","001","M  ","M Banks Mid","Black","0-21033-48990-7","          ",12,null,{"v":77.5,"d":"$77.50"},{"v":155,"d":"$155.00"},{"v":154.95,"d":"$154.95"},0,"M80008-001-M  M Banks Mid"," ",{"$f":"--ISNUMBER(IFERROR(SEARCH(Orders!$E18,O310,1),\"\"))","v":1},{"$f":"IF(Q310=1,COUNTIF($Q$2:Q310,1),\"\")","v":309},{"$f":"IFERROR(INDEX($O2:$O986,MATCH(ROWS($Q$2:Q310),$R2:$R986,0)),\"\")","v":"M80008-001-M  M Banks Mid"}]
[7,"M80008  ","001","M  ","M Banks Mid","Black","0-21033-48991-4","          ",12.5,null,{"v":77.5,"d":"$77.50"},{"v":155,"d":"$155.00"},{"v":154.95,"d":"$154.95"},0,"M80008-001-M  M Banks Mid"," ",{"$f":"--ISNUMBER(IFERROR(SEARCH(Orders!$E18,O311,1),\"\"))","v":1},{"$f":"IF(Q311=1,COUNTIF($Q$2:Q311,1),\"\")","v":310},{"$f":"IFERROR(INDEX($O2:$O986,MATCH(ROWS($Q$2:Q311),$R2:$R986,0)),\"\")","v":"M80008-001-M  M Banks Mid"}]
[7,"M80008  ","001","M  ","M Banks Mid","Black","0-21033-48992-1","          ",13,null,{"v":77.5,"d":"$77.50"},{"v":155,"d":"$155.00"},{"v":154.95,"d":"$154.95"},0,"M80008-001-M  M Banks Mid"," ",{"$f":"--ISNUMBER(IFERROR(SEARCH(Orders!$E18,O312,1),\"\"))","v":1},{"$f":"IF(Q312=1,COUNTIF($Q$2:Q312,1),\"\")","v":311},{"$f":"IFERROR(INDEX($O2:$O986,MATCH(ROWS($Q$2:Q312),$R2:$R986,0)),\"\")","v":"M80008-001-M  M Banks Mid"}]
[7,"M80008  ","001","M  ","M Banks Mid","Black","0-21033-48993-8","          ",14,null,{"v":77.5,"d":"$77.50"},{"v":155,"d":"$155.00"},{"v":154.95,"d":"$154.95"},0,"M80008-001-M  M Banks Mid"," ",{"$f":"--ISNUMBER(IFERROR(SEARCH(Orders!$E18,O313,1),\"\"))","v":1},{"$f":"IF(Q313=1,COUNTIF($Q$2:Q313,1),\"\")","v":312},{"$f":"IFERROR(INDEX($O2:$O986,MATCH(ROWS($Q$2:Q313),$R2:$R986,0)),\"\")","v":"M80008-001-M  M Banks Mid"}]
[7,"M80008  ","349","M  ","M Banks Mid","Lodenmulti","0-21033-49006-4","          ",8,null,{"v":77.5,"d":"$77.50"},{"v":155,"d":"$155.00"},{"v":154.95,"d":"$154.95"},0,"M80008-349-M  M Banks Mid"," ",{"$f":"--ISNUMBER(IFERROR(SEARCH(Orders!$E18,O314,1),\"\"))","v":1},{"$f":"IF(Q314=1,COUNTIF($Q$2:Q314,1),\"\")","v":313},{"$f":"IFERROR(INDEX($O2:$O986,MATCH(ROWS($Q$2:Q314),$R2:$R986,0)),\"\")","v":"M80008-349-M  M Banks Mid"}]
[7,"M80008  ","349","M  ","M Banks Mid","Lodenmulti","0-21033-49007-1","          ",8.5,null,{"v":77.5,"d":"$77.50"},{"v":155,"d":"$155.00"},{"v":154.95,"d":"$154.95"},0,"M80008-349-M  M Banks Mid"," ",{"$f":"--ISNUMBER(IFERROR(SEARCH(Orders!$E18,O315,1),\"\"))","v":1},{"$f":"IF(Q315=1,COUNTIF($Q$2:Q315,1),\"\")","v":314},{"$f":"IFERROR(INDEX($O2:$O986,MATCH(ROWS($Q$2:Q315),$R2:$R986,0)),\"\")","v":"M80008-349-M  M Banks Mid"}]
[7,"M80008  ","349","M  ","M Banks Mid","Lodenmulti","0-21033-49008-8","          ",9,null,{"v":77.5,"d":"$77.50"},{"v":155,"d":"$155.00"},{"v":154.95,"d":"$154.95"},0,"M80008-349-M  M Banks Mid"," ",{"$f":"--ISNUMBER(IFERROR(SEARCH(Orders!$E18,O316,1),\"\"))","v":1},{"$f":"IF(Q316=1,COUNTIF($Q$2:Q316,1),\"\")","v":315},{"$f":"IFERROR(INDEX($O2:$O986,MATCH(ROWS($Q$2:Q316),$R2:$R986,0)),\"\")","v":"M80008-349-M  M Banks Mid"}]
[7,"M80008  ","349","M  ","M Banks Mid","Lodenmulti","0-21033-49009-5","          ",9.5,null,{"v":77.5,"d":"$77.50"},{"v":155,"d":"$155.00"},{"v":154.95,"d":"$154.95"},0,"M80008-349-M  M Banks Mid"," ",{"$f":"--ISNUMBER(IFERROR(SEARCH(Orders!$E18,O317,1),\"\"))","v":1},{"$f":"IF(Q317=1,COUNTIF($Q$2:Q317,1),\"\")","v":316},{"$f":"IFERROR(INDEX($O2:$O986,MATCH(ROWS($Q$2:Q317),$R2:$R986,0)),\"\")","v":"M80008-349-M  M Banks Mid"}]
[7,"M80008  ","349","M  ","M Banks Mid","Lodenmulti","0-21033-49010-1","          ",10,null,{"v":77.5,"d":"$77.50"},{"v":155,"d":"$155.00"},{"v":154.95,"d":"$154.95"},0,"M80008-349-M  M Banks Mid"," ",{"$f":"--ISNUMBER(IFERROR(SEARCH(Orders!$E18,O318,1),\"\"))","v":1},{"$f":"IF(Q318=1,COUNTIF($Q$2:Q318,1),\"\")","v":317},{"$f":"IFERROR(INDEX($O2:$O986,MATCH(ROWS($Q$2:Q318),$R2:$R986,0)),\"\")","v":"M80008-349-M  M Banks Mid"}]
[7,"M80008  ","349","M  ","M Banks Mid","Lodenmulti","0-21033-49011-8","          ",10.5,null,{"v":77.5,"d":"$77.50"},{"v":155,"d":"$155.00"},{"v":154.95,"d":"$154.95"},0,"M80008-349-M  M Banks Mid"," ",{"$f":"--ISNUMBER(IFERROR(SEARCH(Orders!$E18,O319,1),\"\"))","v":1},{"$f":"IF(Q319=1,COUNTIF($Q$2:Q319,1),\"\")","v":318},{"$f":"IFERROR(INDEX($O2:$O986,MATCH(ROWS($Q$2:Q319),$R2:$R986,0)),\"\")","v":"M80008-349-M  M Banks Mid"}]
[7,"M80008  ","349","M  ","M Banks Mid","Lodenmulti","0-21033-49012-5","          ",11,null,{"v":77.5,"d":"$77.50"},{"v":155,"d":"$155.00"},{"v":154.95,"d":"$154.95"},0,"M80008-349-M  M Banks Mid"," ",{"$f":"--ISNUMBER(IFERROR(SEARCH(Orders!$E18,O320,1),\"\"))","v":1},{"$f":"IF(Q320=1,COUNTIF($Q$2:Q320,1),\"\")","v":319},{"$f":"IFERROR(INDEX($O2:$O986,MATCH(ROWS($Q$2:Q320),$R2:$R986,0)),\"\")","v":"M80008-349-M  M Banks Mid"}]
[7,"M80008  ","349","M  ","M Banks Mid","Lodenmulti","0-21033-49013-2","          ",11.5,null,{"v":77.5,"d":"$77.50"},{"v":155,"d":"$155.00"},{"v":154.95,"d":"$154.95"},0,"M80008-349-M  M Banks Mid"," ",{"$f":"--ISNUMBER(IFERROR(SEARCH(Orders!$E18,O321,1),\"\"))","v":1},{"$f":"IF(Q321=1,COUNTIF($Q$2:Q321,1),\"\")","v":320},{"$f":"IFERROR(INDEX($O2:$O986,MATCH(ROWS($Q$2:Q321),$R2:$R986,0)),\"\")","v":"M80008-349-M  M Banks Mid"}]
[7,"M80008  ","349","M  ","M Banks Mid","Lodenmulti","0-21033-49014-9","          ",12,null,{"v":77.5,"d":"$77.50"},{"v":155,"d":"$155.00"},{"v":154.95,"d":"$154.95"},{"$f":"J322*K322","v":0},"M80008-349-M  M Banks Mid"," ",{"$f":"--ISNUMBER(IFERROR(SEARCH(Orders!$E18,O322,1),\"\"))","v":1},{"$f":"IF(Q322=1,COUNTIF($Q$2:Q322,1),\"\")","v":321},{"$f":"IFERROR(INDEX($O2:$O986,MATCH(ROWS($Q$2:Q322),$R2:$R986,0)),\"\")","v":"M80008-349-M  M Banks Mid"}]
[7,"M80008  ","349","M  ","M Banks Mid","Lodenmulti","0-21033-49015-6","          ",12.5,null,{"v":77.5,"d":"$77.50"},{"v":155,"d":"$155.00"},{"v":154.95,"d":"$154.95"},0,"M80008-349-M  M Banks Mid"," ",{"$f":"--ISNUMBER(IFERROR(SEARCH(Orders!$E18,O323,1),\"\"))","v":1},{"$f":"IF(Q323=1,COUNTIF($Q$2:Q323,1),\"\")","v":322},{"$f":"IFERROR(INDEX($O2:$O986,MATCH(ROWS($Q$2:Q323),$R2:$R986,0)),\"\")","v":"M80008-349-M  M Banks Mid"}]
[7,"M80008  ","349","M  ","M Banks Mid","Lodenmulti","0-21033-49016-3","          ",13,null,{"v":77.5,"d":"$77.50"},{"v":155,"d":"$155.00"},{"v":154.95,"d":"$154.95"},0,"M80008-349-M  M Banks Mid"," ",{"$f":"--ISNUMBER(IFERROR(SEARCH(Orders!$E18,O324,1),\"\"))","v":1},{"$f":"IF(Q324=1,COUNTIF($Q$2:Q324,1),\"\")","v":323},{"$f":"IFERROR(INDEX($O2:$O986,MATCH(ROWS($Q$2:Q324),$R2:$R986,0)),\"\")","v":"M80008-349-M  M Banks Mid"}]
[7,"M80008  ","349","M  ","M Banks Mid","Lodenmulti","0-21033-49017-0","          ",14,null,{"v":77.5,"d":"$77.50"},{"v":155,"d":"$155.00"},{"v":154.95,"d":"$154.95"},0,"M80008-349-M  M Banks Mid"," ",{"$f":"--ISNUMBER(IFERROR(SEARCH(Orders!$E18,O325,1),\"\"))","v":1},{"$f":"IF(Q325=1,COUNTIF($Q$2:Q325,1),\"\")","v":324},{"$f":"IFERROR(INDEX($O2:$O986,MATCH(ROWS($Q$2:Q325),$R2:$R986,0)),\"\")","v":"M80008-349-M  M Banks Mid"}]
[7,"M80008  ","492","M  ","M Banks Mid","Navy Multi","0-21033-49449-9","          ",8,null,{"v":77.5,"d":"$77.50"},{"v":155,"d":"$155.00"},{"v":154.95,"d":"$154.95"},0,"M80008-492-M  M Banks Mid"," ",{"$f":"--ISNUMBER(IFERROR(SEARCH(Orders!$E18,O326,1),\"\"))","v":1},{"$f":"IF(Q326=1,COUNTIF($Q$2:Q326,1),\"\")","v":325},{"$f":"IFERROR(INDEX($O2:$O986,MATCH(ROWS($Q$2:Q326),$R2:$R986,0)),\"\")","v":"M80008-492-M  M Banks Mid"}]
[7,"M80008  ","492","M  ","M Banks Mid","Navy Multi","0-21033-49450-5","          ",8.5,null,{"v":77.5,"d":"$77.50"},{"v":155,"d":"$155.00"},{"v":154.95,"d":"$154.95"},0,"M80008-492-M  M Banks Mid"," ",{"$f":"--ISNUMBER(IFERROR(SEARCH(Orders!$E18,O327,1),\"\"))","v":1},{"$f":"IF(Q327=1,COUNTIF($Q$2:Q327,1),\"\")","v":326},{"$f":"IFERROR(INDEX($O2:$O986,MATCH(ROWS($Q$2:Q327),$R2:$R986,0)),\"\")","v":"M80008-492-M  M Banks Mid"}]
[7,"M80008  ","492","M  ","M Banks Mid","Navy Multi","0-21033-49451-2","          ",9,null,{"v":77.5,"d":"$77.50"},{"v":155,"d":"$155.00"},{"v":154.95,"d":"$154.95"},0,"M80008-492-M  M Banks Mid"," ",{"$f":"--ISNUMBER(IFERROR(SEARCH(Orders!$E18,O328,1),\"\"))","v":1},{"$f":"IF(Q328=1,COUNTIF($Q$2:Q328,1),\"\")","v":327},{"$f":"IFERROR(INDEX($O2:$O986,MATCH(ROWS($Q$2:Q328),$R2:$R986,0)),\"\")","v":"M80008-492-M  M Banks Mid"}]
[7,"M80008  ","492","M  ","M Banks Mid","Navy Multi","0-21033-49452-9","          ",9.5,null,{"v":77.5,"d":"$77.50"},{"v":155,"d":"$155.00"},{"v":154.95,"d":"$154.95"},0,"M80008-492-M  M Banks Mid"," ",{"$f":"--ISNUMBER(IFERROR(SEARCH(Orders!$E18,O329,1),\"\"))","v":1},{"$f":"IF(Q329=1,COUNTIF($Q$2:Q329,1),\"\")","v":328},{"$f":"IFERROR(INDEX($O2:$O986,MATCH(ROWS($Q$2:Q329),$R2:$R986,0)),\"\")","v":"M80008-492-M  M Banks Mid"}]
[7,"M80008  ","492","M  ","M Banks Mid","Navy Multi","0-21033-49453-6","          ",10,null,{"v":77.5,"d":"$77.50"},{"v":155,"d":"$155.00"},{"v":154.95,"d":"$154.95"},0,"M80008-492-M  M Banks Mid"," ",{"$f":"--ISNUMBER(IFERROR(SEARCH(Orders!$E18,O330,1),\"\"))","v":1},{"$f":"IF(Q330=1,COUNTIF($Q$2:Q330,1),\"\")","v":329},{"$f":"IFERROR(INDEX($O2:$O986,MATCH(ROWS($Q$2:Q330),$R2:$R986,0)),\"\")","v":"M80008-492-M  M Banks Mid"}]
[7,"M80008  ","492","M  ","M Banks Mid","Navy Multi","0-21033-49454-3","          ",10.5,null,{"v":77.5,"d":"$77.50"},{"v":155,"d":"$155.00"},{"v":154.95,"d":"$154.95"},0,"M80008-492-M  M Banks Mid"," ",{"$f":"--ISNUMBER(IFERROR(SEARCH(Orders!$E18,O331,1),\"\"))","v":1},{"$f":"IF(Q331=1,COUNTIF($Q$2:Q331,1),\"\")","v":330},{"$f":"IFERROR(INDEX($O2:$O986,MATCH(ROWS($Q$2:Q331),$R2:$R986,0)),\"\")","v":"M80008-492-M  M Banks Mid"}]
[7,"M80008  ","492","M  ","M Banks Mid","Navy Multi","0-21033-49455-0","          ",11,null,{"v":77.5,"d":"$77.50"},{"v":155,"d":"$155.00"},{"v":154.95,"d":"$154.95"},0,"M80008-492-M  M Banks Mid"," ",{"$f":"--ISNUMBER(IFERROR(SEARCH(Orders!$E18,O332,1),\"\"))","v":1},{"$f":"IF(Q332=1,COUNTIF($Q$2:Q332,1),\"\")","v":331},{"$f":"IFERROR(INDEX($O2:$O986,MATCH(ROWS($Q$2:Q332),$R2:$R986,0)),\"\")","v":"M80008-492-M  M Banks Mid"}]
[7,"M80008  ","492","M  ","M Banks Mid","Navy Multi","0-21033-49456-7","          ",11.5,null,{"v":77.5,"d":"$77.50"},{"v":155,"d":"$155.00"},{"v":154.95,"d":"$154.95"},0,"M80008-492-M  M Banks Mid"," ",{"$f":"--ISNUMBER(IFERROR(SEARCH(Orders!$E18,O333,1),\"\"))","v":1},{"$f":"IF(Q333=1,COUNTIF($Q$2:Q333,1),\"\")","v":332},{"$f":"IFERROR(INDEX($O2:$O986,MATCH(ROWS($Q$2:Q333),$R2:$R986,0)),\"\")","v":"M80008-492-M  M Banks Mid"}]
[7,"M80008  ","492","M  ","M Banks Mid","Navy Multi","0-21033-49457-4","          ",12,null,{"v":77.5,"d":"$77.50"},{"v":155,"d":"$155.00"},{"v":154.95,"d":"$154.95"},0,"M80008-492-M  M Banks Mid"," ",{"$f":"--ISNUMBER(IFERROR(SEARCH(Orders!$E18,O334,1),\"\"))","v":1},{"$f":"IF(Q334=1,COUNTIF($Q$2:Q334,1),\"\")","v":333},{"$f":"IFERROR(INDEX($O2:$O986,MATCH(ROWS($Q$2:Q334),$R2:$R986,0)),\"\")","v":"M80008-492-M  M Banks Mid"}]
[7,"M80008  ","492","M  ","M Banks Mid","Navy Multi","0-21033-49458-1","          ",12.5,null,{"v":77.5,"d":"$77.50"},{"v":155,"d":"$155.00"},{"v":154.95,"d":"$154.95"},0,"M80008-492-M  M Banks Mid"," ",{"$f":"--ISNUMBER(IFERROR(SEARCH(Orders!$E18,O335,1),\"\"))","v":1},{"$f":"IF(Q335=1,COUNTIF($Q$2:Q335,1),\"\")","v":334},{"$f":"IFERROR(INDEX($O2:$O986,MATCH(ROWS($Q$2:Q335),$R2:$R986,0)),\"\")","v":"M80008-492-M  M Banks Mid"}]
[7,"M80008  ","492","M  ","M Banks Mid","Navy Multi","0-21033-49459-8","          ",13,null,{"v":77.5,"d":"$77.50"},{"v":155,"d":"$155.00"},{"v":154.95,"d":"$154.95"},0,"M80008-492-M  M Banks Mid"," ",{"$f":"--ISNUMBER(IFERROR(SEARCH(Orders!$E18,O336,1),\"\"))","v":1},{"$f":"IF(Q336=1,COUNTIF($Q$2:Q336,1),\"\")","v":335},{"$f":"IFERROR(INDEX($O2:$O986,MATCH(ROWS($Q$2:Q336),$R2:$R986,0)),\"\")","v":"M80008-492-M  M Banks Mid"}]
[7,"M80008  ","492","M  ","M Banks Mid","Navy Multi","0-21033-49460-4","          ",14,null,{"v":77.5,"d":"$77.50"},{"v":155,"d":"$155.00"},{"v":154.95,"d":"$154.95"},0,"M80008-492-M  M Banks Mid"," ",{"$f":"--ISNUMBER(IFERROR(SEARCH(Orders!$E18,O337,1),\"\"))","v":1},{"$f":"IF(Q337=1,COUNTIF($Q$2:Q337,1),\"\")","v":336},{"$f":"IFERROR(INDEX($O2:$O986,MATCH(ROWS($Q$2:Q337),$R2:$R986,0)),\"\")","v":"M80008-492-M  M Banks Mid"}]
[13,"M80010  ","020","M  ","M Mason Mid","Gray","0-21033-49042-2","          ",8,null,{"v":82.5,"d":"$82.50"},{"v":165,"d":"$165.00"},{"v":164.95,"d":"$164.95"},0,"M80010-020-M  M Mason Mid"," ",{"$f":"--ISNUMBER(IFERROR(SEARCH(Orders!$E18,O338,1),\"\"))","v":1},{"$f":"IF(Q338=1,COUNTIF($Q$2:Q338,1),\"\")","v":337},{"$f":"IFERROR(INDEX($O2:$O986,MATCH(ROWS($Q$2:Q338),$R2:$R986,0)),\"\")","v":"M80010-020-M  M Mason Mid"}]
[13,"M80010  ","020","M  ","M Mason Mid","Gray","0-21033-49043-9","          ",8.5,null,{"v":82.5,"d":"$82.50"},{"v":165,"d":"$165.00"},{"v":164.95,"d":"$164.95"},0,"M80010-020-M  M Mason Mid"," ",{"$f":"--ISNUMBER(IFERROR(SEARCH(Orders!$E18,O339,1),\"\"))","v":1},{"$f":"IF(Q339=1,COUNTIF($Q$2:Q339,1),\"\")","v":338},{"$f":"IFERROR(INDEX($O2:$O986,MATCH(ROWS($Q$2:Q339),$R2:$R986,0)),\"\")","v":"M80010-020-M  M Mason Mid"}]
[13,"M80010  ","020","M  ","M Mason Mid","Gray","0-21033-49044-6","          ",9,null,{"v":82.5,"d":"$82.50"},{"v":165,"d":"$165.00"},{"v":164.95,"d":"$164.95"},0,"M80010-020-M  M Mason Mid"," ",{"$f":"--ISNUMBER(IFERROR(SEARCH(Orders!$E18,O340,1),\"\"))","v":1},{"$f":"IF(Q340=1,COUNTIF($Q$2:Q340,1),\"\")","v":339},{"$f":"IFERROR(INDEX($O2:$O986,MATCH(ROWS($Q$2:Q340),$R2:$R986,0)),\"\")","v":"M80010-020-M  M Mason Mid"}]
[13,"M80010  ","020","M  ","M Mason Mid","Gray","0-21033-49045-3","          ",9.5,null,{"v":82.5,"d":"$82.50"},{"v":165,"d":"$165.00"},{"v":164.95,"d":"$164.95"},0,"M80010-020-M  M Mason Mid"," ",{"$f":"--ISNUMBER(IFERROR(SEARCH(Orders!$E18,O341,1),\"\"))","v":1},{"$f":"IF(Q341=1,COUNTIF($Q$2:Q341,1),\"\")","v":340},{"$f":"IFERROR(INDEX($O2:$O986,MATCH(ROWS($Q$2:Q341),$R2:$R986,0)),\"\")","v":"M80010-020-M  M Mason Mid"}]
[13,"M80010  ","020","M  ","M Mason Mid","Gray","0-21033-49046-0","          ",10,null,{"v":82.5,"d":"$82.50"},{"v":165,"d":"$165.00"},{"v":164.95,"d":"$164.95"},0,"M80010-020-M  M Mason Mid"," ",{"$f":"--ISNUMBER(IFERROR(SEARCH(Orders!$E18,O342,1),\"\"))","v":1},{"$f":"IF(Q342=1,COUNTIF($Q$2:Q342,1),\"\")","v":341},{"$f":"IFERROR(INDEX($O2:$O986,MATCH(ROWS($Q$2:Q342),$R2:$R986,0)),\"\")","v":"M80010-020-M  M Mason Mid"}]
[13,"M80010  ","020","M  ","M Mason Mid","Gray","0-21033-49047-7","          ",10.5,null,{"v":82.5,"d":"$82.50"},{"v":165,"d":"$165.00"},{"v":164.95,"d":"$164.95"},0,"M80010-020-M  M Mason Mid"," ",{"$f":"--ISNUMBER(IFERROR(SEARCH(Orders!$E18,O343,1),\"\"))","v":1},{"$f":"IF(Q343=1,COUNTIF($Q$2:Q343,1),\"\")","v":342},{"$f":"IFERROR(INDEX($O2:$O986,MATCH(ROWS($Q$2:Q343),$R2:$R986,0)),\"\")","v":"M80010-020-M  M Mason Mid"}]
[13,"M80010  ","020","M  ","M Mason Mid","Gray","0-21033-49048-4","          ",11,null,{"v":82.5,"d":"$82.50"},{"v":165,"d":"$165.00"},{"v":164.95,"d":"$164.95"},0,"M80010-020-M  M Mason Mid"," ",{"$f":"--ISNUMBER(IFERROR(SEARCH(Orders!$E18,O344,1),\"\"))","v":1},{"$f":"IF(Q344=1,COUNTIF($Q$2:Q344,1),\"\")","v":343},{"$f":"IFERROR(INDEX($O2:$O986,MATCH(ROWS($Q$2:Q344),$R2:$R986,0)),\"\")","v":"M80010-020-M  M Mason Mid"}]
[13,"M80010  ","020","M  ","M Mason Mid","Gray","0-21033-49049-1","          ",11.5,null,{"v":82.5,"d":"$82.50"},{"v":165,"d":"$165.00"},{"v":164.95,"d":"$164.95"},0,"M80010-020-M  M Mason Mid"," ",{"$f":"--ISNUMBER(IFERROR(SEARCH(Orders!$E18,O345,1),\"\"))","v":1},{"$f":"IF(Q345=1,COUNTIF($Q$2:Q345,1),\"\")","v":344},{"$f":"IFERROR(INDEX($O2:$O986,MATCH(ROWS($Q$2:Q345),$R2:$R986,0)),\"\")","v":"M80010-020-M  M Mason Mid"}]
[13,"M80010  ","020","M  ","M Mason Mid","Gray","0-21033-49050-7","          ",12,null,{"v":82.5,"d":"$82.50"},{"v":165,"d":"$165.00"},{"v":164.95,"d":"$164.95"},0,"M80010-020-M  M Mason Mid"," ",{"$f":"--ISNUMBER(IFERROR(SEARCH(Orders!$E18,O346,1),\"\"))","v":1},{"$f":"IF(Q346=1,COUNTIF($Q$2:Q346,1),\"\")","v":345},{"$f":"IFERROR(INDEX($O2:$O986,MATCH(ROWS($Q$2:Q346),$R2:$R986,0)),\"\")","v":"M80010-020-M  M Mason Mid"}]
[13,"M80010  ","020","M  ","M Mason Mid","Gray","0-21033-49051-4","          ",12.5,null,{"v":82.5,"d":"$82.50"},{"v":165,"d":"$165.00"},{"v":164.95,"d":"$164.95"},0,"M80010-020-M  M Mason Mid"," ",{"$f":"--ISNUMBER(IFERROR(SEARCH(Orders!$E18,O347,1),\"\"))","v":1},{"$f":"IF(Q347=1,COUNTIF($Q$2:Q347,1),\"\")","v":346},{"$f":"IFERROR(INDEX($O2:$O986,MATCH(ROWS($Q$2:Q347),$R2:$R986,0)),\"\")","v":"M80010-020-M  M Mason Mid"}]
[13,"M80010  ","020","M  ","M Mason Mid","Gray","0-21033-49052-1","          ",13,null,{"v":82.5,"d":"$82.50"},{"v":165,"d":"$165.00"},{"v":164.95,"d":"$164.95"},0,"M80010-020-M  M Mason Mid"," ",{"$f":"--ISNUMBER(IFERROR(SEARCH(Orders!$E18,O348,1),\"\"))","v":1},{"$f":"IF(Q348=1,COUNTIF($Q$2:Q348,1),\"\")","v":347},{"$f":"IFERROR(INDEX($O2:$O986,MATCH(ROWS($Q$2:Q348),$R2:$R986,0)),\"\")","v":"M80010-020-M  M Mason Mid"}]
[13,"M80010  ","020","M  ","M Mason Mid","Gray","0-21033-49053-8","          ",14,null,{"v":82.5,"d":"$82.50"},{"v":165,"d":"$165.00"},{"v":164.95,"d":"$164.95"},0,"M80010-020-M  M Mason Mid"," ",{"$f":"--ISNUMBER(IFERROR(SEARCH(Orders!$E18,O349,1),\"\"))","v":1},{"$f":"IF(Q349=1,COUNTIF($Q$2:Q349,1),\"\")","v":348},{"$f":"IFERROR(INDEX($O2:$O986,MATCH(ROWS($Q$2:Q349),$R2:$R986,0)),\"\")","v":"M80010-020-M  M Mason Mid"}]
[13,"M80010  ","240","M  ","M Mason Mid","Tan","0-21033-49054-5","          ",8,null,{"v":82.5,"d":"$82.50"},{"v":165,"d":"$165.00"},{"v":164.95,"d":"$164.95"},0,"M80010-240-M  M Mason Mid"," ",{"$f":"--ISNUMBER(IFERROR(SEARCH(Orders!$E18,O350,1),\"\"))","v":1},{"$f":"IF(Q350=1,COUNTIF($Q$2:Q350,1),\"\")","v":349},{"$f":"IFERROR(INDEX($O2:$O986,MATCH(ROWS($Q$2:Q350),$R2:$R986,0)),\"\")","v":"M80010-240-M  M Mason Mid"}]
[13,"M80010  ","240","M  ","M Mason Mid","Tan","0-21033-49055-2","          ",8.5,null,{"v":82.5,"d":"$82.50"},{"v":165,"d":"$165.00"},{"v":164.95,"d":"$164.95"},0,"M80010-240-M  M Mason Mid"," ",{"$f":"--ISNUMBER(IFERROR(SEARCH(Orders!$E18,O351,1),\"\"))","v":1},{"$f":"IF(Q351=1,COUNTIF($Q$2:Q351,1),\"\")","v":350},{"$f":"IFERROR(INDEX($O2:$O986,MATCH(ROWS($Q$2:Q351),$R2:$R986,0)),\"\")","v":"M80010-240-M  M Mason Mid"}]
[13,"M80010  ","240","M  ","M Mason Mid","Tan","0-21033-49056-9","          ",9,null,{"v":82.5,"d":"$82.50"},{"v":165,"d":"$165.00"},{"v":164.95,"d":"$164.95"},0,"M80010-240-M  M Mason Mid"," ",{"$f":"--ISNUMBER(IFERROR(SEARCH(Orders!$E18,O352,1),\"\"))","v":1},{"$f":"IF(Q352=1,COUNTIF($Q$2:Q352,1),\"\")","v":351},{"$f":"IFERROR(INDEX($O2:$O986,MATCH(ROWS($Q$2:Q352),$R2:$R986,0)),\"\")","v":"M80010-240-M  M Mason Mid"}]
[13,"M80010  ","240","M  ","M Mason Mid","Tan","0-21033-49057-6","          ",9.5,null,{"v":82.5,"d":"$82.50"},{"v":165,"d":"$165.00"},{"v":164.95,"d":"$164.95"},0,"M80010-240-M  M Mason Mid"," ",{"$f":"--ISNUMBER(IFERROR(SEARCH(Orders!$E18,O353,1),\"\"))","v":1},{"$f":"IF(Q353=1,COUNTIF($Q$2:Q353,1),\"\")","v":352},{"$f":"IFERROR(INDEX($O2:$O986,MATCH(ROWS($Q$2:Q353),$R2:$R986,0)),\"\")","v":"M80010-240-M  M Mason Mid"}]
[13,"M80010  ","240","M  ","M Mason Mid","Tan","0-21033-49058-3","          ",10,null,{"v":82.5,"d":"$82.50"},{"v":165,"d":"$165.00"},{"v":164.95,"d":"$164.95"},0,"M80010-240-M  M Mason Mid"," ",{"$f":"--ISNUMBER(IFERROR(SEARCH(Orders!$E18,O354,1),\"\"))","v":1},{"$f":"IF(Q354=1,COUNTIF($Q$2:Q354,1),\"\")","v":353},{"$f":"IFERROR(INDEX($O2:$O986,MATCH(ROWS($Q$2:Q354),$R2:$R986,0)),\"\")","v":"M80010-240-M  M Mason Mid"}]
[13,"M80010  ","240","M  ","M Mason Mid","Tan","0-21033-49059-0","          ",10.5,null,{"v":82.5,"d":"$82.50"},{"v":165,"d":"$165.00"},{"v":164.95,"d":"$164.95"},0,"M80010-240-M  M Mason Mid"," ",{"$f":"--ISNUMBER(IFERROR(SEARCH(Orders!$E18,O355,1),\"\"))","v":1},{"$f":"IF(Q355=1,COUNTIF($Q$2:Q355,1),\"\")","v":354},{"$f":"IFERROR(INDEX($O2:$O986,MATCH(ROWS($Q$2:Q355),$R2:$R986,0)),\"\")","v":"M80010-240-M  M Mason Mid"}]
[13,"M80010  ","240","M  ","M Mason Mid","Tan","0-21033-49060-6","          ",11,null,{"v":82.5,"d":"$82.50"},{"v":165,"d":"$165.00"},{"v":164.95,"d":"$164.95"},0,"M80010-240-M  M Mason Mid"," ",{"$f":"--ISNUMBER(IFERROR(SEARCH(Orders!$E18,O356,1),\"\"))","v":1},{"$f":"IF(Q356=1,COUNTIF($Q$2:Q356,1),\"\")","v":355},{"$f":"IFERROR(INDEX($O2:$O986,MATCH(ROWS($Q$2:Q356),$R2:$R986,0)),\"\")","v":"M80010-240-M  M Mason Mid"}]
[13,"M80010  ","240","M  ","M Mason Mid","Tan","0-21033-49061-3","          ",11.5,null,{"v":82.5,"d":"$82.50"},{"v":165,"d":"$165.00"},{"v":164.95,"d":"$164.95"},0,"M80010-240-M  M Mason Mid"," ",{"$f":"--ISNUMBER(IFERROR(SEARCH(Orders!$E18,O357,1),\"\"))","v":1},{"$f":"IF(Q357=1,COUNTIF($Q$2:Q357,1),\"\")","v":356},{"$f":"IFERROR(INDEX($O2:$O986,MATCH(ROWS($Q$2:Q357),$R2:$R986,0)),\"\")","v":"M80010-240-M  M Mason Mid"}]
[13,"M80010  ","240","M  ","M Mason Mid","Tan","0-21033-49062-0","          ",12,null,{"v":82.5,"d":"$82.50"},{"v":165,"d":"$165.00"},{"v":164.95,"d":"$164.95"},0,"M80010-240-M  M Mason Mid"," ",{"$f":"--ISNUMBER(IFERROR(SEARCH(Orders!$E18,O358,1),\"\"))","v":1},{"$f":"IF(Q358=1,COUNTIF($Q$2:Q358,1),\"\")","v":357},{"$f":"IFERROR(INDEX($O2:$O986,MATCH(ROWS($Q$2:Q358),$R2:$R986,0)),\"\")","v":"M80010-240-M  M Mason Mid"}]
[13,"M80010  ","240","M  ","M Mason Mid","Tan","0-21033-49063-7","          ",12.5,null,{"v":82.5,"d":"$82.50"},{"v":165,"d":"$165.00"},{"v":164.95,"d":"$164.95"},0,"M80010-240-M  M Mason Mid"," ",{"$f":"--ISNUMBER(IFERROR(SEARCH(Orders!$E18,O359,1),\"\"))","v":1},{"$f":"IF(Q359=1,COUNTIF($Q$2:Q359,1),\"\")","v":358},{"$f":"IFERROR(INDEX($O2:$O986,MATCH(ROWS($Q$2:Q359),$R2:$R986,0)),\"\")","v":"M80010-240-M  M Mason Mid"}]
[13,"M80010  ","240","M  ","M Mason Mid","Tan","0-21033-49064-4","          ",13,null,{"v":82.5,"d":"$82.50"},{"v":165,"d":"$165.00"},{"v":164.95,"d":"$164.95"},0,"M80010-240-M  M Mason Mid"," ",{"$f":"--ISNUMBER(IFERROR(SEARCH(Orders!$E18,O360,1),\"\"))","v":1},{"$f":"IF(Q360=1,COUNTIF($Q$2:Q360,1),\"\")","v":359},{"$f":"IFERROR(INDEX($O2:$O986,MATCH(ROWS($Q$2:Q360),$R2:$R986,0)),\"\")","v":"M80010-240-M  M Mason Mid"}]
[13,"M80010  ","240","M  ","M Mason Mid","Tan","0-21033-49065-1","          ",14,null,{"v":82.5,"d":"$82.50"},{"v":165,"d":"$165.00"},{"v":164.95,"d":"$164.95"},0,"M80010-240-M  M Mason Mid"," ",{"$f":"--ISNUMBER(IFERROR(SEARCH(Orders!$E18,O361,1),\"\"))","v":1},{"$f":"IF(Q361=1,COUNTIF($Q$2:Q361,1),\"\")","v":360},{"$f":"IFERROR(INDEX($O2:$O986,MATCH(ROWS($Q$2:Q361),$R2:$R986,0)),\"\")","v":"M80010-240-M  M Mason Mid"}]
[13,"M80010  ","303","M  ","M Mason Mid","Olive","0-21033-49066-8","          ",8,null,{"v":82.5,"d":"$82.50"},{"v":165,"d":"$165.00"},{"v":164.95,"d":"$164.95"},0,"M80010-303-M  M Mason Mid"," ",{"$f":"--ISNUMBER(IFERROR(SEARCH(Orders!$E18,O362,1),\"\"))","v":1},{"$f":"IF(Q362=1,COUNTIF($Q$2:Q362,1),\"\")","v":361},{"$f":"IFERROR(INDEX($O2:$O986,MATCH(ROWS($Q$2:Q362),$R2:$R986,0)),\"\")","v":"M80010-303-M  M Mason Mid"}]
[13,"M80010  ","303","M  ","M Mason Mid","Olive","0-21033-49067-5","          ",8.5,null,{"v":82.5,"d":"$82.50"},{"v":165,"d":"$165.00"},{"v":164.95,"d":"$164.95"},0,"M80010-303-M  M Mason Mid"," ",{"$f":"--ISNUMBER(IFERROR(SEARCH(Orders!$E18,O363,1),\"\"))","v":1},{"$f":"IF(Q363=1,COUNTIF($Q$2:Q363,1),\"\")","v":362},{"$f":"IFERROR(INDEX($O2:$O986,MATCH(ROWS($Q$2:Q363),$R2:$R986,0)),\"\")","v":"M80010-303-M  M Mason Mid"}]
[13,"M80010  ","303","M  ","M Mason Mid","Olive","0-21033-49068-2","          ",9,null,{"v":82.5,"d":"$82.50"},{"v":165,"d":"$165.00"},{"v":164.95,"d":"$164.95"},0,"M80010-303-M  M Mason Mid"," ",{"$f":"--ISNUMBER(IFERROR(SEARCH(Orders!$E18,O364,1),\"\"))","v":1},{"$f":"IF(Q364=1,COUNTIF($Q$2:Q364,1),\"\")","v":363},{"$f":"IFERROR(INDEX($O2:$O986,MATCH(ROWS($Q$2:Q364),$R2:$R986,0)),\"\")","v":"M80010-303-M  M Mason Mid"}]
[13,"M80010  ","303","M  ","M Mason Mid","Olive","0-21033-49069-9","          ",9.5,null,{"v":82.5,"d":"$82.50"},{"v":165,"d":"$165.00"},{"v":164.95,"d":"$164.95"},0,"M80010-303-M  M Mason Mid"," ",{"$f":"--ISNUMBER(IFERROR(SEARCH(Orders!$E18,O365,1),\"\"))","v":1},{"$f":"IF(Q365=1,COUNTIF($Q$2:Q365,1),\"\")","v":364},{"$f":"IFERROR(INDEX($O2:$O986,MATCH(ROWS($Q$2:Q365),$R2:$R986,0)),\"\")","v":"M80010-303-M  M Mason Mid"}]
[13,"M80010  ","303","M  ","M Mason Mid","Olive","0-21033-49070-5","          ",10,null,{"v":82.5,"d":"$82.50"},{"v":165,"d":"$165.00"},{"v":164.95,"d":"$164.95"},0,"M80010-303-M  M Mason Mid"," ",{"$f":"--ISNUMBER(IFERROR(SEARCH(Orders!$E18,O366,1),\"\"))","v":1},{"$f":"IF(Q366=1,COUNTIF($Q$2:Q366,1),\"\")","v":365},{"$f":"IFERROR(INDEX($O2:$O986,MATCH(ROWS($Q$2:Q366),$R2:$R986,0)),\"\")","v":"M80010-303-M  M Mason Mid"}]
[13,"M80010  ","303","M  ","M Mason Mid","Olive","0-21033-49071-2","          ",10.5,null,{"v":82.5,"d":"$82.50"},{"v":165,"d":"$165.00"},{"v":164.95,"d":"$164.95"},0,"M80010-303-M  M Mason Mid"," ",{"$f":"--ISNUMBER(IFERROR(SEARCH(Orders!$E18,O367,1),\"\"))","v":1},{"$f":"IF(Q367=1,COUNTIF($Q$2:Q367,1),\"\")","v":366},{"$f":"IFERROR(INDEX($O2:$O986,MATCH(ROWS($Q$2:Q367),$R2:$R986,0)),\"\")","v":"M80010-303-M  M Mason Mid"}]
[13,"M80010  ","303","M  ","M Mason Mid","Olive","0-21033-49072-9","          ",11,null,{"v":82.5,"d":"$82.50"},{"v":165,"d":"$165.00"},{"v":164.95,"d":"$164.95"},0,"M80010-303-M  M Mason Mid"," ",{"$f":"--ISNUMBER(IFERROR(SEARCH(Orders!$E18,O368,1),\"\"))","v":1},{"$f":"IF(Q368=1,COUNTIF($Q$2:Q368,1),\"\")","v":367},{"$f":"IFERROR(INDEX($O2:$O986,MATCH(ROWS($Q$2:Q368),$R2:$R986,0)),\"\")","v":"M80010-303-M  M Mason Mid"}]
[13,"M80010  ","303","M  ","M Mason Mid","Olive","0-21033-49073-6","          ",11.5,null,{"v":82.5,"d":"$82.50"},{"v":165,"d":"$165.00"},{"v":164.95,"d":"$164.95"},0,"M80010-303-M  M Mason Mid"," ",{"$f":"--ISNUMBER(IFERROR(SEARCH(Orders!$E18,O369,1),\"\"))","v":1},{"$f":"IF(Q369=1,COUNTIF($Q$2:Q369,1),\"\")","v":368},{"$f":"IFERROR(INDEX($O2:$O986,MATCH(ROWS($Q$2:Q369),$R2:$R986,0)),\"\")","v":"M80010-303-M  M Mason Mid"}]
[13,"M80010  ","303","M  ","M Mason Mid","Olive","0-21033-49074-3","          ",12,null,{"v":82.5,"d":"$82.50"},{"v":165,"d":"$165.00"},{"v":164.95,"d":"$164.95"},0,"M80010-303-M  M Mason Mid"," ",{"$f":"--ISNUMBER(IFERROR(SEARCH(Orders!$E18,O370,1),\"\"))","v":1},{"$f":"IF(Q370=1,COUNTIF($Q$2:Q370,1),\"\")","v":369},{"$f":"IFERROR(INDEX($O2:$O986,MATCH(ROWS($Q$2:Q370),$R2:$R986,0)),\"\")","v":"M80010-303-M  M Mason Mid"}]
[13,"M80010  ","303","M  ","M Mason Mid","Olive","0-21033-49075-0","          ",12.5,null,{"v":82.5,"d":"$82.50"},{"v":165,"d":"$165.00"},{"v":164.95,"d":"$164.95"},0,"M80010-303-M  M Mason Mid"," ",{"$f":"--ISNUMBER(IFERROR(SEARCH(Orders!$E18,O371,1),\"\"))","v":1},{"$f":"IF(Q371=1,COUNTIF($Q$2:Q371,1),\"\")","v":370},{"$f":"IFERROR(INDEX($O2:$O986,MATCH(ROWS($Q$2:Q371),$R2:$R986,0)),\"\")","v":"M80010-303-M  M Mason Mid"}]
[13,"M80010  ","303","M  ","M Mason Mid","Olive","0-21033-49076-7","          ",13,null,{"v":82.5,"d":"$82.50"},{"v":165,"d":"$165.00"},{"v":164.95,"d":"$164.95"},0,"M80010-303-M  M Mason Mid"," ",{"$f":"--ISNUMBER(IFERROR(SEARCH(Orders!$E18,O372,1),\"\"))","v":1},{"$f":"IF(Q372=1,COUNTIF($Q$2:Q372,1),\"\")","v":371},{"$f":"IFERROR(INDEX($O2:$O986,MATCH(ROWS($Q$2:Q372),$R2:$R986,0)),\"\")","v":"M80010-303-M  M Mason Mid"}]
[13,"M80010  ","303","M  ","M Mason Mid","Olive","0-21033-49077-4","          ",14,null,{"v":82.5,"d":"$82.50"},{"v":165,"d":"$165.00"},{"v":164.95,"d":"$164.95"},0,"M80010-303-M  M Mason Mid"," ",{"$f":"--ISNUMBER(IFERROR(SEARCH(Orders!$E18,O373,1),\"\"))","v":1},{"$f":"IF(Q373=1,COUNTIF($Q$2:Q373,1),\"\")","v":372},{"$f":"IFERROR(INDEX($O2:$O986,MATCH(ROWS($Q$2:Q373),$R2:$R986,0)),\"\")","v":"M80010-303-M  M Mason Mid"}]
[9,"M80012  ","305","M  ","M Halden","Loden","0-21033-49126-9","          ",8,null,{"v":87.5,"d":"$87.50"},{"v":175,"d":"$175.00"},{"v":174.95,"d":"$174.95"},0,"M80012-305-M  M Halden"," ",{"$f":"--ISNUMBER(IFERROR(SEARCH(Orders!$E18,O374,1),\"\"))","v":1},{"$f":"IF(Q374=1,COUNTIF($Q$2:Q374,1),\"\")","v":373},{"$f":"IFERROR(INDEX($O2:$O986,MATCH(ROWS($Q$2:Q374),$R2:$R986,0)),\"\")","v":"M80012-305-M  M Halden"}]
[9,"M80012  ","305","M  ","M Halden","Loden","0-21033-49127-6","          ",8.5,null,{"v":87.5,"d":"$87.50"},{"v":175,"d":"$175.00"},{"v":174.95,"d":"$174.95"},0,"M80012-305-M  M Halden"," ",{"$f":"--ISNUMBER(IFERROR(SEARCH(Orders!$E18,O375,1),\"\"))","v":1},{"$f":"IF(Q375=1,COUNTIF($Q$2:Q375,1),\"\")","v":374},{"$f":"IFERROR(INDEX($O2:$O986,MATCH(ROWS($Q$2:Q375),$R2:$R986,0)),\"\")","v":"M80012-305-M  M Halden"}]
[9,"M80012  ","305","M  ","M Halden","Loden","0-21033-49128-3","          ",9,null,{"v":87.5,"d":"$87.50"},{"v":175,"d":"$175.00"},{"v":174.95,"d":"$174.95"},0,"M80012-305-M  M Halden"," ",{"$f":"--ISNUMBER(IFERROR(SEARCH(Orders!$E18,O376,1),\"\"))","v":1},{"$f":"IF(Q376=1,COUNTIF($Q$2:Q376,1),\"\")","v":375},{"$f":"IFERROR(INDEX($O2:$O986,MATCH(ROWS($Q$2:Q376),$R2:$R986,0)),\"\")","v":"M80012-305-M  M Halden"}]
[9,"M80012  ","305","M  ","M Halden","Loden","0-21033-49129-0","          ",9.5,null,{"v":87.5,"d":"$87.50"},{"v":175,"d":"$175.00"},{"v":174.95,"d":"$174.95"},0,"M80012-305-M  M Halden"," ",{"$f":"--ISNUMBER(IFERROR(SEARCH(Orders!$E18,O377,1),\"\"))","v":1},{"$f":"IF(Q377=1,COUNTIF($Q$2:Q377,1),\"\")","v":376},{"$f":"IFERROR(INDEX($O2:$O986,MATCH(ROWS($Q$2:Q377),$R2:$R986,0)),\"\")","v":"M80012-305-M  M Halden"}]
[9,"M80012  ","305","M  ","M Halden","Loden","0-21033-49130-6","          ",10,null,{"v":87.5,"d":"$87.50"},{"v":175,"d":"$175.00"},{"v":174.95,"d":"$174.95"},0,"M80012-305-M  M Halden"," ",{"$f":"--ISNUMBER(IFERROR(SEARCH(Orders!$E18,O378,1),\"\"))","v":1},{"$f":"IF(Q378=1,COUNTIF($Q$2:Q378,1),\"\")","v":377},{"$f":"IFERROR(INDEX($O2:$O986,MATCH(ROWS($Q$2:Q378),$R2:$R986,0)),\"\")","v":"M80012-305-M  M Halden"}]
[9,"M80012  ","305","M  ","M Halden","Loden","0-21033-49131-3","          ",10.5,null,{"v":87.5,"d":"$87.50"},{"v":175,"d":"$175.00"},{"v":174.95,"d":"$174.95"},0,"M80012-305-M  M Halden"," ",{"$f":"--ISNUMBER(IFERROR(SEARCH(Orders!$E18,O379,1),\"\"))","v":1},{"$f":"IF(Q379=1,COUNTIF($Q$2:Q379,1),\"\")","v":378},{"$f":"IFERROR(INDEX($O2:$O986,MATCH(ROWS($Q$2:Q379),$R2:$R986,0)),\"\")","v":"M80012-305-M  M Halden"}]
[9,"M80012  ","305","M  ","M Halden","Loden","0-21033-49132-0","          ",11,null,{"v":87.5,"d":"$87.50"},{"v":175,"d":"$175.00"},{"v":174.95,"d":"$174.95"},0,"M80012-305-M  M Halden"," ",{"$f":"--ISNUMBER(IFERROR(SEARCH(Orders!$E18,O380,1),\"\"))","v":1},{"$f":"IF(Q380=1,COUNTIF($Q$2:Q380,1),\"\")","v":379},{"$f":"IFERROR(INDEX($O2:$O986,MATCH(ROWS($Q$2:Q380),$R2:$R986,0)),\"\")","v":"M80012-305-M  M Halden"}]
[9,"M80012  ","305","M  ","M Halden","Loden","0-21033-49133-7","          ",11.5,null,{"v":87.5,"d":"$87.50"},{"v":175,"d":"$175.00"},{"v":174.95,"d":"$174.95"},0,"M80012-305-M  M Halden"," ",{"$f":"--ISNUMBER(IFERROR(SEARCH(Orders!$E18,O381,1),\"\"))","v":1},{"$f":"IF(Q381=1,COUNTIF($Q$2:Q381,1),\"\")","v":380},{"$f":"IFERROR(INDEX($O2:$O986,MATCH(ROWS($Q$2:Q381),$R2:$R986,0)),\"\")","v":"M80012-305-M  M Halden"}]
[9,"M80012  ","305","M  ","M Halden","Loden","0-21033-49134-4","          ",12,null,{"v":87.5,"d":"$87.50"},{"v":175,"d":"$175.00"},{"v":174.95,"d":"$174.95"},0,"M80012-305-M  M Halden"," ",{"$f":"--ISNUMBER(IFERROR(SEARCH(Orders!$E18,O382,1),\"\"))","v":1},{"$f":"IF(Q382=1,COUNTIF($Q$2:Q382,1),\"\")","v":381},{"$f":"IFERROR(INDEX($O2:$O986,MATCH(ROWS($Q$2:Q382),$R2:$R986,0)),\"\")","v":"M80012-305-M  M Halden"}]
[9,"M80012  ","305","M  ","M Halden","Loden","0-21033-49135-1","          ",12.5,null,{"v":87.5,"d":"$87.50"},{"v":175,"d":"$175.00"},{"v":174.95,"d":"$174.95"},0,"M80012-305-M  M Halden"," ",{"$f":"--ISNUMBER(IFERROR(SEARCH(Orders!$E18,O383,1),\"\"))","v":1},{"$f":"IF(Q383=1,COUNTIF($Q$2:Q383,1),\"\")","v":382},{"$f":"IFERROR(INDEX($O2:$O986,MATCH(ROWS($Q$2:Q383),$R2:$R986,0)),\"\")","v":"M80012-305-M  M Halden"}]
[9,"M80012  ","305","M  ","M Halden","Loden","0-21033-49136-8","          ",13,null,{"v":87.5,"d":"$87.50"},{"v":175,"d":"$175.00"},{"v":174.95,"d":"$174.95"},0,"M80012-305-M  M Halden"," ",{"$f":"--ISNUMBER(IFERROR(SEARCH(Orders!$E18,O384,1),\"\"))","v":1},{"$f":"IF(Q384=1,COUNTIF($Q$2:Q384,1),\"\")","v":383},{"$f":"IFERROR(INDEX($O2:$O986,MATCH(ROWS($Q$2:Q384),$R2:$R986,0)),\"\")","v":"M80012-305-M  M Halden"}]
[9,"M80012  ","305","M  ","M Halden","Loden","0-21033-49137-5","          ",14,null,{"v":87.5,"d":"$87.50"},{"v":175,"d":"$175.00"},{"v":174.95,"d":"$174.95"},0,"M80012-305-M  M Halden"," ",{"$f":"--ISNUMBER(IFERROR(SEARCH(Orders!$E18,O385,1),\"\"))","v":1},{"$f":"IF(Q385=1,COUNTIF($Q$2:Q385,1),\"\")","v":384},{"$f":"IFERROR(INDEX($O2:$O986,MATCH(ROWS($Q$2:Q385),$R2:$R986,0)),\"\")","v":"M80012-305-M  M Halden"}]
[2,"M80013  ","349","M  ","M Dispatch","Lodenmulti","0-21033-49162-7","          ",8,null,{"v":85,"d":"$85.00"},{"v":170,"d":"$170.00"},{"v":169.95,"d":"$169.95"},{"$f":"J386*K386","v":0},"M80013-349-M  M Dispatch"," ",{"$f":"--ISNUMBER(IFERROR(SEARCH(Orders!$E18,O386,1),\"\"))","v":1},{"$f":"IF(Q386=1,COUNTIF($Q$2:Q386,1),\"\")","v":385},{"$f":"IFERROR(INDEX($O2:$O986,MATCH(ROWS($Q$2:Q386),$R2:$R986,0)),\"\")","v":"M80013-349-M  M Dispatch"}]
[2,"M80013  ","349","M  ","M Dispatch","Lodenmulti","0-21033-49163-4","          ",8.5,null,{"v":85,"d":"$85.00"},{"v":170,"d":"$170.00"},{"v":169.95,"d":"$169.95"},0,"M80013-349-M  M Dispatch"," ",{"$f":"--ISNUMBER(IFERROR(SEARCH(Orders!$E18,O387,1),\"\"))","v":1},{"$f":"IF(Q387=1,COUNTIF($Q$2:Q387,1),\"\")","v":386},{"$f":"IFERROR(INDEX($O2:$O986,MATCH(ROWS($Q$2:Q387),$R2:$R986,0)),\"\")","v":"M80013-349-M  M Dispatch"}]
[2,"M80013  ","349","M  ","M Dispatch","Lodenmulti","0-21033-49164-1","          ",9,null,{"v":85,"d":"$85.00"},{"v":170,"d":"$170.00"},{"v":169.95,"d":"$169.95"},0,"M80013-349-M  M Dispatch"," ",{"$f":"--ISNUMBER(IFERROR(SEARCH(Orders!$E18,O388,1),\"\"))","v":1},{"$f":"IF(Q388=1,COUNTIF($Q$2:Q388,1),\"\")","v":387},{"$f":"IFERROR(INDEX($O2:$O986,MATCH(ROWS($Q$2:Q388),$R2:$R986,0)),\"\")","v":"M80013-349-M  M Dispatch"}]
[2,"M80013  ","349","M  ","M Dispatch","Lodenmulti","0-21033-49165-8","          ",9.5,null,{"v":85,"d":"$85.00"},{"v":170,"d":"$170.00"},{"v":169.95,"d":"$169.95"},0,"M80013-349-M  M Dispatch"," ",{"$f":"--ISNUMBER(IFERROR(SEARCH(Orders!$E18,O389,1),\"\"))","v":1},{"$f":"IF(Q389=1,COUNTIF($Q$2:Q389,1),\"\")","v":388},{"$f":"IFERROR(INDEX($O2:$O986,MATCH(ROWS($Q$2:Q389),$R2:$R986,0)),\"\")","v":"M80013-349-M  M Dispatch"}]
[2,"M80013  ","349","M  ","M Dispatch","Lodenmulti","0-21033-49166-5","          ",10,null,{"v":85,"d":"$85.00"},{"v":170,"d":"$170.00"},{"v":169.95,"d":"$169.95"},0,"M80013-349-M  M Dispatch"," ",{"$f":"--ISNUMBER(IFERROR(SEARCH(Orders!$E18,O390,1),\"\"))","v":1},{"$f":"IF(Q390=1,COUNTIF($Q$2:Q390,1),\"\")","v":389},{"$f":"IFERROR(INDEX($O2:$O986,MATCH(ROWS($Q$2:Q390),$R2:$R986,0)),\"\")","v":"M80013-349-M  M Dispatch"}]
[2,"M80013  ","349","M  ","M Dispatch","Lodenmulti","0-21033-49167-2","          ",10.5,null,{"v":85,"d":"$85.00"},{"v":170,"d":"$170.00"},{"v":169.95,"d":"$169.95"},0,"M80013-349-M  M Dispatch"," ",{"$f":"--ISNUMBER(IFERROR(SEARCH(Orders!$E18,O391,1),\"\"))","v":1},{"$f":"IF(Q391=1,COUNTIF($Q$2:Q391,1),\"\")","v":390},{"$f":"IFERROR(INDEX($O2:$O986,MATCH(ROWS($Q$2:Q391),$R2:$R986,0)),\"\")","v":"M80013-349-M  M Dispatch"}]
[2,"M80013  ","349","M  ","M Dispatch","Lodenmulti","0-21033-49168-9","          ",11,null,{"v":85,"d":"$85.00"},{"v":170,"d":"$170.00"},{"v":169.95,"d":"$169.95"},0,"M80013-349-M  M Dispatch"," ",{"$f":"--ISNUMBER(IFERROR(SEARCH(Orders!$E18,O392,1),\"\"))","v":1},{"$f":"IF(Q392=1,COUNTIF($Q$2:Q392,1),\"\")","v":391},{"$f":"IFERROR(INDEX($O2:$O986,MATCH(ROWS($Q$2:Q392),$R2:$R986,0)),\"\")","v":"M80013-349-M  M Dispatch"}]
[2,"M80013  ","349","M  ","M Dispatch","Lodenmulti","0-21033-49169-6","          ",11.5,null,{"v":85,"d":"$85.00"},{"v":170,"d":"$170.00"},{"v":169.95,"d":"$169.95"},0,"M80013-349-M  M Dispatch"," ",{"$f":"--ISNUMBER(IFERROR(SEARCH(Orders!$E18,O393,1),\"\"))","v":1},{"$f":"IF(Q393=1,COUNTIF($Q$2:Q393,1),\"\")","v":392},{"$f":"IFERROR(INDEX($O2:$O986,MATCH(ROWS($Q$2:Q393),$R2:$R986,0)),\"\")","v":"M80013-349-M  M Dispatch"}]
[2,"M80013  ","349","M  ","M Dispatch","Lodenmulti","0-21033-49170-2","          ",12,null,{"v":85,"d":"$85.00"},{"v":170,"d":"$170.00"},{"v":169.95,"d":"$169.95"},0,"M80013-349-M  M Dispatch"," ",{"$f":"--ISNUMBER(IFERROR(SEARCH(Orders!$E18,O394,1),\"\"))","v":1},{"$f":"IF(Q394=1,COUNTIF($Q$2:Q394,1),\"\")","v":393},{"$f":"IFERROR(INDEX($O2:$O986,MATCH(ROWS($Q$2:Q394),$R2:$R986,0)),\"\")","v":"M80013-349-M  M Dispatch"}]
[2,"M80013  ","349","M  ","M Dispatch","Lodenmulti","0-21033-49171-9","          ",12.5,null,{"v":85,"d":"$85.00"},{"v":170,"d":"$170.00"},{"v":169.95,"d":"$169.95"},0,"M80013-349-M  M Dispatch"," ",{"$f":"--ISNUMBER(IFERROR(SEARCH(Orders!$E18,O395,1),\"\"))","v":1},{"$f":"IF(Q395=1,COUNTIF($Q$2:Q395,1),\"\")","v":394},{"$f":"IFERROR(INDEX($O2:$O986,MATCH(ROWS($Q$2:Q395),$R2:$R986,0)),\"\")","v":"M80013-349-M  M Dispatch"}]
[2,"M80013  ","349","M  ","M Dispatch","Lodenmulti","0-21033-49172-6","          ",13,null,{"v":85,"d":"$85.00"},{"v":170,"d":"$170.00"},{"v":169.95,"d":"$169.95"},0,"M80013-349-M  M Dispatch"," ",{"$f":"--ISNUMBER(IFERROR(SEARCH(Orders!$E18,O396,1),\"\"))","v":1},{"$f":"IF(Q396=1,COUNTIF($Q$2:Q396,1),\"\")","v":395},{"$f":"IFERROR(INDEX($O2:$O986,MATCH(ROWS($Q$2:Q396),$R2:$R986,0)),\"\")","v":"M80013-349-M  M Dispatch"}]
[2,"M80013  ","349","M  ","M Dispatch","Lodenmulti","0-21033-49173-3","          ",14,null,{"v":85,"d":"$85.00"},{"v":170,"d":"$170.00"},{"v":169.95,"d":"$169.95"},0,"M80013-349-M  M Dispatch"," ",{"$f":"--ISNUMBER(IFERROR(SEARCH(Orders!$E18,O397,1),\"\"))","v":1},{"$f":"IF(Q397=1,COUNTIF($Q$2:Q397,1),\"\")","v":396},{"$f":"IFERROR(INDEX($O2:$O986,MATCH(ROWS($Q$2:Q397),$R2:$R986,0)),\"\")","v":"M80013-349-M  M Dispatch"}]
[12,"M80015  ","001","M  ","M Davos Mid","Black","0-21033-49186-3","          ",8,null,{"v":85,"d":"$85.00"},{"v":170,"d":"$170.00"},{"v":169.95,"d":"$169.95"},0,"M80015-001-M  M Davos Mid"," ",{"$f":"--ISNUMBER(IFERROR(SEARCH(Orders!$E18,O398,1),\"\"))","v":1},{"$f":"IF(Q398=1,COUNTIF($Q$2:Q398,1),\"\")","v":397},{"$f":"IFERROR(INDEX($O2:$O986,MATCH(ROWS($Q$2:Q398),$R2:$R986,0)),\"\")","v":"M80015-001-M  M Davos Mid"}]
[12,"M80015  ","001","M  ","M Davos Mid","Black","0-21033-49187-0","          ",8.5,null,{"v":85,"d":"$85.00"},{"v":170,"d":"$170.00"},{"v":169.95,"d":"$169.95"},0,"M80015-001-M  M Davos Mid"," ",{"$f":"--ISNUMBER(IFERROR(SEARCH(Orders!$E18,O399,1),\"\"))","v":1},{"$f":"IF(Q399=1,COUNTIF($Q$2:Q399,1),\"\")","v":398},{"$f":"IFERROR(INDEX($O2:$O986,MATCH(ROWS($Q$2:Q399),$R2:$R986,0)),\"\")","v":"M80015-001-M  M Davos Mid"}]
[12,"M80015  ","001","M  ","M Davos Mid","Black","0-21033-49188-7","          ",9,null,{"v":85,"d":"$85.00"},{"v":170,"d":"$170.00"},{"v":169.95,"d":"$169.95"},0,"M80015-001-M  M Davos Mid"," ",{"$f":"--ISNUMBER(IFERROR(SEARCH(Orders!$E18,O400,1),\"\"))","v":1},{"$f":"IF(Q400=1,COUNTIF($Q$2:Q400,1),\"\")","v":399},{"$f":"IFERROR(INDEX($O2:$O986,MATCH(ROWS($Q$2:Q400),$R2:$R986,0)),\"\")","v":"M80015-001-M  M Davos Mid"}]
[12,"M80015  ","001","M  ","M Davos Mid","Black","0-21033-49189-4","          ",9.5,null,{"v":85,"d":"$85.00"},{"v":170,"d":"$170.00"},{"v":169.95,"d":"$169.95"},0,"M80015-001-M  M Davos Mid"," ",{"$f":"--ISNUMBER(IFERROR(SEARCH(Orders!$E18,O401,1),\"\"))","v":1},{"$f":"IF(Q401=1,COUNTIF($Q$2:Q401,1),\"\")","v":400},{"$f":"IFERROR(INDEX($O2:$O986,MATCH(ROWS($Q$2:Q401),$R2:$R986,0)),\"\")","v":"M80015-001-M  M Davos Mid"}]
[12,"M80015  ","001","M  ","M Davos Mid","Black","0-21033-49190-0","          ",10,null,{"v":85,"d":"$85.00"},{"v":170,"d":"$170.00"},{"v":169.95,"d":"$169.95"},0,"M80015-001-M  M Davos Mid"," ",{"$f":"--ISNUMBER(IFERROR(SEARCH(Orders!$E18,O402,1),\"\"))","v":1},{"$f":"IF(Q402=1,COUNTIF($Q$2:Q402,1),\"\")","v":401},{"$f":"IFERROR(INDEX($O2:$O986,MATCH(ROWS($Q$2:Q402),$R2:$R986,0)),\"\")","v":"M80015-001-M  M Davos Mid"}]
[12,"M80015  ","001","M  ","M Davos Mid","Black","0-21033-49191-7","          ",10.5,null,{"v":85,"d":"$85.00"},{"v":170,"d":"$170.00"},{"v":169.95,"d":"$169.95"},0,"M80015-001-M  M Davos Mid"," ",{"$f":"--ISNUMBER(IFERROR(SEARCH(Orders!$E18,O403,1),\"\"))","v":1},{"$f":"IF(Q403=1,COUNTIF($Q$2:Q403,1),\"\")","v":402},{"$f":"IFERROR(INDEX($O2:$O986,MATCH(ROWS($Q$2:Q403),$R2:$R986,0)),\"\")","v":"M80015-001-M  M Davos Mid"}]
[12,"M80015  ","001","M  ","M Davos Mid","Black","0-21033-49192-4","          ",11,null,{"v":85,"d":"$85.00"},{"v":170,"d":"$170.00"},{"v":169.95,"d":"$169.95"},0,"M80015-001-M  M Davos Mid"," ",{"$f":"--ISNUMBER(IFERROR(SEARCH(Orders!$E18,O404,1),\"\"))","v":1},{"$f":"IF(Q404=1,COUNTIF($Q$2:Q404,1),\"\")","v":403},{"$f":"IFERROR(INDEX($O2:$O986,MATCH(ROWS($Q$2:Q404),$R2:$R986,0)),\"\")","v":"M80015-001-M  M Davos Mid"}]
[12,"M80015  ","001","M  ","M Davos Mid","Black","0-21033-49193-1","          ",11.5,null,{"v":85,"d":"$85.00"},{"v":170,"d":"$170.00"},{"v":169.95,"d":"$169.95"},0,"M80015-001-M  M Davos Mid"," ",{"$f":"--ISNUMBER(IFERROR(SEARCH(Orders!$E18,O405,1),\"\"))","v":1},{"$f":"IF(Q405=1,COUNTIF($Q$2:Q405,1),\"\")","v":404},{"$f":"IFERROR(INDEX($O2:$O986,MATCH(ROWS($Q$2:Q405),$R2:$R986,0)),\"\")","v":"M80015-001-M  M Davos Mid"}]
[12,"M80015  ","001","M  ","M Davos Mid","Black","0-21033-49194-8","          ",12,null,{"v":85,"d":"$85.00"},{"v":170,"d":"$170.00"},{"v":169.95,"d":"$169.95"},0,"M80015-001-M  M Davos Mid"," ",{"$f":"--ISNUMBER(IFERROR(SEARCH(Orders!$E18,O406,1),\"\"))","v":1},{"$f":"IF(Q406=1,COUNTIF($Q$2:Q406,1),\"\")","v":405},{"$f":"IFERROR(INDEX($O2:$O986,MATCH(ROWS($Q$2:Q406),$R2:$R986,0)),\"\")","v":"M80015-001-M  M Davos Mid"}]
[12,"M80015  ","001","M  ","M Davos Mid","Black","0-21033-49195-5","          ",12.5,null,{"v":85,"d":"$85.00"},{"v":170,"d":"$170.00"},{"v":169.95,"d":"$169.95"},0,"M80015-001-M  M Davos Mid"," ",{"$f":"--ISNUMBER(IFERROR(SEARCH(Orders!$E18,O407,1),\"\"))","v":1},{"$f":"IF(Q407=1,COUNTIF($Q$2:Q407,1),\"\")","v":406},{"$f":"IFERROR(INDEX($O2:$O986,MATCH(ROWS($Q$2:Q407),$R2:$R986,0)),\"\")","v":"M80015-001-M  M Davos Mid"}]
[12,"M80015  ","001","M  ","M Davos Mid","Black","0-21033-49196-2","          ",13,null,{"v":85,"d":"$85.00"},{"v":170,"d":"$170.00"},{"v":169.95,"d":"$169.95"},0,"M80015-001-M  M Davos Mid"," ",{"$f":"--ISNUMBER(IFERROR(SEARCH(Orders!$E18,O408,1),\"\"))","v":1},{"$f":"IF(Q408=1,COUNTIF($Q$2:Q408,1),\"\")","v":407},{"$f":"IFERROR(INDEX($O2:$O986,MATCH(ROWS($Q$2:Q408),$R2:$R986,0)),\"\")","v":"M80015-001-M  M Davos Mid"}]
[12,"M80015  ","001","M  ","M Davos Mid","Black","0-21033-49197-9","          ",14,null,{"v":85,"d":"$85.00"},{"v":170,"d":"$170.00"},{"v":169.95,"d":"$169.95"},0,"M80015-001-M  M Davos Mid"," ",{"$f":"--ISNUMBER(IFERROR(SEARCH(Orders!$E18,O409,1),\"\"))","v":1},{"$f":"IF(Q409=1,COUNTIF($Q$2:Q409,1),\"\")","v":408},{"$f":"IFERROR(INDEX($O2:$O986,MATCH(ROWS($Q$2:Q409),$R2:$R986,0)),\"\")","v":"M80015-001-M  M Davos Mid"}]
[12,"M80015  ","305","M  ","M Davos Mid","Loden","0-21033-49509-0","          ",8,null,{"v":85,"d":"$85.00"},{"v":170,"d":"$170.00"},{"v":169.95,"d":"$169.95"},0,"M80015-305-M  M Davos Mid"," ",{"$f":"--ISNUMBER(IFERROR(SEARCH(Orders!$E18,O410,1),\"\"))","v":1},{"$f":"IF(Q410=1,COUNTIF($Q$2:Q410,1),\"\")","v":409},{"$f":"IFERROR(INDEX($O2:$O986,MATCH(ROWS($Q$2:Q410),$R2:$R986,0)),\"\")","v":"M80015-305-M  M Davos Mid"}]
[12,"M80015  ","305","M  ","M Davos Mid","Loden","0-21033-49510-6","          ",8.5,null,{"v":85,"d":"$85.00"},{"v":170,"d":"$170.00"},{"v":169.95,"d":"$169.95"},0,"M80015-305-M  M Davos Mid"," ",{"$f":"--ISNUMBER(IFERROR(SEARCH(Orders!$E18,O411,1),\"\"))","v":1},{"$f":"IF(Q411=1,COUNTIF($Q$2:Q411,1),\"\")","v":410},{"$f":"IFERROR(INDEX($O2:$O986,MATCH(ROWS($Q$2:Q411),$R2:$R986,0)),\"\")","v":"M80015-305-M  M Davos Mid"}]
[12,"M80015  ","305","M  ","M Davos Mid","Loden","0-21033-49511-3","          ",9,null,{"v":85,"d":"$85.00"},{"v":170,"d":"$170.00"},{"v":169.95,"d":"$169.95"},0,"M80015-305-M  M Davos Mid"," ",{"$f":"--ISNUMBER(IFERROR(SEARCH(Orders!$E18,O412,1),\"\"))","v":1},{"$f":"IF(Q412=1,COUNTIF($Q$2:Q412,1),\"\")","v":411},{"$f":"IFERROR(INDEX($O2:$O986,MATCH(ROWS($Q$2:Q412),$R2:$R986,0)),\"\")","v":"M80015-305-M  M Davos Mid"}]
[12,"M80015  ","305","M  ","M Davos Mid","Loden","0-21033-49512-0","          ",9.5,null,{"v":85,"d":"$85.00"},{"v":170,"d":"$170.00"},{"v":169.95,"d":"$169.95"},0,"M80015-305-M  M Davos Mid"," ",{"$f":"--ISNUMBER(IFERROR(SEARCH(Orders!$E18,O413,1),\"\"))","v":1},{"$f":"IF(Q413=1,COUNTIF($Q$2:Q413,1),\"\")","v":412},{"$f":"IFERROR(INDEX($O2:$O986,MATCH(ROWS($Q$2:Q413),$R2:$R986,0)),\"\")","v":"M80015-305-M  M Davos Mid"}]
[12,"M80015  ","305","M  ","M Davos Mid","Loden","0-21033-49513-7","          ",10,null,{"v":85,"d":"$85.00"},{"v":170,"d":"$170.00"},{"v":169.95,"d":"$169.95"},0,"M80015-305-M  M Davos Mid"," ",{"$f":"--ISNUMBER(IFERROR(SEARCH(Orders!$E18,O414,1),\"\"))","v":1},{"$f":"IF(Q414=1,COUNTIF($Q$2:Q414,1),\"\")","v":413},{"$f":"IFERROR(INDEX($O2:$O986,MATCH(ROWS($Q$2:Q414),$R2:$R986,0)),\"\")","v":"M80015-305-M  M Davos Mid"}]
[12,"M80015  ","305","M  ","M Davos Mid","Loden","0-21033-49514-4","          ",10.5,null,{"v":85,"d":"$85.00"},{"v":170,"d":"$170.00"},{"v":169.95,"d":"$169.95"},0,"M80015-305-M  M Davos Mid"," ",{"$f":"--ISNUMBER(IFERROR(SEARCH(Orders!$E18,O415,1),\"\"))","v":1},{"$f":"IF(Q415=1,COUNTIF($Q$2:Q415,1),\"\")","v":414},{"$f":"IFERROR(INDEX($O2:$O986,MATCH(ROWS($Q$2:Q415),$R2:$R986,0)),\"\")","v":"M80015-305-M  M Davos Mid"}]
[12,"M80015  ","305","M  ","M Davos Mid","Loden","0-21033-49515-1","          ",11,null,{"v":85,"d":"$85.00"},{"v":170,"d":"$170.00"},{"v":169.95,"d":"$169.95"},0,"M80015-305-M  M Davos Mid"," ",{"$f":"--ISNUMBER(IFERROR(SEARCH(Orders!$E18,O416,1),\"\"))","v":1},{"$f":"IF(Q416=1,COUNTIF($Q$2:Q416,1),\"\")","v":415},{"$f":"IFERROR(INDEX($O2:$O986,MATCH(ROWS($Q$2:Q416),$R2:$R986,0)),\"\")","v":"M80015-305-M  M Davos Mid"}]
[12,"M80015  ","305","M  ","M Davos Mid","Loden","0-21033-49516-8","          ",11.5,null,{"v":85,"d":"$85.00"},{"v":170,"d":"$170.00"},{"v":169.95,"d":"$169.95"},0,"M80015-305-M  M Davos Mid"," ",{"$f":"--ISNUMBER(IFERROR(SEARCH(Orders!$E18,O417,1),\"\"))","v":1},{"$f":"IF(Q417=1,COUNTIF($Q$2:Q417,1),\"\")","v":416},{"$f":"IFERROR(INDEX($O2:$O986,MATCH(ROWS($Q$2:Q417),$R2:$R986,0)),\"\")","v":"M80015-305-M  M Davos Mid"}]
[12,"M80015  ","305","M  ","M Davos Mid","Loden","0-21033-49517-5","          ",12,null,{"v":85,"d":"$85.00"},{"v":170,"d":"$170.00"},{"v":169.95,"d":"$169.95"},0,"M80015-305-M  M Davos Mid"," ",{"$f":"--ISNUMBER(IFERROR(SEARCH(Orders!$E18,O418,1),\"\"))","v":1},{"$f":"IF(Q418=1,COUNTIF($Q$2:Q418,1),\"\")","v":417},{"$f":"IFERROR(INDEX($O2:$O986,MATCH(ROWS($Q$2:Q418),$R2:$R986,0)),\"\")","v":"M80015-305-M  M Davos Mid"}]
[12,"M80015  ","305","M  ","M Davos Mid","Loden","0-21033-49518-2","          ",12.5,null,{"v":85,"d":"$85.00"},{"v":170,"d":"$170.00"},{"v":169.95,"d":"$169.95"},0,"M80015-305-M  M Davos Mid"," ",{"$f":"--ISNUMBER(IFERROR(SEARCH(Orders!$E18,O419,1),\"\"))","v":1},{"$f":"IF(Q419=1,COUNTIF($Q$2:Q419,1),\"\")","v":418},{"$f":"IFERROR(INDEX($O2:$O986,MATCH(ROWS($Q$2:Q419),$R2:$R986,0)),\"\")","v":"M80015-305-M  M Davos Mid"}]
[12,"M80015  ","305","M  ","M Davos Mid","Loden","0-21033-49519-9","          ",13,null,{"v":85,"d":"$85.00"},{"v":170,"d":"$170.00"},{"v":169.95,"d":"$169.95"},0,"M80015-305-M  M Davos Mid"," ",{"$f":"--ISNUMBER(IFERROR(SEARCH(Orders!$E18,O420,1),\"\"))","v":1},{"$f":"IF(Q420=1,COUNTIF($Q$2:Q420,1),\"\")","v":419},{"$f":"IFERROR(INDEX($O2:$O986,MATCH(ROWS($Q$2:Q420),$R2:$R986,0)),\"\")","v":"M80015-305-M  M Davos Mid"}]
[12,"M80015  ","305","M  ","M Davos Mid","Loden","0-21033-49520-5","          ",14,null,{"v":85,"d":"$85.00"},{"v":170,"d":"$170.00"},{"v":169.95,"d":"$169.95"},0,"M80015-305-M  M Davos Mid"," ",{"$f":"--ISNUMBER(IFERROR(SEARCH(Orders!$E18,O421,1),\"\"))","v":1},{"$f":"IF(Q421=1,COUNTIF($Q$2:Q421,1),\"\")","v":420},{"$f":"IFERROR(INDEX($O2:$O986,MATCH(ROWS($Q$2:Q421),$R2:$R986,0)),\"\")","v":"M80015-305-M  M Davos Mid"}]
[10,"M80016  ","025","M  ","M Range Low","Gunmetal","0-21033-49198-6","          ",8,null,{"v":77.5,"d":"$77.50"},{"v":155,"d":"$155.00"},{"v":154.95,"d":"$154.95"},0,"M80016-025-M  M Range Low"," ",{"$f":"--ISNUMBER(IFERROR(SEARCH(Orders!$E18,O422,1),\"\"))","v":1},{"$f":"IF(Q422=1,COUNTIF($Q$2:Q422,1),\"\")","v":421},{"$f":"IFERROR(INDEX($O2:$O986,MATCH(ROWS($Q$2:Q422),$R2:$R986,0)),\"\")","v":"M80016-025-M  M Range Low"}]
[10,"M80016  ","025","M  ","M Range Low","Gunmetal","0-21033-49199-3","          ",8.5,null,{"v":77.5,"d":"$77.50"},{"v":155,"d":"$155.00"},{"v":154.95,"d":"$154.95"},0,"M80016-025-M  M Range Low"," ",{"$f":"--ISNUMBER(IFERROR(SEARCH(Orders!$E18,O423,1),\"\"))","v":1},{"$f":"IF(Q423=1,COUNTIF($Q$2:Q423,1),\"\")","v":422},{"$f":"IFERROR(INDEX($O2:$O986,MATCH(ROWS($Q$2:Q423),$R2:$R986,0)),\"\")","v":"M80016-025-M  M Range Low"}]
[10,"M80016  ","025","M  ","M Range Low","Gunmetal","0-21033-49200-6","          ",9,null,{"v":77.5,"d":"$77.50"},{"v":155,"d":"$155.00"},{"v":154.95,"d":"$154.95"},0,"M80016-025-M  M Range Low"," ",{"$f":"--ISNUMBER(IFERROR(SEARCH(Orders!$E18,O424,1),\"\"))","v":1},{"$f":"IF(Q424=1,COUNTIF($Q$2:Q424,1),\"\")","v":423},{"$f":"IFERROR(INDEX($O2:$O986,MATCH(ROWS($Q$2:Q424),$R2:$R986,0)),\"\")","v":"M80016-025-M  M Range Low"}]
[10,"M80016  ","025","M  ","M Range Low","Gunmetal","0-21033-49201-3","          ",9.5,null,{"v":77.5,"d":"$77.50"},{"v":155,"d":"$155.00"},{"v":154.95,"d":"$154.95"},0,"M80016-025-M  M Range Low"," ",{"$f":"--ISNUMBER(IFERROR(SEARCH(Orders!$E18,O425,1),\"\"))","v":1},{"$f":"IF(Q425=1,COUNTIF($Q$2:Q425,1),\"\")","v":424},{"$f":"IFERROR(INDEX($O2:$O986,MATCH(ROWS($Q$2:Q425),$R2:$R986,0)),\"\")","v":"M80016-025-M  M Range Low"}]
[10,"M80016  ","025","M  ","M Range Low","Gunmetal","0-21033-49202-0","          ",10,null,{"v":77.5,"d":"$77.50"},{"v":155,"d":"$155.00"},{"v":154.95,"d":"$154.95"},0,"M80016-025-M  M Range Low"," ",{"$f":"--ISNUMBER(IFERROR(SEARCH(Orders!$E18,O426,1),\"\"))","v":1},{"$f":"IF(Q426=1,COUNTIF($Q$2:Q426,1),\"\")","v":425},{"$f":"IFERROR(INDEX($O2:$O986,MATCH(ROWS($Q$2:Q426),$R2:$R986,0)),\"\")","v":"M80016-025-M  M Range Low"}]
[10,"M80016  ","025","M  ","M Range Low","Gunmetal","0-21033-49203-7","          ",10.5,null,{"v":77.5,"d":"$77.50"},{"v":155,"d":"$155.00"},{"v":154.95,"d":"$154.95"},0,"M80016-025-M  M Range Low"," ",{"$f":"--ISNUMBER(IFERROR(SEARCH(Orders!$E18,O427,1),\"\"))","v":1},{"$f":"IF(Q427=1,COUNTIF($Q$2:Q427,1),\"\")","v":426},{"$f":"IFERROR(INDEX($O2:$O986,MATCH(ROWS($Q$2:Q427),$R2:$R986,0)),\"\")","v":"M80016-025-M  M Range Low"}]
[10,"M80016  ","025","M  ","M Range Low","Gunmetal","0-21033-49204-4","          ",11,null,{"v":77.5,"d":"$77.50"},{"v":155,"d":"$155.00"},{"v":154.95,"d":"$154.95"},0,"M80016-025-M  M Range Low"," ",{"$f":"--ISNUMBER(IFERROR(SEARCH(Orders!$E18,O428,1),\"\"))","v":1},{"$f":"IF(Q428=1,COUNTIF($Q$2:Q428,1),\"\")","v":427},{"$f":"IFERROR(INDEX($O2:$O986,MATCH(ROWS($Q$2:Q428),$R2:$R986,0)),\"\")","v":"M80016-025-M  M Range Low"}]
[10,"M80016  ","025","M  ","M Range Low","Gunmetal","0-21033-49205-1","          ",11.5,null,{"v":77.5,"d":"$77.50"},{"v":155,"d":"$155.00"},{"v":154.95,"d":"$154.95"},0,"M80016-025-M  M Range Low"," ",{"$f":"--ISNUMBER(IFERROR(SEARCH(Orders!$E18,O429,1),\"\"))","v":1},{"$f":"IF(Q429=1,COUNTIF($Q$2:Q429,1),\"\")","v":428},{"$f":"IFERROR(INDEX($O2:$O986,MATCH(ROWS($Q$2:Q429),$R2:$R986,0)),\"\")","v":"M80016-025-M  M Range Low"}]
[10,"M80016  ","025","M  ","M Range Low","Gunmetal","0-21033-49206-8","          ",12,null,{"v":77.5,"d":"$77.50"},{"v":155,"d":"$155.00"},{"v":154.95,"d":"$154.95"},0,"M80016-025-M  M Range Low"," ",{"$f":"--ISNUMBER(IFERROR(SEARCH(Orders!$E18,O430,1),\"\"))","v":1},{"$f":"IF(Q430=1,COUNTIF($Q$2:Q430,1),\"\")","v":429},{"$f":"IFERROR(INDEX($O2:$O986,MATCH(ROWS($Q$2:Q430),$R2:$R986,0)),\"\")","v":"M80016-025-M  M Range Low"}]
[10,"M80016  ","025","M  ","M Range Low","Gunmetal","0-21033-49207-5","          ",12.5,null,{"v":77.5,"d":"$77.50"},{"v":155,"d":"$155.00"},{"v":154.95,"d":"$154.95"},0,"M80016-025-M  M Range Low"," ",{"$f":"--ISNUMBER(IFERROR(SEARCH(Orders!$E18,O431,1),\"\"))","v":1},{"$f":"IF(Q431=1,COUNTIF($Q$2:Q431,1),\"\")","v":430},{"$f":"IFERROR(INDEX($O2:$O986,MATCH(ROWS($Q$2:Q431),$R2:$R986,0)),\"\")","v":"M80016-025-M  M Range Low"}]
[10,"M80016  ","025","M  ","M Range Low","Gunmetal","0-21033-49208-2","          ",13,null,{"v":77.5,"d":"$77.50"},{"v":155,"d":"$155.00"},{"v":154.95,"d":"$154.95"},0,"M80016-025-M  M Range Low"," ",{"$f":"--ISNUMBER(IFERROR(SEARCH(Orders!$E18,O432,1),\"\"))","v":1},{"$f":"IF(Q432=1,COUNTIF($Q$2:Q432,1),\"\")","v":431},{"$f":"IFERROR(INDEX($O2:$O986,MATCH(ROWS($Q$2:Q432),$R2:$R986,0)),\"\")","v":"M80016-025-M  M Range Low"}]
[10,"M80016  ","025","M  ","M Range Low","Gunmetal","0-21033-49209-9","          ",14,null,{"v":77.5,"d":"$77.50"},{"v":155,"d":"$155.00"},{"v":154.95,"d":"$154.95"},0,"M80016-025-M  M Range Low"," ",{"$f":"--ISNUMBER(IFERROR(SEARCH(Orders!$E18,O433,1),\"\"))","v":1},{"$f":"IF(Q433=1,COUNTIF($Q$2:Q433,1),\"\")","v":432},{"$f":"IFERROR(INDEX($O2:$O986,MATCH(ROWS($Q$2:Q433),$R2:$R986,0)),\"\")","v":"M80016-025-M  M Range Low"}]
[10,"M80016  ","261","M  ","M Range Low","Taupe Mult","0-21033-49521-2","          ",8,null,{"v":77.5,"d":"$77.50"},{"v":155,"d":"$155.00"},{"v":154.95,"d":"$154.95"},0,"M80016-261-M  M Range Low"," ",{"$f":"--ISNUMBER(IFERROR(SEARCH(Orders!$E18,O434,1),\"\"))","v":1},{"$f":"IF(Q434=1,COUNTIF($Q$2:Q434,1),\"\")","v":433},{"$f":"IFERROR(INDEX($O2:$O986,MATCH(ROWS($Q$2:Q434),$R2:$R986,0)),\"\")","v":"M80016-261-M  M Range Low"}]
[10,"M80016  ","261","M  ","M Range Low","Taupe Mult","0-21033-49522-9","          ",8.5,null,{"v":77.5,"d":"$77.50"},{"v":155,"d":"$155.00"},{"v":154.95,"d":"$154.95"},0,"M80016-261-M  M Range Low"," ",{"$f":"--ISNUMBER(IFERROR(SEARCH(Orders!$E18,O435,1),\"\"))","v":1},{"$f":"IF(Q435=1,COUNTIF($Q$2:Q435,1),\"\")","v":434},{"$f":"IFERROR(INDEX($O2:$O986,MATCH(ROWS($Q$2:Q435),$R2:$R986,0)),\"\")","v":"M80016-261-M  M Range Low"}]
[10,"M80016  ","261","M  ","M Range Low","Taupe Mult","0-21033-49523-6","          ",9,null,{"v":77.5,"d":"$77.50"},{"v":155,"d":"$155.00"},{"v":154.95,"d":"$154.95"},0,"M80016-261-M  M Range Low"," ",{"$f":"--ISNUMBER(IFERROR(SEARCH(Orders!$E18,O436,1),\"\"))","v":1},{"$f":"IF(Q436=1,COUNTIF($Q$2:Q436,1),\"\")","v":435},{"$f":"IFERROR(INDEX($O2:$O986,MATCH(ROWS($Q$2:Q436),$R2:$R986,0)),\"\")","v":"M80016-261-M  M Range Low"}]
[10,"M80016  ","261","M  ","M Range Low","Taupe Mult","0-21033-49524-3","          ",9.5,null,{"v":77.5,"d":"$77.50"},{"v":155,"d":"$155.00"},{"v":154.95,"d":"$154.95"},0,"M80016-261-M  M Range Low"," ",{"$f":"--ISNUMBER(IFERROR(SEARCH(Orders!$E18,O437,1),\"\"))","v":1},{"$f":"IF(Q437=1,COUNTIF($Q$2:Q437,1),\"\")","v":436},{"$f":"IFERROR(INDEX($O2:$O986,MATCH(ROWS($Q$2:Q437),$R2:$R986,0)),\"\")","v":"M80016-261-M  M Range Low"}]
[10,"M80016  ","261","M  ","M Range Low","Taupe Mult","0-21033-49525-0","          ",10,null,{"v":77.5,"d":"$77.50"},{"v":155,"d":"$155.00"},{"v":154.95,"d":"$154.95"},0,"M80016-261-M  M Range Low"," ",{"$f":"--ISNUMBER(IFERROR(SEARCH(Orders!$E18,O438,1),\"\"))","v":1},{"$f":"IF(Q438=1,COUNTIF($Q$2:Q438,1),\"\")","v":437},{"$f":"IFERROR(INDEX($O2:$O986,MATCH(ROWS($Q$2:Q438),$R2:$R986,0)),\"\")","v":"M80016-261-M  M Range Low"}]
[10,"M80016  ","261","M  ","M Range Low","Taupe Mult","0-21033-49526-7","          ",10.5,null,{"v":77.5,"d":"$77.50"},{"v":155,"d":"$155.00"},{"v":154.95,"d":"$154.95"},0,"M80016-261-M  M Range Low"," ",{"$f":"--ISNUMBER(IFERROR(SEARCH(Orders!$E18,O439,1),\"\"))","v":1},{"$f":"IF(Q439=1,COUNTIF($Q$2:Q439,1),\"\")","v":438},{"$f":"IFERROR(INDEX($O2:$O986,MATCH(ROWS($Q$2:Q439),$R2:$R986,0)),\"\")","v":"M80016-261-M  M Range Low"}]
[10,"M80016  ","261","M  ","M Range Low","Taupe Mult","0-21033-49527-4","          ",11,null,{"v":77.5,"d":"$77.50"},{"v":155,"d":"$155.00"},{"v":154.95,"d":"$154.95"},0,"M80016-261-M  M Range Low"," ",{"$f":"--ISNUMBER(IFERROR(SEARCH(Orders!$E18,O440,1),\"\"))","v":1},{"$f":"IF(Q440=1,COUNTIF($Q$2:Q440,1),\"\")","v":439},{"$f":"IFERROR(INDEX($O2:$O986,MATCH(ROWS($Q$2:Q440),$R2:$R986,0)),\"\")","v":"M80016-261-M  M Range Low"}]
[10,"M80016  ","261","M  ","M Range Low","Taupe Mult","0-21033-49528-1","          ",11.5,null,{"v":77.5,"d":"$77.50"},{"v":155,"d":"$155.00"},{"v":154.95,"d":"$154.95"},0,"M80016-261-M  M Range Low"," ",{"$f":"--ISNUMBER(IFERROR(SEARCH(Orders!$E18,O441,1),\"\"))","v":1},{"$f":"IF(Q441=1,COUNTIF($Q$2:Q441,1),\"\")","v":440},{"$f":"IFERROR(INDEX($O2:$O986,MATCH(ROWS($Q$2:Q441),$R2:$R986,0)),\"\")","v":"M80016-261-M  M Range Low"}]
[10,"M80016  ","261","M  ","M Range Low","Taupe Mult","0-21033-49529-8","          ",12,null,{"v":77.5,"d":"$77.50"},{"v":155,"d":"$155.00"},{"v":154.95,"d":"$154.95"},0,"M80016-261-M  M Range Low"," ",{"$f":"--ISNUMBER(IFERROR(SEARCH(Orders!$E18,O442,1),\"\"))","v":1},{"$f":"IF(Q442=1,COUNTIF($Q$2:Q442,1),\"\")","v":441},{"$f":"IFERROR(INDEX($O2:$O986,MATCH(ROWS($Q$2:Q442),$R2:$R986,0)),\"\")","v":"M80016-261-M  M Range Low"}]
[10,"M80016  ","261","M  ","M Range Low","Taupe Mult","0-21033-49530-4","          ",12.5,null,{"v":77.5,"d":"$77.50"},{"v":155,"d":"$155.00"},{"v":154.95,"d":"$154.95"},0,"M80016-261-M  M Range Low"," ",{"$f":"--ISNUMBER(IFERROR(SEARCH(Orders!$E18,O443,1),\"\"))","v":1},{"$f":"IF(Q443=1,COUNTIF($Q$2:Q443,1),\"\")","v":442},{"$f":"IFERROR(INDEX($O2:$O986,MATCH(ROWS($Q$2:Q443),$R2:$R986,0)),\"\")","v":"M80016-261-M  M Range Low"}]
[10,"M80016  ","261","M  ","M Range Low","Taupe Mult","0-21033-49531-1","          ",13,null,{"v":77.5,"d":"$77.50"},{"v":155,"d":"$155.00"},{"v":154.95,"d":"$154.95"},0,"M80016-261-M  M Range Low"," ",{"$f":"--ISNUMBER(IFERROR(SEARCH(Orders!$E18,O444,1),\"\"))","v":1},{"$f":"IF(Q444=1,COUNTIF($Q$2:Q444,1),\"\")","v":443},{"$f":"IFERROR(INDEX($O2:$O986,MATCH(ROWS($Q$2:Q444),$R2:$R986,0)),\"\")","v":"M80016-261-M  M Range Low"}]
[10,"M80016  ","261","M  ","M Range Low","Taupe Mult","0-21033-49532-8","          ",14,null,{"v":77.5,"d":"$77.50"},{"v":155,"d":"$155.00"},{"v":154.95,"d":"$154.95"},0,"M80016-261-M  M Range Low"," ",{"$f":"--ISNUMBER(IFERROR(SEARCH(Orders!$E18,O445,1),\"\"))","v":1},{"$f":"IF(Q445=1,COUNTIF($Q$2:Q445,1),\"\")","v":444},{"$f":"IFERROR(INDEX($O2:$O986,MATCH(ROWS($Q$2:Q445),$R2:$R986,0)),\"\")","v":"M80016-261-M  M Range Low"}]
[5,"M80032  ","025","M  ","M Cascade Peak Low W","Gunmetal","0-21033-49533-5","          ",8,null,{"v":72.5,"d":"$72.50"},{"v":145,"d":"$145.00"},{"v":144.95,"d":"$144.95"},0,"M80032-025-M  M Cascade Peak Low W"," ",{"$f":"--ISNUMBER(IFERROR(SEARCH(Orders!$E18,O446,1),\"\"))","v":1},{"$f":"IF(Q446=1,COUNTIF($Q$2:Q446,1),\"\")","v":445},{"$f":"IFERROR(INDEX($O2:$O986,MATCH(ROWS($Q$2:Q446),$R2:$R986,0)),\"\")","v":"M80032-025-M  M Cascade Peak Low W"}]
[5,"M80032  ","025","M  ","M Cascade Peak Low W","Gunmetal","0-21033-49534-2","          ",8.5,null,{"v":72.5,"d":"$72.50"},{"v":145,"d":"$145.00"},{"v":144.95,"d":"$144.95"},0,"M80032-025-M  M Cascade Peak Low W"," ",{"$f":"--ISNUMBER(IFERROR(SEARCH(Orders!$E18,O447,1),\"\"))","v":1},{"$f":"IF(Q447=1,COUNTIF($Q$2:Q447,1),\"\")","v":446},{"$f":"IFERROR(INDEX($O2:$O986,MATCH(ROWS($Q$2:Q447),$R2:$R986,0)),\"\")","v":"M80032-025-M  M Cascade Peak Low W"}]
[5,"M80032  ","025","M  ","M Cascade Peak Low W","Gunmetal","0-21033-49535-9","          ",9,null,{"v":72.5,"d":"$72.50"},{"v":145,"d":"$145.00"},{"v":144.95,"d":"$144.95"},0,"M80032-025-M  M Cascade Peak Low W"," ",{"$f":"--ISNUMBER(IFERROR(SEARCH(Orders!$E18,O448,1),\"\"))","v":1},{"$f":"IF(Q448=1,COUNTIF($Q$2:Q448,1),\"\")","v":447},{"$f":"IFERROR(INDEX($O2:$O986,MATCH(ROWS($Q$2:Q448),$R2:$R986,0)),\"\")","v":"M80032-025-M  M Cascade Peak Low W"}]
[5,"M80032  ","025","M  ","M Cascade Peak Low W","Gunmetal","0-21033-49536-6","          ",9.5,null,{"v":72.5,"d":"$72.50"},{"v":145,"d":"$145.00"},{"v":144.95,"d":"$144.95"},0,"M80032-025-M  M Cascade Peak Low W"," ",{"$f":"--ISNUMBER(IFERROR(SEARCH(Orders!$E18,O449,1),\"\"))","v":1},{"$f":"IF(Q449=1,COUNTIF($Q$2:Q449,1),\"\")","v":448},{"$f":"IFERROR(INDEX($O2:$O986,MATCH(ROWS($Q$2:Q449),$R2:$R986,0)),\"\")","v":"M80032-025-M  M Cascade Peak Low W"}]
[5,"M80032  ","025","M  ","M Cascade Peak Low W","Gunmetal","0-21033-49537-3","          ",10,null,{"v":72.5,"d":"$72.50"},{"v":145,"d":"$145.00"},{"v":144.95,"d":"$144.95"},{"$f":"J450*K450","v":0},"M80032-025-M  M Cascade Peak Low W"," ",{"$f":"--ISNUMBER(IFERROR(SEARCH(Orders!$E18,O450,1),\"\"))","v":1},{"$f":"IF(Q450=1,COUNTIF($Q$2:Q450,1),\"\")","v":449},{"$f":"IFERROR(INDEX($O2:$O986,MATCH(ROWS($Q$2:Q450),$R2:$R986,0)),\"\")","v":"M80032-025-M  M Cascade Peak Low W"}]
[5,"M80032  ","025","M  ","M Cascade Peak Low W","Gunmetal","0-21033-49538-0","          ",10.5,null,{"v":72.5,"d":"$72.50"},{"v":145,"d":"$145.00"},{"v":144.95,"d":"$144.95"},0,"M80032-025-M  M Cascade Peak Low W"," ",{"$f":"--ISNUMBER(IFERROR(SEARCH(Orders!$E18,O451,1),\"\"))","v":1},{"$f":"IF(Q451=1,COUNTIF($Q$2:Q451,1),\"\")","v":450},{"$f":"IFERROR(INDEX($O2:$O986,MATCH(ROWS($Q$2:Q451),$R2:$R986,0)),\"\")","v":"M80032-025-M  M Cascade Peak Low W"}]
[5,"M80032  ","025","M  ","M Cascade Peak Low W","Gunmetal","0-21033-49539-7","          ",11,null,{"v":72.5,"d":"$72.50"},{"v":145,"d":"$145.00"},{"v":144.95,"d":"$144.95"},0,"M80032-025-M  M Cascade Peak Low W"," ",{"$f":"--ISNUMBER(IFERROR(SEARCH(Orders!$E18,O452,1),\"\"))","v":1},{"$f":"IF(Q452=1,COUNTIF($Q$2:Q452,1),\"\")","v":451},{"$f":"IFERROR(INDEX($O2:$O986,MATCH(ROWS($Q$2:Q452),$R2:$R986,0)),\"\")","v":"M80032-025-M  M Cascade Peak Low W"}]
[5,"M80032  ","025","M  ","M Cascade Peak Low W","Gunmetal","0-21033-49540-3","          ",11.5,null,{"v":72.5,"d":"$72.50"},{"v":145,"d":"$145.00"},{"v":144.95,"d":"$144.95"},0,"M80032-025-M  M Cascade Peak Low W"," ",{"$f":"--ISNUMBER(IFERROR(SEARCH(Orders!$E18,O453,1),\"\"))","v":1},{"$f":"IF(Q453=1,COUNTIF($Q$2:Q453,1),\"\")","v":452},{"$f":"IFERROR(INDEX($O2:$O986,MATCH(ROWS($Q$2:Q453),$R2:$R986,0)),\"\")","v":"M80032-025-M  M Cascade Peak Low W"}]
[5,"M80032  ","025","M  ","M Cascade Peak Low W","Gunmetal","0-21033-49541-0","          ",12,null,{"v":72.5,"d":"$72.50"},{"v":145,"d":"$145.00"},{"v":144.95,"d":"$144.95"},0,"M80032-025-M  M Cascade Peak Low W"," ",{"$f":"--ISNUMBER(IFERROR(SEARCH(Orders!$E18,O454,1),\"\"))","v":1},{"$f":"IF(Q454=1,COUNTIF($Q$2:Q454,1),\"\")","v":453},{"$f":"IFERROR(INDEX($O2:$O986,MATCH(ROWS($Q$2:Q454),$R2:$R986,0)),\"\")","v":"M80032-025-M  M Cascade Peak Low W"}]
[5,"M80032  ","025","M  ","M Cascade Peak Low W","Gunmetal","0-21033-49542-7","          ",12.5,null,{"v":72.5,"d":"$72.50"},{"v":145,"d":"$145.00"},{"v":144.95,"d":"$144.95"},0,"M80032-025-M  M Cascade Peak Low W"," ",{"$f":"--ISNUMBER(IFERROR(SEARCH(Orders!$E18,O455,1),\"\"))","v":1},{"$f":"IF(Q455=1,COUNTIF($Q$2:Q455,1),\"\")","v":454},{"$f":"IFERROR(INDEX($O2:$O986,MATCH(ROWS($Q$2:Q455),$R2:$R986,0)),\"\")","v":"M80032-025-M  M Cascade Peak Low W"}]
[5,"M80032  ","025","M  ","M Cascade Peak Low W","Gunmetal","0-21033-49543-4","          ",13,null,{"v":72.5,"d":"$72.50"},{"v":145,"d":"$145.00"},{"v":144.95,"d":"$144.95"},0,"M80032-025-M  M Cascade Peak Low W"," ",{"$f":"--ISNUMBER(IFERROR(SEARCH(Orders!$E18,O456,1),\"\"))","v":1},{"$f":"IF(Q456=1,COUNTIF($Q$2:Q456,1),\"\")","v":455},{"$f":"IFERROR(INDEX($O2:$O986,MATCH(ROWS($Q$2:Q456),$R2:$R986,0)),\"\")","v":"M80032-025-M  M Cascade Peak Low W"}]
[5,"M80032  ","025","M  ","M Cascade Peak Low W","Gunmetal","0-21033-49544-1","          ",14,null,{"v":72.5,"d":"$72.50"},{"v":145,"d":"$145.00"},{"v":144.95,"d":"$144.95"},0,"M80032-025-M  M Cascade Peak Low W"," ",{"$f":"--ISNUMBER(IFERROR(SEARCH(Orders!$E18,O457,1),\"\"))","v":1},{"$f":"IF(Q457=1,COUNTIF($Q$2:Q457,1),\"\")","v":456},{"$f":"IFERROR(INDEX($O2:$O986,MATCH(ROWS($Q$2:Q457),$R2:$R986,0)),\"\")","v":"M80032-025-M  M Cascade Peak Low W"}]
[5,"M80032  ","233","M  ","M Cascade Peak Low W","Cocoa","0-21033-49545-8","          ",8,null,{"v":72.5,"d":"$72.50"},{"v":145,"d":"$145.00"},{"v":144.95,"d":"$144.95"},0,"M80032-233-M  M Cascade Peak Low W"," ",{"$f":"--ISNUMBER(IFERROR(SEARCH(Orders!$E18,O458,1),\"\"))","v":1},{"$f":"IF(Q458=1,COUNTIF($Q$2:Q458,1),\"\")","v":457},{"$f":"IFERROR(INDEX($O2:$O986,MATCH(ROWS($Q$2:Q458),$R2:$R986,0)),\"\")","v":"M80032-233-M  M Cascade Peak Low W"}]
[5,"M80032  ","233","M  ","M Cascade Peak Low W","Cocoa","0-21033-49546-5","          ",8.5,null,{"v":72.5,"d":"$72.50"},{"v":145,"d":"$145.00"},{"v":144.95,"d":"$144.95"},0,"M80032-233-M  M Cascade Peak Low W"," ",{"$f":"--ISNUMBER(IFERROR(SEARCH(Orders!$E18,O459,1),\"\"))","v":1},{"$f":"IF(Q459=1,COUNTIF($Q$2:Q459,1),\"\")","v":458},{"$f":"IFERROR(INDEX($O2:$O986,MATCH(ROWS($Q$2:Q459),$R2:$R986,0)),\"\")","v":"M80032-233-M  M Cascade Peak Low W"}]
[5,"M80032  ","233","M  ","M Cascade Peak Low W","Cocoa","0-21033-49547-2","          ",9,null,{"v":72.5,"d":"$72.50"},{"v":145,"d":"$145.00"},{"v":144.95,"d":"$144.95"},0,"M80032-233-M  M Cascade Peak Low W"," ",{"$f":"--ISNUMBER(IFERROR(SEARCH(Orders!$E18,O460,1),\"\"))","v":1},{"$f":"IF(Q460=1,COUNTIF($Q$2:Q460,1),\"\")","v":459},{"$f":"IFERROR(INDEX($O2:$O986,MATCH(ROWS($Q$2:Q460),$R2:$R986,0)),\"\")","v":"M80032-233-M  M Cascade Peak Low W"}]
[5,"M80032  ","233","M  ","M Cascade Peak Low W","Cocoa","0-21033-49548-9","          ",9.5,null,{"v":72.5,"d":"$72.50"},{"v":145,"d":"$145.00"},{"v":144.95,"d":"$144.95"},0,"M80032-233-M  M Cascade Peak Low W"," ",{"$f":"--ISNUMBER(IFERROR(SEARCH(Orders!$E18,O461,1),\"\"))","v":1},{"$f":"IF(Q461=1,COUNTIF($Q$2:Q461,1),\"\")","v":460},{"$f":"IFERROR(INDEX($O2:$O986,MATCH(ROWS($Q$2:Q461),$R2:$R986,0)),\"\")","v":"M80032-233-M  M Cascade Peak Low W"}]
[5,"M80032  ","233","M  ","M Cascade Peak Low W","Cocoa","0-21033-49549-6","          ",10,null,{"v":72.5,"d":"$72.50"},{"v":145,"d":"$145.00"},{"v":144.95,"d":"$144.95"},0,"M80032-233-M  M Cascade Peak Low W"," ",{"$f":"--ISNUMBER(IFERROR(SEARCH(Orders!$E18,O462,1),\"\"))","v":1},{"$f":"IF(Q462=1,COUNTIF($Q$2:Q462,1),\"\")","v":461},{"$f":"IFERROR(INDEX($O2:$O986,MATCH(ROWS($Q$2:Q462),$R2:$R986,0)),\"\")","v":"M80032-233-M  M Cascade Peak Low W"}]
[5,"M80032  ","233","M  ","M Cascade Peak Low W","Cocoa","0-21033-49550-2","          ",10.5,null,{"v":72.5,"d":"$72.50"},{"v":145,"d":"$145.00"},{"v":144.95,"d":"$144.95"},0,"M80032-233-M  M Cascade Peak Low W"," ",{"$f":"--ISNUMBER(IFERROR(SEARCH(Orders!$E18,O463,1),\"\"))","v":1},{"$f":"IF(Q463=1,COUNTIF($Q$2:Q463,1),\"\")","v":462},{"$f":"IFERROR(INDEX($O2:$O986,MATCH(ROWS($Q$2:Q463),$R2:$R986,0)),\"\")","v":"M80032-233-M  M Cascade Peak Low W"}]
[5,"M80032  ","233","M  ","M Cascade Peak Low W","Cocoa","0-21033-49551-9","          ",11,null,{"v":72.5,"d":"$72.50"},{"v":145,"d":"$145.00"},{"v":144.95,"d":"$144.95"},0,"M80032-233-M  M Cascade Peak Low W"," ",{"$f":"--ISNUMBER(IFERROR(SEARCH(Orders!$E18,O464,1),\"\"))","v":1},{"$f":"IF(Q464=1,COUNTIF($Q$2:Q464,1),\"\")","v":463},{"$f":"IFERROR(INDEX($O2:$O986,MATCH(ROWS($Q$2:Q464),$R2:$R986,0)),\"\")","v":"M80032-233-M  M Cascade Peak Low W"}]
[5,"M80032  ","233","M  ","M Cascade Peak Low W","Cocoa","0-21033-49552-6","          ",11.5,null,{"v":72.5,"d":"$72.50"},{"v":145,"d":"$145.00"},{"v":144.95,"d":"$144.95"},0,"M80032-233-M  M Cascade Peak Low W"," ",{"$f":"--ISNUMBER(IFERROR(SEARCH(Orders!$E18,O465,1),\"\"))","v":1},{"$f":"IF(Q465=1,COUNTIF($Q$2:Q465,1),\"\")","v":464},{"$f":"IFERROR(INDEX($O2:$O986,MATCH(ROWS($Q$2:Q465),$R2:$R986,0)),\"\")","v":"M80032-233-M  M Cascade Peak Low W"}]
[5,"M80032  ","233","M  ","M Cascade Peak Low W","Cocoa","0-21033-49553-3","          ",12,null,{"v":72.5,"d":"$72.50"},{"v":145,"d":"$145.00"},{"v":144.95,"d":"$144.95"},0,"M80032-233-M  M Cascade Peak Low W"," ",{"$f":"--ISNUMBER(IFERROR(SEARCH(Orders!$E18,O466,1),\"\"))","v":1},{"$f":"IF(Q466=1,COUNTIF($Q$2:Q466,1),\"\")","v":465},{"$f":"IFERROR(INDEX($O2:$O986,MATCH(ROWS($Q$2:Q466),$R2:$R986,0)),\"\")","v":"M80032-233-M  M Cascade Peak Low W"}]
[5,"M80032  ","233","M  ","M Cascade Peak Low W","Cocoa","0-21033-49554-0","          ",12.5,null,{"v":72.5,"d":"$72.50"},{"v":145,"d":"$145.00"},{"v":144.95,"d":"$144.95"},0,"M80032-233-M  M Cascade Peak Low W"," ",{"$f":"--ISNUMBER(IFERROR(SEARCH(Orders!$E18,O467,1),\"\"))","v":1},{"$f":"IF(Q467=1,COUNTIF($Q$2:Q467,1),\"\")","v":466},{"$f":"IFERROR(INDEX($O2:$O986,MATCH(ROWS($Q$2:Q467),$R2:$R986,0)),\"\")","v":"M80032-233-M  M Cascade Peak Low W"}]
[5,"M80032  ","233","M  ","M Cascade Peak Low W","Cocoa","0-21033-49555-7","          ",13,null,{"v":72.5,"d":"$72.50"},{"v":145,"d":"$145.00"},{"v":144.95,"d":"$144.95"},0,"M80032-233-M  M Cascade Peak Low W"," ",{"$f":"--ISNUMBER(IFERROR(SEARCH(Orders!$E18,O468,1),\"\"))","v":1},{"$f":"IF(Q468=1,COUNTIF($Q$2:Q468,1),\"\")","v":467},{"$f":"IFERROR(INDEX($O2:$O986,MATCH(ROWS($Q$2:Q468),$R2:$R986,0)),\"\")","v":"M80032-233-M  M Cascade Peak Low W"}]
[5,"M80032  ","233","M  ","M Cascade Peak Low W","Cocoa","0-21033-49556-4","          ",14,null,{"v":72.5,"d":"$72.50"},{"v":145,"d":"$145.00"},{"v":144.95,"d":"$144.95"},0,"M80032-233-M  M Cascade Peak Low W"," ",{"$f":"--ISNUMBER(IFERROR(SEARCH(Orders!$E18,O469,1),\"\"))","v":1},{"$f":"IF(Q469=1,COUNTIF($Q$2:Q469,1),\"\")","v":468},{"$f":"IFERROR(INDEX($O2:$O986,MATCH(ROWS($Q$2:Q469),$R2:$R986,0)),\"\")","v":"M80032-233-M  M Cascade Peak Low W"}]
[5,"M80032  ","410","M  ","M Cascade Peak Low W","Navy","0-21033-49557-1","          ",8,null,{"v":72.5,"d":"$72.50"},{"v":145,"d":"$145.00"},{"v":144.95,"d":"$144.95"},0,"M80032-410-M  M Cascade Peak Low W"," ",{"$f":"--ISNUMBER(IFERROR(SEARCH(Orders!$E18,O470,1),\"\"))","v":1},{"$f":"IF(Q470=1,COUNTIF($Q$2:Q470,1),\"\")","v":469},{"$f":"IFERROR(INDEX($O2:$O986,MATCH(ROWS($Q$2:Q470),$R2:$R986,0)),\"\")","v":"M80032-410-M  M Cascade Peak Low W"}]
[5,"M80032  ","410","M  ","M Cascade Peak Low W","Navy","0-21033-49558-8","          ",8.5,null,{"v":72.5,"d":"$72.50"},{"v":145,"d":"$145.00"},{"v":144.95,"d":"$144.95"},0,"M80032-410-M  M Cascade Peak Low W"," ",{"$f":"--ISNUMBER(IFERROR(SEARCH(Orders!$E18,O471,1),\"\"))","v":1},{"$f":"IF(Q471=1,COUNTIF($Q$2:Q471,1),\"\")","v":470},{"$f":"IFERROR(INDEX($O2:$O986,MATCH(ROWS($Q$2:Q471),$R2:$R986,0)),\"\")","v":"M80032-410-M  M Cascade Peak Low W"}]
[5,"M80032  ","410","M  ","M Cascade Peak Low W","Navy","0-21033-49559-5","          ",9,null,{"v":72.5,"d":"$72.50"},{"v":145,"d":"$145.00"},{"v":144.95,"d":"$144.95"},0,"M80032-410-M  M Cascade Peak Low W"," ",{"$f":"--ISNUMBER(IFERROR(SEARCH(Orders!$E18,O472,1),\"\"))","v":1},{"$f":"IF(Q472=1,COUNTIF($Q$2:Q472,1),\"\")","v":471},{"$f":"IFERROR(INDEX($O2:$O986,MATCH(ROWS($Q$2:Q472),$R2:$R986,0)),\"\")","v":"M80032-410-M  M Cascade Peak Low W"}]
[5,"M80032  ","410","M  ","M Cascade Peak Low W","Navy","0-21033-49560-1","          ",9.5,null,{"v":72.5,"d":"$72.50"},{"v":145,"d":"$145.00"},{"v":144.95,"d":"$144.95"},0,"M80032-410-M  M Cascade Peak Low W"," ",{"$f":"--ISNUMBER(IFERROR(SEARCH(Orders!$E18,O473,1),\"\"))","v":1},{"$f":"IF(Q473=1,COUNTIF($Q$2:Q473,1),\"\")","v":472},{"$f":"IFERROR(INDEX($O2:$O986,MATCH(ROWS($Q$2:Q473),$R2:$R986,0)),\"\")","v":"M80032-410-M  M Cascade Peak Low W"}]
[5,"M80032  ","410","M  ","M Cascade Peak Low W","Navy","0-21033-49561-8","          ",10,null,{"v":72.5,"d":"$72.50"},{"v":145,"d":"$145.00"},{"v":144.95,"d":"$144.95"},0,"M80032-410-M  M Cascade Peak Low W"," ",{"$f":"--ISNUMBER(IFERROR(SEARCH(Orders!$E18,O474,1),\"\"))","v":1},{"$f":"IF(Q474=1,COUNTIF($Q$2:Q474,1),\"\")","v":473},{"$f":"IFERROR(INDEX($O2:$O986,MATCH(ROWS($Q$2:Q474),$R2:$R986,0)),\"\")","v":"M80032-410-M  M Cascade Peak Low W"}]
[5,"M80032  ","410","M  ","M Cascade Peak Low W","Navy","0-21033-49562-5","          ",10.5,null,{"v":72.5,"d":"$72.50"},{"v":145,"d":"$145.00"},{"v":144.95,"d":"$144.95"},0,"M80032-410-M  M Cascade Peak Low W"," ",{"$f":"--ISNUMBER(IFERROR(SEARCH(Orders!$E18,O475,1),\"\"))","v":1},{"$f":"IF(Q475=1,COUNTIF($Q$2:Q475,1),\"\")","v":474},{"$f":"IFERROR(INDEX($O2:$O986,MATCH(ROWS($Q$2:Q475),$R2:$R986,0)),\"\")","v":"M80032-410-M  M Cascade Peak Low W"}]
[5,"M80032  ","410","M  ","M Cascade Peak Low W","Navy","0-21033-49563-2","          ",11,null,{"v":72.5,"d":"$72.50"},{"v":145,"d":"$145.00"},{"v":144.95,"d":"$144.95"},0,"M80032-410-M  M Cascade Peak Low W"," ",{"$f":"--ISNUMBER(IFERROR(SEARCH(Orders!$E18,O476,1),\"\"))","v":1},{"$f":"IF(Q476=1,COUNTIF($Q$2:Q476,1),\"\")","v":475},{"$f":"IFERROR(INDEX($O2:$O986,MATCH(ROWS($Q$2:Q476),$R2:$R986,0)),\"\")","v":"M80032-410-M  M Cascade Peak Low W"}]
[5,"M80032  ","410","M  ","M Cascade Peak Low W","Navy","0-21033-49564-9","          ",11.5,null,{"v":72.5,"d":"$72.50"},{"v":145,"d":"$145.00"},{"v":144.95,"d":"$144.95"},0,"M80032-410-M  M Cascade Peak Low W"," ",{"$f":"--ISNUMBER(IFERROR(SEARCH(Orders!$E18,O477,1),\"\"))","v":1},{"$f":"IF(Q477=1,COUNTIF($Q$2:Q477,1),\"\")","v":476},{"$f":"IFERROR(INDEX($O2:$O986,MATCH(ROWS($Q$2:Q477),$R2:$R986,0)),\"\")","v":"M80032-410-M  M Cascade Peak Low W"}]
[5,"M80032  ","410","M  ","M Cascade Peak Low W","Navy","0-21033-49565-6","          ",12,null,{"v":72.5,"d":"$72.50"},{"v":145,"d":"$145.00"},{"v":144.95,"d":"$144.95"},0,"M80032-410-M  M Cascade Peak Low W"," ",{"$f":"--ISNUMBER(IFERROR(SEARCH(Orders!$E18,O478,1),\"\"))","v":1},{"$f":"IF(Q478=1,COUNTIF($Q$2:Q478,1),\"\")","v":477},{"$f":"IFERROR(INDEX($O2:$O986,MATCH(ROWS($Q$2:Q478),$R2:$R986,0)),\"\")","v":"M80032-410-M  M Cascade Peak Low W"}]
[5,"M80032  ","410","M  ","M Cascade Peak Low W","Navy","0-21033-49566-3","          ",12.5,null,{"v":72.5,"d":"$72.50"},{"v":145,"d":"$145.00"},{"v":144.95,"d":"$144.95"},0,"M80032-410-M  M Cascade Peak Low W"," ",{"$f":"--ISNUMBER(IFERROR(SEARCH(Orders!$E18,O479,1),\"\"))","v":1},{"$f":"IF(Q479=1,COUNTIF($Q$2:Q479,1),\"\")","v":478},{"$f":"IFERROR(INDEX($O2:$O986,MATCH(ROWS($Q$2:Q479),$R2:$R986,0)),\"\")","v":"M80032-410-M  M Cascade Peak Low W"}]
[5,"M80032  ","410","M  ","M Cascade Peak Low W","Navy","0-21033-49567-0","          ",13,null,{"v":72.5,"d":"$72.50"},{"v":145,"d":"$145.00"},{"v":144.95,"d":"$144.95"},0,"M80032-410-M  M Cascade Peak Low W"," ",{"$f":"--ISNUMBER(IFERROR(SEARCH(Orders!$E18,O480,1),\"\"))","v":1},{"$f":"IF(Q480=1,COUNTIF($Q$2:Q480,1),\"\")","v":479},{"$f":"IFERROR(INDEX($O2:$O986,MATCH(ROWS($Q$2:Q480),$R2:$R986,0)),\"\")","v":"M80032-410-M  M Cascade Peak Low W"}]
[5,"M80032  ","410","M  ","M Cascade Peak Low W","Navy","0-21033-49568-7","          ",14,null,{"v":72.5,"d":"$72.50"},{"v":145,"d":"$145.00"},{"v":144.95,"d":"$144.95"},0,"M80032-410-M  M Cascade Peak Low W"," ",{"$f":"--ISNUMBER(IFERROR(SEARCH(Orders!$E18,O481,1),\"\"))","v":1},{"$f":"IF(Q481=1,COUNTIF($Q$2:Q481,1),\"\")","v":480},{"$f":"IFERROR(INDEX($O2:$O986,MATCH(ROWS($Q$2:Q481),$R2:$R986,0)),\"\")","v":"M80032-410-M  M Cascade Peak Low W"}]
[1,"M80037  ","001","M  ","M Wild Sky Mid","Black","0-21033-49963-0","          ",7,null,{"v":77.5,"d":"$77.50"},{"v":155,"d":"$155.00"},{"v":154.95,"d":"$154.95"},0,"M80037-001-M  M Wild Sky Mid"," ",{"$f":"--ISNUMBER(IFERROR(SEARCH(Orders!$E18,O482,1),\"\"))","v":1},{"$f":"IF(Q482=1,COUNTIF($Q$2:Q482,1),\"\")","v":481},{"$f":"IFERROR(INDEX($O2:$O986,MATCH(ROWS($Q$2:Q482),$R2:$R986,0)),\"\")","v":"M80037-001-M  M Wild Sky Mid"}]
[1,"M80037  ","001","M  ","M Wild Sky Mid","Black","0-21033-49964-7","          ",7.5,null,{"v":77.5,"d":"$77.50"},{"v":155,"d":"$155.00"},{"v":154.95,"d":"$154.95"},0,"M80037-001-M  M Wild Sky Mid"," ",{"$f":"--ISNUMBER(IFERROR(SEARCH(Orders!$E18,O483,1),\"\"))","v":1},{"$f":"IF(Q483=1,COUNTIF($Q$2:Q483,1),\"\")","v":482},{"$f":"IFERROR(INDEX($O2:$O986,MATCH(ROWS($Q$2:Q483),$R2:$R986,0)),\"\")","v":"M80037-001-M  M Wild Sky Mid"}]
[1,"M80037  ","001","M  ","M Wild Sky Mid","Black","0-21033-49965-4","          ",8,null,{"v":77.5,"d":"$77.50"},{"v":155,"d":"$155.00"},{"v":154.95,"d":"$154.95"},0,"M80037-001-M  M Wild Sky Mid"," ",{"$f":"--ISNUMBER(IFERROR(SEARCH(Orders!$E18,O484,1),\"\"))","v":1},{"$f":"IF(Q484=1,COUNTIF($Q$2:Q484,1),\"\")","v":483},{"$f":"IFERROR(INDEX($O2:$O986,MATCH(ROWS($Q$2:Q484),$R2:$R986,0)),\"\")","v":"M80037-001-M  M Wild Sky Mid"}]
[1,"M80037  ","001","M  ","M Wild Sky Mid","Black","0-21033-49966-1","          ",8.5,null,{"v":77.5,"d":"$77.50"},{"v":155,"d":"$155.00"},{"v":154.95,"d":"$154.95"},0,"M80037-001-M  M Wild Sky Mid"," ",{"$f":"--ISNUMBER(IFERROR(SEARCH(Orders!$E18,O485,1),\"\"))","v":1},{"$f":"IF(Q485=1,COUNTIF($Q$2:Q485,1),\"\")","v":484},{"$f":"IFERROR(INDEX($O2:$O986,MATCH(ROWS($Q$2:Q485),$R2:$R986,0)),\"\")","v":"M80037-001-M  M Wild Sky Mid"}]
[1,"M80037  ","001","M  ","M Wild Sky Mid","Black","0-21033-49967-8","          ",9,null,{"v":77.5,"d":"$77.50"},{"v":155,"d":"$155.00"},{"v":154.95,"d":"$154.95"},0,"M80037-001-M  M Wild Sky Mid"," ",{"$f":"--ISNUMBER(IFERROR(SEARCH(Orders!$E18,O486,1),\"\"))","v":1},{"$f":"IF(Q486=1,COUNTIF($Q$2:Q486,1),\"\")","v":485},{"$f":"IFERROR(INDEX($O2:$O986,MATCH(ROWS($Q$2:Q486),$R2:$R986,0)),\"\")","v":"M80037-001-M  M Wild Sky Mid"}]
[1,"M80037  ","001","M  ","M Wild Sky Mid","Black","0-21033-49968-5","          ",9.5,null,{"v":77.5,"d":"$77.50"},{"v":155,"d":"$155.00"},{"v":154.95,"d":"$154.95"},0,"M80037-001-M  M Wild Sky Mid"," ",{"$f":"--ISNUMBER(IFERROR(SEARCH(Orders!$E18,O487,1),\"\"))","v":1},{"$f":"IF(Q487=1,COUNTIF($Q$2:Q487,1),\"\")","v":486},{"$f":"IFERROR(INDEX($O2:$O986,MATCH(ROWS($Q$2:Q487),$R2:$R986,0)),\"\")","v":"M80037-001-M  M Wild Sky Mid"}]
[1,"M80037  ","001","M  ","M Wild Sky Mid","Black","0-21033-49969-2","          ",10,null,{"v":77.5,"d":"$77.50"},{"v":155,"d":"$155.00"},{"v":154.95,"d":"$154.95"},0,"M80037-001-M  M Wild Sky Mid"," ",{"$f":"--ISNUMBER(IFERROR(SEARCH(Orders!$E18,O488,1),\"\"))","v":1},{"$f":"IF(Q488=1,COUNTIF($Q$2:Q488,1),\"\")","v":487},{"$f":"IFERROR(INDEX($O2:$O986,MATCH(ROWS($Q$2:Q488),$R2:$R986,0)),\"\")","v":"M80037-001-M  M Wild Sky Mid"}]
[1,"M80037  ","001","M  ","M Wild Sky Mid","Black","0-21033-49970-8","          ",10.5,null,{"v":77.5,"d":"$77.50"},{"v":155,"d":"$155.00"},{"v":154.95,"d":"$154.95"},0,"M80037-001-M  M Wild Sky Mid"," ",{"$f":"--ISNUMBER(IFERROR(SEARCH(Orders!$E18,O489,1),\"\"))","v":1},{"$f":"IF(Q489=1,COUNTIF($Q$2:Q489,1),\"\")","v":488},{"$f":"IFERROR(INDEX($O2:$O986,MATCH(ROWS($Q$2:Q489),$R2:$R986,0)),\"\")","v":"M80037-001-M  M Wild Sky Mid"}]
[1,"M80037  ","001","M  ","M Wild Sky Mid","Black","0-21033-49971-5","          ",11,null,{"v":77.5,"d":"$77.50"},{"v":155,"d":"$155.00"},{"v":154.95,"d":"$154.95"},0,"M80037-001-M  M Wild Sky Mid"," ",{"$f":"--ISNUMBER(IFERROR(SEARCH(Orders!$E18,O490,1),\"\"))","v":1},{"$f":"IF(Q490=1,COUNTIF($Q$2:Q490,1),\"\")","v":489},{"$f":"IFERROR(INDEX($O2:$O986,MATCH(ROWS($Q$2:Q490),$R2:$R986,0)),\"\")","v":"M80037-001-M  M Wild Sky Mid"}]
[1,"M80037  ","001","M  ","M Wild Sky Mid","Black","0-21033-49972-2","          ",11.5,null,{"v":77.5,"d":"$77.50"},{"v":155,"d":"$155.00"},{"v":154.95,"d":"$154.95"},0,"M80037-001-M  M Wild Sky Mid"," ",{"$f":"--ISNUMBER(IFERROR(SEARCH(Orders!$E18,O491,1),\"\"))","v":1},{"$f":"IF(Q491=1,COUNTIF($Q$2:Q491,1),\"\")","v":490},{"$f":"IFERROR(INDEX($O2:$O986,MATCH(ROWS($Q$2:Q491),$R2:$R986,0)),\"\")","v":"M80037-001-M  M Wild Sky Mid"}]
[1,"M80037  ","001","M  ","M Wild Sky Mid","Black","0-21033-49973-9","          ",12,null,{"v":77.5,"d":"$77.50"},{"v":155,"d":"$155.00"},{"v":154.95,"d":"$154.95"},0,"M80037-001-M  M Wild Sky Mid"," ",{"$f":"--ISNUMBER(IFERROR(SEARCH(Orders!$E18,O492,1),\"\"))","v":1},{"$f":"IF(Q492=1,COUNTIF($Q$2:Q492,1),\"\")","v":491},{"$f":"IFERROR(INDEX($O2:$O986,MATCH(ROWS($Q$2:Q492),$R2:$R986,0)),\"\")","v":"M80037-001-M  M Wild Sky Mid"}]
[1,"M80037  ","001","M  ","M Wild Sky Mid","Black","0-21033-49974-6","          ",12.5,null,{"v":77.5,"d":"$77.50"},{"v":155,"d":"$155.00"},{"v":154.95,"d":"$154.95"},0,"M80037-001-M  M Wild Sky Mid"," ",{"$f":"--ISNUMBER(IFERROR(SEARCH(Orders!$E18,O493,1),\"\"))","v":1},{"$f":"IF(Q493=1,COUNTIF($Q$2:Q493,1),\"\")","v":492},{"$f":"IFERROR(INDEX($O2:$O986,MATCH(ROWS($Q$2:Q493),$R2:$R986,0)),\"\")","v":"M80037-001-M  M Wild Sky Mid"}]
[1,"M80037  ","001","M  ","M Wild Sky Mid","Black","0-21033-49975-3","          ",13,null,{"v":77.5,"d":"$77.50"},{"v":155,"d":"$155.00"},{"v":154.95,"d":"$154.95"},0,"M80037-001-M  M Wild Sky Mid"," ",{"$f":"--ISNUMBER(IFERROR(SEARCH(Orders!$E18,O494,1),\"\"))","v":1},{"$f":"IF(Q494=1,COUNTIF($Q$2:Q494,1),\"\")","v":493},{"$f":"IFERROR(INDEX($O2:$O986,MATCH(ROWS($Q$2:Q494),$R2:$R986,0)),\"\")","v":"M80037-001-M  M Wild Sky Mid"}]
[1,"M80037  ","001","M  ","M Wild Sky Mid","Black","0-21033-49976-0","          ",14,null,{"v":77.5,"d":"$77.50"},{"v":155,"d":"$155.00"},{"v":154.95,"d":"$154.95"},0,"M80037-001-M  M Wild Sky Mid"," ",{"$f":"--ISNUMBER(IFERROR(SEARCH(Orders!$E18,O495,1),\"\"))","v":1},{"$f":"IF(Q495=1,COUNTIF($Q$2:Q495,1),\"\")","v":494},{"$f":"IFERROR(INDEX($O2:$O986,MATCH(ROWS($Q$2:Q495),$R2:$R986,0)),\"\")","v":"M80037-001-M  M Wild Sky Mid"}]
[1,"M80037  ","072","M  ","M Wild Sky Mid","Dkgry/Gold","0-21033-49977-7","          ",7,null,{"v":77.5,"d":"$77.50"},{"v":155,"d":"$155.00"},{"v":154.95,"d":"$154.95"},0,"M80037-072-M  M Wild Sky Mid"," ",{"$f":"--ISNUMBER(IFERROR(SEARCH(Orders!$E18,O496,1),\"\"))","v":1},{"$f":"IF(Q496=1,COUNTIF($Q$2:Q496,1),\"\")","v":495},{"$f":"IFERROR(INDEX($O2:$O986,MATCH(ROWS($Q$2:Q496),$R2:$R986,0)),\"\")","v":"M80037-072-M  M Wild Sky Mid"}]
[1,"M80037  ","072","M  ","M Wild Sky Mid","Dkgry/Gold","0-21033-49978-4","          ",7.5,null,{"v":77.5,"d":"$77.50"},{"v":155,"d":"$155.00"},{"v":154.95,"d":"$154.95"},0,"M80037-072-M  M Wild Sky Mid"," ",{"$f":"--ISNUMBER(IFERROR(SEARCH(Orders!$E18,O497,1),\"\"))","v":1},{"$f":"IF(Q497=1,COUNTIF($Q$2:Q497,1),\"\")","v":496},{"$f":"IFERROR(INDEX($O2:$O986,MATCH(ROWS($Q$2:Q497),$R2:$R986,0)),\"\")","v":"M80037-072-M  M Wild Sky Mid"}]
[1,"M80037  ","072","M  ","M Wild Sky Mid","Dkgry/Gold","0-21033-49979-1","          ",8,null,{"v":77.5,"d":"$77.50"},{"v":155,"d":"$155.00"},{"v":154.95,"d":"$154.95"},0,"M80037-072-M  M Wild Sky Mid"," ",{"$f":"--ISNUMBER(IFERROR(SEARCH(Orders!$E18,O498,1),\"\"))","v":1},{"$f":"IF(Q498=1,COUNTIF($Q$2:Q498,1),\"\")","v":497},{"$f":"IFERROR(INDEX($O2:$O986,MATCH(ROWS($Q$2:Q498),$R2:$R986,0)),\"\")","v":"M80037-072-M  M Wild Sky Mid"}]
[1,"M80037  ","072","M  ","M Wild Sky Mid","Dkgry/Gold","0-21033-49980-7","          ",8.5,null,{"v":77.5,"d":"$77.50"},{"v":155,"d":"$155.00"},{"v":154.95,"d":"$154.95"},0,"M80037-072-M  M Wild Sky Mid"," ",{"$f":"--ISNUMBER(IFERROR(SEARCH(Orders!$E18,O499,1),\"\"))","v":1},{"$f":"IF(Q499=1,COUNTIF($Q$2:Q499,1),\"\")","v":498},{"$f":"IFERROR(INDEX($O2:$O986,MATCH(ROWS($Q$2:Q499),$R2:$R986,0)),\"\")","v":"M80037-072-M  M Wild Sky Mid"}]
[1,"M80037  ","072","M  ","M Wild Sky Mid","Dkgry/Gold","0-21033-49981-4","          ",9,null,{"v":77.5,"d":"$77.50"},{"v":155,"d":"$155.00"},{"v":154.95,"d":"$154.95"},0,"M80037-072-M  M Wild Sky Mid"," ",{"$f":"--ISNUMBER(IFERROR(SEARCH(Orders!$E18,O500,1),\"\"))","v":1},{"$f":"IF(Q500=1,COUNTIF($Q$2:Q500,1),\"\")","v":499},{"$f":"IFERROR(INDEX($O2:$O986,MATCH(ROWS($Q$2:Q500),$R2:$R986,0)),\"\")","v":"M80037-072-M  M Wild Sky Mid"}]
[1,"M80037  ","072","M  ","M Wild Sky Mid","Dkgry/Gold","0-21033-49982-1","          ",9.5,null,{"v":77.5,"d":"$77.50"},{"v":155,"d":"$155.00"},{"v":154.95,"d":"$154.95"},0,"M80037-072-M  M Wild Sky Mid"," ",{"$f":"--ISNUMBER(IFERROR(SEARCH(Orders!$E18,O501,1),\"\"))","v":1},{"$f":"IF(Q501=1,COUNTIF($Q$2:Q501,1),\"\")","v":500},{"$f":"IFERROR(INDEX($O2:$O986,MATCH(ROWS($Q$2:Q501),$R2:$R986,0)),\"\")","v":"M80037-072-M  M Wild Sky Mid"}]
[1,"M80037  ","072","M  ","M Wild Sky Mid","Dkgry/Gold","0-21033-49983-8","          ",10,null,{"v":77.5,"d":"$77.50"},{"v":155,"d":"$155.00"},{"v":154.95,"d":"$154.95"},0,"M80037-072-M  M Wild Sky Mid"," ",{"$f":"--ISNUMBER(IFERROR(SEARCH(Orders!$E18,O502,1),\"\"))","v":1},{"$f":"IF(Q502=1,COUNTIF($Q$2:Q502,1),\"\")","v":501},{"$f":"IFERROR(INDEX($O2:$O986,MATCH(ROWS($Q$2:Q502),$R2:$R986,0)),\"\")","v":"M80037-072-M  M Wild Sky Mid"}]
[1,"M80037  ","072","M  ","M Wild Sky Mid","Dkgry/Gold","0-21033-49984-5","          ",10.5,null,{"v":77.5,"d":"$77.50"},{"v":155,"d":"$155.00"},{"v":154.95,"d":"$154.95"},0,"M80037-072-M  M Wild Sky Mid"," ",{"$f":"--ISNUMBER(IFERROR(SEARCH(Orders!$E18,O503,1),\"\"))","v":1},{"$f":"IF(Q503=1,COUNTIF($Q$2:Q503,1),\"\")","v":502},{"$f":"IFERROR(INDEX($O2:$O986,MATCH(ROWS($Q$2:Q503),$R2:$R986,0)),\"\")","v":"M80037-072-M  M Wild Sky Mid"}]
[1,"M80037  ","072","M  ","M Wild Sky Mid","Dkgry/Gold","0-21033-49985-2","          ",11,null,{"v":77.5,"d":"$77.50"},{"v":155,"d":"$155.00"},{"v":154.95,"d":"$154.95"},0,"M80037-072-M  M Wild Sky Mid"," ",{"$f":"--ISNUMBER(IFERROR(SEARCH(Orders!$E18,O504,1),\"\"))","v":1},{"$f":"IF(Q504=1,COUNTIF($Q$2:Q504,1),\"\")","v":503},{"$f":"IFERROR(INDEX($O2:$O986,MATCH(ROWS($Q$2:Q504),$R2:$R986,0)),\"\")","v":"M80037-072-M  M Wild Sky Mid"}]
[1,"M80037  ","072","M  ","M Wild Sky Mid","Dkgry/Gold","0-21033-49986-9","          ",11.5,null,{"v":77.5,"d":"$77.50"},{"v":155,"d":"$155.00"},{"v":154.95,"d":"$154.95"},0,"M80037-072-M  M Wild Sky Mid"," ",{"$f":"--ISNUMBER(IFERROR(SEARCH(Orders!$E18,O505,1),\"\"))","v":1},{"$f":"IF(Q505=1,COUNTIF($Q$2:Q505,1),\"\")","v":504},{"$f":"IFERROR(INDEX($O2:$O986,MATCH(ROWS($Q$2:Q505),$R2:$R986,0)),\"\")","v":"M80037-072-M  M Wild Sky Mid"}]
[1,"M80037  ","072","M  ","M Wild Sky Mid","Dkgry/Gold","0-21033-49987-6","          ",12,null,{"v":77.5,"d":"$77.50"},{"v":155,"d":"$155.00"},{"v":154.95,"d":"$154.95"},0,"M80037-072-M  M Wild Sky Mid"," ",{"$f":"--ISNUMBER(IFERROR(SEARCH(Orders!$E18,O506,1),\"\"))","v":1},{"$f":"IF(Q506=1,COUNTIF($Q$2:Q506,1),\"\")","v":505},{"$f":"IFERROR(INDEX($O2:$O986,MATCH(ROWS($Q$2:Q506),$R2:$R986,0)),\"\")","v":"M80037-072-M  M Wild Sky Mid"}]
[1,"M80037  ","072","M  ","M Wild Sky Mid","Dkgry/Gold","0-21033-49988-3","          ",12.5,null,{"v":77.5,"d":"$77.50"},{"v":155,"d":"$155.00"},{"v":154.95,"d":"$154.95"},0,"M80037-072-M  M Wild Sky Mid"," ",{"$f":"--ISNUMBER(IFERROR(SEARCH(Orders!$E18,O507,1),\"\"))","v":1},{"$f":"IF(Q507=1,COUNTIF($Q$2:Q507,1),\"\")","v":506},{"$f":"IFERROR(INDEX($O2:$O986,MATCH(ROWS($Q$2:Q507),$R2:$R986,0)),\"\")","v":"M80037-072-M  M Wild Sky Mid"}]
[1,"M80037  ","072","M  ","M Wild Sky Mid","Dkgry/Gold","0-21033-49989-0","          ",13,null,{"v":77.5,"d":"$77.50"},{"v":155,"d":"$155.00"},{"v":154.95,"d":"$154.95"},0,"M80037-072-M  M Wild Sky Mid"," ",{"$f":"--ISNUMBER(IFERROR(SEARCH(Orders!$E18,O508,1),\"\"))","v":1},{"$f":"IF(Q508=1,COUNTIF($Q$2:Q508,1),\"\")","v":507},{"$f":"IFERROR(INDEX($O2:$O986,MATCH(ROWS($Q$2:Q508),$R2:$R986,0)),\"\")","v":"M80037-072-M  M Wild Sky Mid"}]
[1,"M80037  ","072","M  ","M Wild Sky Mid","Dkgry/Gold","0-21033-49990-6","          ",14,null,{"v":77.5,"d":"$77.50"},{"v":155,"d":"$155.00"},{"v":154.95,"d":"$154.95"},0,"M80037-072-M  M Wild Sky Mid"," ",{"$f":"--ISNUMBER(IFERROR(SEARCH(Orders!$E18,O509,1),\"\"))","v":1},{"$f":"IF(Q509=1,COUNTIF($Q$2:Q509,1),\"\")","v":508},{"$f":"IFERROR(INDEX($O2:$O986,MATCH(ROWS($Q$2:Q509),$R2:$R986,0)),\"\")","v":"M80037-072-M  M Wild Sky Mid"}]
[1,"M80037  ","249","M  ","M Wild Sky Mid","Brn Multi","0-21033-49991-3","          ",7,null,{"v":77.5,"d":"$77.50"},{"v":155,"d":"$155.00"},{"v":154.95,"d":"$154.95"},0,"M80037-249-M  M Wild Sky Mid"," ",{"$f":"--ISNUMBER(IFERROR(SEARCH(Orders!$E18,O510,1),\"\"))","v":1},{"$f":"IF(Q510=1,COUNTIF($Q$2:Q510,1),\"\")","v":509},{"$f":"IFERROR(INDEX($O2:$O986,MATCH(ROWS($Q$2:Q510),$R2:$R986,0)),\"\")","v":"M80037-249-M  M Wild Sky Mid"}]
[1,"M80037  ","249","M  ","M Wild Sky Mid","Brn Multi","0-21033-49992-0","          ",7.5,null,{"v":77.5,"d":"$77.50"},{"v":155,"d":"$155.00"},{"v":154.95,"d":"$154.95"},0,"M80037-249-M  M Wild Sky Mid"," ",{"$f":"--ISNUMBER(IFERROR(SEARCH(Orders!$E18,O511,1),\"\"))","v":1},{"$f":"IF(Q511=1,COUNTIF($Q$2:Q511,1),\"\")","v":510},{"$f":"IFERROR(INDEX($O2:$O986,MATCH(ROWS($Q$2:Q511),$R2:$R986,0)),\"\")","v":"M80037-249-M  M Wild Sky Mid"}]
[1,"M80037  ","249","M  ","M Wild Sky Mid","Brn Multi","0-21033-49993-7","          ",8,null,{"v":77.5,"d":"$77.50"},{"v":155,"d":"$155.00"},{"v":154.95,"d":"$154.95"},0,"M80037-249-M  M Wild Sky Mid"," ",{"$f":"--ISNUMBER(IFERROR(SEARCH(Orders!$E18,O512,1),\"\"))","v":1},{"$f":"IF(Q512=1,COUNTIF($Q$2:Q512,1),\"\")","v":511},{"$f":"IFERROR(INDEX($O2:$O986,MATCH(ROWS($Q$2:Q512),$R2:$R986,0)),\"\")","v":"M80037-249-M  M Wild Sky Mid"}]
[1,"M80037  ","249","M  ","M Wild Sky Mid","Brn Multi","0-21033-49994-4","          ",8.5,null,{"v":77.5,"d":"$77.50"},{"v":155,"d":"$155.00"},{"v":154.95,"d":"$154.95"},0,"M80037-249-M  M Wild Sky Mid"," ",{"$f":"--ISNUMBER(IFERROR(SEARCH(Orders!$E18,O513,1),\"\"))","v":1},{"$f":"IF(Q513=1,COUNTIF($Q$2:Q513,1),\"\")","v":512},{"$f":"IFERROR(INDEX($O2:$O986,MATCH(ROWS($Q$2:Q513),$R2:$R986,0)),\"\")","v":"M80037-249-M  M Wild Sky Mid"}]
[1,"M80037  ","249","M  ","M Wild Sky Mid","Brn Multi","0-21033-49995-1","          ",9,null,{"v":77.5,"d":"$77.50"},{"v":155,"d":"$155.00"},{"v":154.95,"d":"$154.95"},{"$f":"J514*K514","v":0},"M80037-249-M  M Wild Sky Mid"," ",{"$f":"--ISNUMBER(IFERROR(SEARCH(Orders!$E18,O514,1),\"\"))","v":1},{"$f":"IF(Q514=1,COUNTIF($Q$2:Q514,1),\"\")","v":513},{"$f":"IFERROR(INDEX($O2:$O986,MATCH(ROWS($Q$2:Q514),$R2:$R986,0)),\"\")","v":"M80037-249-M  M Wild Sky Mid"}]
[1,"M80037  ","249","M  ","M Wild Sky Mid","Brn Multi","0-21033-49996-8","          ",9.5,null,{"v":77.5,"d":"$77.50"},{"v":155,"d":"$155.00"},{"v":154.95,"d":"$154.95"},0,"M80037-249-M  M Wild Sky Mid"," ",{"$f":"--ISNUMBER(IFERROR(SEARCH(Orders!$E18,O515,1),\"\"))","v":1},{"$f":"IF(Q515=1,COUNTIF($Q$2:Q515,1),\"\")","v":514},{"$f":"IFERROR(INDEX($O2:$O986,MATCH(ROWS($Q$2:Q515),$R2:$R986,0)),\"\")","v":"M80037-249-M  M Wild Sky Mid"}]
[1,"M80037  ","249","M  ","M Wild Sky Mid","Brn Multi","0-21033-49997-5","          ",10,null,{"v":77.5,"d":"$77.50"},{"v":155,"d":"$155.00"},{"v":154.95,"d":"$154.95"},0,"M80037-249-M  M Wild Sky Mid"," ",{"$f":"--ISNUMBER(IFERROR(SEARCH(Orders!$E18,O516,1),\"\"))","v":1},{"$f":"IF(Q516=1,COUNTIF($Q$2:Q516,1),\"\")","v":515},{"$f":"IFERROR(INDEX($O2:$O986,MATCH(ROWS($Q$2:Q516),$R2:$R986,0)),\"\")","v":"M80037-249-M  M Wild Sky Mid"}]
[1,"M80037  ","249","M  ","M Wild Sky Mid","Brn Multi","0-21033-49998-2","          ",10.5,null,{"v":77.5,"d":"$77.50"},{"v":155,"d":"$155.00"},{"v":154.95,"d":"$154.95"},0,"M80037-249-M  M Wild Sky Mid"," ",{"$f":"--ISNUMBER(IFERROR(SEARCH(Orders!$E18,O517,1),\"\"))","v":1},{"$f":"IF(Q517=1,COUNTIF($Q$2:Q517,1),\"\")","v":516},{"$f":"IFERROR(INDEX($O2:$O986,MATCH(ROWS($Q$2:Q517),$R2:$R986,0)),\"\")","v":"M80037-249-M  M Wild Sky Mid"}]
[1,"M80037  ","249","M  ","M Wild Sky Mid","Brn Multi","0-21033-49999-9","          ",11,null,{"v":77.5,"d":"$77.50"},{"v":155,"d":"$155.00"},{"v":154.95,"d":"$154.95"},0,"M80037-249-M  M Wild Sky Mid"," ",{"$f":"--ISNUMBER(IFERROR(SEARCH(Orders!$E18,O518,1),\"\"))","v":1},{"$f":"IF(Q518=1,COUNTIF($Q$2:Q518,1),\"\")","v":517},{"$f":"IFERROR(INDEX($O2:$O986,MATCH(ROWS($Q$2:Q518),$R2:$R986,0)),\"\")","v":"M80037-249-M  M Wild Sky Mid"}]
[1,"M80037  ","249","M  ","M Wild Sky Mid","Brn Multi","0-21033-50000-8","          ",11.5,null,{"v":77.5,"d":"$77.50"},{"v":155,"d":"$155.00"},{"v":154.95,"d":"$154.95"},0,"M80037-249-M  M Wild Sky Mid"," ",{"$f":"--ISNUMBER(IFERROR(SEARCH(Orders!$E18,O519,1),\"\"))","v":1},{"$f":"IF(Q519=1,COUNTIF($Q$2:Q519,1),\"\")","v":518},{"$f":"IFERROR(INDEX($O2:$O986,MATCH(ROWS($Q$2:Q519),$R2:$R986,0)),\"\")","v":"M80037-249-M  M Wild Sky Mid"}]
[1,"M80037  ","249","M  ","M Wild Sky Mid","Brn Multi","0-21033-50001-5","          ",12,null,{"v":77.5,"d":"$77.50"},{"v":155,"d":"$155.00"},{"v":154.95,"d":"$154.95"},0,"M80037-249-M  M Wild Sky Mid"," ",{"$f":"--ISNUMBER(IFERROR(SEARCH(Orders!$E18,O520,1),\"\"))","v":1},{"$f":"IF(Q520=1,COUNTIF($Q$2:Q520,1),\"\")","v":519},{"$f":"IFERROR(INDEX($O2:$O986,MATCH(ROWS($Q$2:Q520),$R2:$R986,0)),\"\")","v":"M80037-249-M  M Wild Sky Mid"}]
[1,"M80037  ","249","M  ","M Wild Sky Mid","Brn Multi","0-21033-50002-2","          ",12.5,null,{"v":77.5,"d":"$77.50"},{"v":155,"d":"$155.00"},{"v":154.95,"d":"$154.95"},0,"M80037-249-M  M Wild Sky Mid"," ",{"$f":"--ISNUMBER(IFERROR(SEARCH(Orders!$E18,O521,1),\"\"))","v":1},{"$f":"IF(Q521=1,COUNTIF($Q$2:Q521,1),\"\")","v":520},{"$f":"IFERROR(INDEX($O2:$O986,MATCH(ROWS($Q$2:Q521),$R2:$R986,0)),\"\")","v":"M80037-249-M  M Wild Sky Mid"}]
[1,"M80037  ","249","M  ","M Wild Sky Mid","Brn Multi","0-21033-50003-9","          ",13,null,{"v":77.5,"d":"$77.50"},{"v":155,"d":"$155.00"},{"v":154.95,"d":"$154.95"},0,"M80037-249-M  M Wild Sky Mid"," ",{"$f":"--ISNUMBER(IFERROR(SEARCH(Orders!$E18,O522,1),\"\"))","v":1},{"$f":"IF(Q522=1,COUNTIF($Q$2:Q522,1),\"\")","v":521},{"$f":"IFERROR(INDEX($O2:$O986,MATCH(ROWS($Q$2:Q522),$R2:$R986,0)),\"\")","v":"M80037-249-M  M Wild Sky Mid"}]
[1,"M80037  ","249","M  ","M Wild Sky Mid","Brn Multi","0-21033-50004-6","          ",14,null,{"v":77.5,"d":"$77.50"},{"v":155,"d":"$155.00"},{"v":154.95,"d":"$154.95"},0,"M80037-249-M  M Wild Sky Mid"," ",{"$f":"--ISNUMBER(IFERROR(SEARCH(Orders!$E18,O523,1),\"\"))","v":1},{"$f":"IF(Q523=1,COUNTIF($Q$2:Q523,1),\"\")","v":522},{"$f":"IFERROR(INDEX($O2:$O986,MATCH(ROWS($Q$2:Q523),$R2:$R986,0)),\"\")","v":"M80037-249-M  M Wild Sky Mid"}]
[28,"U80035  ","001","M  ","Rogue","Black","0-21033-49915-9","          ",4,null,{"v":42.5,"d":"$42.50"},{"v":85,"d":"$85.00"},{"v":84.95,"d":"$84.95"},0,"U80035-001-M  Rogue"," ",{"$f":"--ISNUMBER(IFERROR(SEARCH(Orders!$E18,O524,1),\"\"))","v":1},{"$f":"IF(Q524=1,COUNTIF($Q$2:Q524,1),\"\")","v":523},{"$f":"IFERROR(INDEX($O2:$O986,MATCH(ROWS($Q$2:Q524),$R2:$R986,0)),\"\")","v":"U80035-001-M  Rogue"}]
[28,"U80035  ","001","M  ","Rogue","Black","0-21033-49916-6","          ",5,null,{"v":42.5,"d":"$42.50"},{"v":85,"d":"$85.00"},{"v":84.95,"d":"$84.95"},0,"U80035-001-M  Rogue"," ",{"$f":"--ISNUMBER(IFERROR(SEARCH(Orders!$E18,O525,1),\"\"))","v":1},{"$f":"IF(Q525=1,COUNTIF($Q$2:Q525,1),\"\")","v":524},{"$f":"IFERROR(INDEX($O2:$O986,MATCH(ROWS($Q$2:Q525),$R2:$R986,0)),\"\")","v":"U80035-001-M  Rogue"}]
[28,"U80035  ","001","M  ","Rogue","Black","0-21033-49917-3","          ",6,null,{"v":42.5,"d":"$42.50"},{"v":85,"d":"$85.00"},{"v":84.95,"d":"$84.95"},0,"U80035-001-M  Rogue"," ",{"$f":"--ISNUMBER(IFERROR(SEARCH(Orders!$E18,O526,1),\"\"))","v":1},{"$f":"IF(Q526=1,COUNTIF($Q$2:Q526,1),\"\")","v":525},{"$f":"IFERROR(INDEX($O2:$O986,MATCH(ROWS($Q$2:Q526),$R2:$R986,0)),\"\")","v":"U80035-001-M  Rogue"}]
[28,"U80035  ","001","M  ","Rogue","Black","0-21033-49918-0","          ",7,null,{"v":42.5,"d":"$42.50"},{"v":85,"d":"$85.00"},{"v":84.95,"d":"$84.95"},0,"U80035-001-M  Rogue"," ",{"$f":"--ISNUMBER(IFERROR(SEARCH(Orders!$E18,O527,1),\"\"))","v":1},{"$f":"IF(Q527=1,COUNTIF($Q$2:Q527,1),\"\")","v":526},{"$f":"IFERROR(INDEX($O2:$O986,MATCH(ROWS($Q$2:Q527),$R2:$R986,0)),\"\")","v":"U80035-001-M  Rogue"}]
[28,"U80035  ","001","M  ","Rogue","Black","0-21033-49919-7","          ",8,null,{"v":42.5,"d":"$42.50"},{"v":85,"d":"$85.00"},{"v":84.95,"d":"$84.95"},0,"U80035-001-M  Rogue"," ",{"$f":"--ISNUMBER(IFERROR(SEARCH(Orders!$E18,O528,1),\"\"))","v":1},{"$f":"IF(Q528=1,COUNTIF($Q$2:Q528,1),\"\")","v":527},{"$f":"IFERROR(INDEX($O2:$O986,MATCH(ROWS($Q$2:Q528),$R2:$R986,0)),\"\")","v":"U80035-001-M  Rogue"}]
[28,"U80035  ","001","M  ","Rogue","Black","0-21033-49920-3","          ",9,null,{"v":42.5,"d":"$42.50"},{"v":85,"d":"$85.00"},{"v":84.95,"d":"$84.95"},0,"U80035-001-M  Rogue"," ",{"$f":"--ISNUMBER(IFERROR(SEARCH(Orders!$E18,O529,1),\"\"))","v":1},{"$f":"IF(Q529=1,COUNTIF($Q$2:Q529,1),\"\")","v":528},{"$f":"IFERROR(INDEX($O2:$O986,MATCH(ROWS($Q$2:Q529),$R2:$R986,0)),\"\")","v":"U80035-001-M  Rogue"}]
[28,"U80035  ","001","M  ","Rogue","Black","0-21033-49921-0","          ",10,null,{"v":42.5,"d":"$42.50"},{"v":85,"d":"$85.00"},{"v":84.95,"d":"$84.95"},0,"U80035-001-M  Rogue"," ",{"$f":"--ISNUMBER(IFERROR(SEARCH(Orders!$E18,O530,1),\"\"))","v":1},{"$f":"IF(Q530=1,COUNTIF($Q$2:Q530,1),\"\")","v":529},{"$f":"IFERROR(INDEX($O2:$O986,MATCH(ROWS($Q$2:Q530),$R2:$R986,0)),\"\")","v":"U80035-001-M  Rogue"}]
[28,"U80035  ","001","M  ","Rogue","Black","0-21033-49922-7","          ",11,null,{"v":42.5,"d":"$42.50"},{"v":85,"d":"$85.00"},{"v":84.95,"d":"$84.95"},0,"U80035-001-M  Rogue"," ",{"$f":"--ISNUMBER(IFERROR(SEARCH(Orders!$E18,O531,1),\"\"))","v":1},{"$f":"IF(Q531=1,COUNTIF($Q$2:Q531,1),\"\")","v":530},{"$f":"IFERROR(INDEX($O2:$O986,MATCH(ROWS($Q$2:Q531),$R2:$R986,0)),\"\")","v":"U80035-001-M  Rogue"}]
[28,"U80035  ","001","M  ","Rogue","Black","0-21033-49923-4","          ",12,null,{"v":42.5,"d":"$42.50"},{"v":85,"d":"$85.00"},{"v":84.95,"d":"$84.95"},0,"U80035-001-M  Rogue"," ",{"$f":"--ISNUMBER(IFERROR(SEARCH(Orders!$E18,O532,1),\"\"))","v":1},{"$f":"IF(Q532=1,COUNTIF($Q$2:Q532,1),\"\")","v":531},{"$f":"IFERROR(INDEX($O2:$O986,MATCH(ROWS($Q$2:Q532),$R2:$R986,0)),\"\")","v":"U80035-001-M  Rogue"}]
[28,"U80035  ","001","M  ","Rogue","Black","0-21033-49924-1","          ",13,null,{"v":42.5,"d":"$42.50"},{"v":85,"d":"$85.00"},{"v":84.95,"d":"$84.95"},0,"U80035-001-M  Rogue"," ",{"$f":"--ISNUMBER(IFERROR(SEARCH(Orders!$E18,O533,1),\"\"))","v":1},{"$f":"IF(Q533=1,COUNTIF($Q$2:Q533,1),\"\")","v":532},{"$f":"IFERROR(INDEX($O2:$O986,MATCH(ROWS($Q$2:Q533),$R2:$R986,0)),\"\")","v":"U80035-001-M  Rogue"}]
[28,"U80035  ","009","M  ","Rogue","Blk Multi","0-21033-49927-2","          ",4,null,{"v":42.5,"d":"$42.50"},{"v":85,"d":"$85.00"},{"v":84.95,"d":"$84.95"},0,"U80035-009-M  Rogue"," ",{"$f":"--ISNUMBER(IFERROR(SEARCH(Orders!$E18,O534,1),\"\"))","v":1},{"$f":"IF(Q534=1,COUNTIF($Q$2:Q534,1),\"\")","v":533},{"$f":"IFERROR(INDEX($O2:$O986,MATCH(ROWS($Q$2:Q534),$R2:$R986,0)),\"\")","v":"U80035-009-M  Rogue"}]
[28,"U80035  ","009","M  ","Rogue","Blk Multi","0-21033-49928-9","          ",5,null,{"v":42.5,"d":"$42.50"},{"v":85,"d":"$85.00"},{"v":84.95,"d":"$84.95"},0,"U80035-009-M  Rogue"," ",{"$f":"--ISNUMBER(IFERROR(SEARCH(Orders!$E18,O535,1),\"\"))","v":1},{"$f":"IF(Q535=1,COUNTIF($Q$2:Q535,1),\"\")","v":534},{"$f":"IFERROR(INDEX($O2:$O986,MATCH(ROWS($Q$2:Q535),$R2:$R986,0)),\"\")","v":"U80035-009-M  Rogue"}]
[28,"U80035  ","009","M  ","Rogue","Blk Multi","0-21033-49929-6","          ",6,null,{"v":42.5,"d":"$42.50"},{"v":85,"d":"$85.00"},{"v":84.95,"d":"$84.95"},0,"U80035-009-M  Rogue"," ",{"$f":"--ISNUMBER(IFERROR(SEARCH(Orders!$E18,O536,1),\"\"))","v":1},{"$f":"IF(Q536=1,COUNTIF($Q$2:Q536,1),\"\")","v":535},{"$f":"IFERROR(INDEX($O2:$O986,MATCH(ROWS($Q$2:Q536),$R2:$R986,0)),\"\")","v":"U80035-009-M  Rogue"}]
[28,"U80035  ","009","M  ","Rogue","Blk Multi","0-21033-49930-2","          ",7,null,{"v":42.5,"d":"$42.50"},{"v":85,"d":"$85.00"},{"v":84.95,"d":"$84.95"},0,"U80035-009-M  Rogue"," ",{"$f":"--ISNUMBER(IFERROR(SEARCH(Orders!$E18,O537,1),\"\"))","v":1},{"$f":"IF(Q537=1,COUNTIF($Q$2:Q537,1),\"\")","v":536},{"$f":"IFERROR(INDEX($O2:$O986,MATCH(ROWS($Q$2:Q537),$R2:$R986,0)),\"\")","v":"U80035-009-M  Rogue"}]
[28,"U80035  ","009","M  ","Rogue","Blk Multi","0-21033-49931-9","          ",8,null,{"v":42.5,"d":"$42.50"},{"v":85,"d":"$85.00"},{"v":84.95,"d":"$84.95"},0,"U80035-009-M  Rogue"," ",{"$f":"--ISNUMBER(IFERROR(SEARCH(Orders!$E18,O538,1),\"\"))","v":1},{"$f":"IF(Q538=1,COUNTIF($Q$2:Q538,1),\"\")","v":537},{"$f":"IFERROR(INDEX($O2:$O986,MATCH(ROWS($Q$2:Q538),$R2:$R986,0)),\"\")","v":"U80035-009-M  Rogue"}]
[28,"U80035  ","009","M  ","Rogue","Blk Multi","0-21033-49932-6","          ",9,null,{"v":42.5,"d":"$42.50"},{"v":85,"d":"$85.00"},{"v":84.95,"d":"$84.95"},0,"U80035-009-M  Rogue"," ",{"$f":"--ISNUMBER(IFERROR(SEARCH(Orders!$E18,O539,1),\"\"))","v":1},{"$f":"IF(Q539=1,COUNTIF($Q$2:Q539,1),\"\")","v":538},{"$f":"IFERROR(INDEX($O2:$O986,MATCH(ROWS($Q$2:Q539),$R2:$R986,0)),\"\")","v":"U80035-009-M  Rogue"}]
[28,"U80035  ","009","M  ","Rogue","Blk Multi","0-21033-49933-3","          ",10,null,{"v":42.5,"d":"$42.50"},{"v":85,"d":"$85.00"},{"v":84.95,"d":"$84.95"},0,"U80035-009-M  Rogue"," ",{"$f":"--ISNUMBER(IFERROR(SEARCH(Orders!$E18,O540,1),\"\"))","v":1},{"$f":"IF(Q540=1,COUNTIF($Q$2:Q540,1),\"\")","v":539},{"$f":"IFERROR(INDEX($O2:$O986,MATCH(ROWS($Q$2:Q540),$R2:$R986,0)),\"\")","v":"U80035-009-M  Rogue"}]
[28,"U80035  ","009","M  ","Rogue","Blk Multi","0-21033-49934-0","          ",11,null,{"v":42.5,"d":"$42.50"},{"v":85,"d":"$85.00"},{"v":84.95,"d":"$84.95"},0,"U80035-009-M  Rogue"," ",{"$f":"--ISNUMBER(IFERROR(SEARCH(Orders!$E18,O541,1),\"\"))","v":1},{"$f":"IF(Q541=1,COUNTIF($Q$2:Q541,1),\"\")","v":540},{"$f":"IFERROR(INDEX($O2:$O986,MATCH(ROWS($Q$2:Q541),$R2:$R986,0)),\"\")","v":"U80035-009-M  Rogue"}]
[28,"U80035  ","009","M  ","Rogue","Blk Multi","0-21033-49935-7","          ",12,null,{"v":42.5,"d":"$42.50"},{"v":85,"d":"$85.00"},{"v":84.95,"d":"$84.95"},0,"U80035-009-M  Rogue"," ",{"$f":"--ISNUMBER(IFERROR(SEARCH(Orders!$E18,O542,1),\"\"))","v":1},{"$f":"IF(Q542=1,COUNTIF($Q$2:Q542,1),\"\")","v":541},{"$f":"IFERROR(INDEX($O2:$O986,MATCH(ROWS($Q$2:Q542),$R2:$R986,0)),\"\")","v":"U80035-009-M  Rogue"}]
[28,"U80035  ","009","M  ","Rogue","Blk Multi","0-21033-49936-4","          ",13,null,{"v":42.5,"d":"$42.50"},{"v":85,"d":"$85.00"},{"v":84.95,"d":"$84.95"},0,"U80035-009-M  Rogue"," ",{"$f":"--ISNUMBER(IFERROR(SEARCH(Orders!$E18,O543,1),\"\"))","v":1},{"$f":"IF(Q543=1,COUNTIF($Q$2:Q543,1),\"\")","v":542},{"$f":"IFERROR(INDEX($O2:$O986,MATCH(ROWS($Q$2:Q543),$R2:$R986,0)),\"\")","v":"U80035-009-M  Rogue"}]
[28,"U80035  ","305","M  ","Rogue","Loden","0-21033-49939-5","          ",4,null,{"v":42.5,"d":"$42.50"},{"v":85,"d":"$85.00"},{"v":84.95,"d":"$84.95"},0,"U80035-305-M  Rogue"," ",{"$f":"--ISNUMBER(IFERROR(SEARCH(Orders!$E18,O544,1),\"\"))","v":1},{"$f":"IF(Q544=1,COUNTIF($Q$2:Q544,1),\"\")","v":543},{"$f":"IFERROR(INDEX($O2:$O986,MATCH(ROWS($Q$2:Q544),$R2:$R986,0)),\"\")","v":"U80035-305-M  Rogue"}]
[28,"U80035  ","305","M  ","Rogue","Loden","0-21033-49940-1","          ",5,null,{"v":42.5,"d":"$42.50"},{"v":85,"d":"$85.00"},{"v":84.95,"d":"$84.95"},0,"U80035-305-M  Rogue"," ",{"$f":"--ISNUMBER(IFERROR(SEARCH(Orders!$E18,O545,1),\"\"))","v":1},{"$f":"IF(Q545=1,COUNTIF($Q$2:Q545,1),\"\")","v":544},{"$f":"IFERROR(INDEX($O2:$O986,MATCH(ROWS($Q$2:Q545),$R2:$R986,0)),\"\")","v":"U80035-305-M  Rogue"}]
[28,"U80035  ","305","M  ","Rogue","Loden","0-21033-49941-8","          ",6,null,{"v":42.5,"d":"$42.50"},{"v":85,"d":"$85.00"},{"v":84.95,"d":"$84.95"},0,"U80035-305-M  Rogue"," ",{"$f":"--ISNUMBER(IFERROR(SEARCH(Orders!$E18,O546,1),\"\"))","v":1},{"$f":"IF(Q546=1,COUNTIF($Q$2:Q546,1),\"\")","v":545},{"$f":"IFERROR(INDEX($O2:$O986,MATCH(ROWS($Q$2:Q546),$R2:$R986,0)),\"\")","v":"U80035-305-M  Rogue"}]
[28,"U80035  ","305","M  ","Rogue","Loden","0-21033-49942-5","          ",7,null,{"v":42.5,"d":"$42.50"},{"v":85,"d":"$85.00"},{"v":84.95,"d":"$84.95"},0,"U80035-305-M  Rogue"," ",{"$f":"--ISNUMBER(IFERROR(SEARCH(Orders!$E18,O547,1),\"\"))","v":1},{"$f":"IF(Q547=1,COUNTIF($Q$2:Q547,1),\"\")","v":546},{"$f":"IFERROR(INDEX($O2:$O986,MATCH(ROWS($Q$2:Q547),$R2:$R986,0)),\"\")","v":"U80035-305-M  Rogue"}]
[28,"U80035  ","305","M  ","Rogue","Loden","0-21033-49943-2","          ",8,null,{"v":42.5,"d":"$42.50"},{"v":85,"d":"$85.00"},{"v":84.95,"d":"$84.95"},0,"U80035-305-M  Rogue"," ",{"$f":"--ISNUMBER(IFERROR(SEARCH(Orders!$E18,O548,1),\"\"))","v":1},{"$f":"IF(Q548=1,COUNTIF($Q$2:Q548,1),\"\")","v":547},{"$f":"IFERROR(INDEX($O2:$O986,MATCH(ROWS($Q$2:Q548),$R2:$R986,0)),\"\")","v":"U80035-305-M  Rogue"}]
[28,"U80035  ","305","M  ","Rogue","Loden","0-21033-49944-9","          ",9,null,{"v":42.5,"d":"$42.50"},{"v":85,"d":"$85.00"},{"v":84.95,"d":"$84.95"},0,"U80035-305-M  Rogue"," ",{"$f":"--ISNUMBER(IFERROR(SEARCH(Orders!$E18,O549,1),\"\"))","v":1},{"$f":"IF(Q549=1,COUNTIF($Q$2:Q549,1),\"\")","v":548},{"$f":"IFERROR(INDEX($O2:$O986,MATCH(ROWS($Q$2:Q549),$R2:$R986,0)),\"\")","v":"U80035-305-M  Rogue"}]
[28,"U80035  ","305","M  ","Rogue","Loden","0-21033-49945-6","          ",10,null,{"v":42.5,"d":"$42.50"},{"v":85,"d":"$85.00"},{"v":84.95,"d":"$84.95"},0,"U80035-305-M  Rogue"," ",{"$f":"--ISNUMBER(IFERROR(SEARCH(Orders!$E18,O550,1),\"\"))","v":1},{"$f":"IF(Q550=1,COUNTIF($Q$2:Q550,1),\"\")","v":549},{"$f":"IFERROR(INDEX($O2:$O986,MATCH(ROWS($Q$2:Q550),$R2:$R986,0)),\"\")","v":"U80035-305-M  Rogue"}]
[28,"U80035  ","305","M  ","Rogue","Loden","0-21033-49946-3","          ",11,null,{"v":42.5,"d":"$42.50"},{"v":85,"d":"$85.00"},{"v":84.95,"d":"$84.95"},0,"U80035-305-M  Rogue"," ",{"$f":"--ISNUMBER(IFERROR(SEARCH(Orders!$E18,O551,1),\"\"))","v":1},{"$f":"IF(Q551=1,COUNTIF($Q$2:Q551,1),\"\")","v":550},{"$f":"IFERROR(INDEX($O2:$O986,MATCH(ROWS($Q$2:Q551),$R2:$R986,0)),\"\")","v":"U80035-305-M  Rogue"}]
[28,"U80035  ","305","M  ","Rogue","Loden","0-21033-49947-0","          ",12,null,{"v":42.5,"d":"$42.50"},{"v":85,"d":"$85.00"},{"v":84.95,"d":"$84.95"},0,"U80035-305-M  Rogue"," ",{"$f":"--ISNUMBER(IFERROR(SEARCH(Orders!$E18,O552,1),\"\"))","v":1},{"$f":"IF(Q552=1,COUNTIF($Q$2:Q552,1),\"\")","v":551},{"$f":"IFERROR(INDEX($O2:$O986,MATCH(ROWS($Q$2:Q552),$R2:$R986,0)),\"\")","v":"U80035-305-M  Rogue"}]
[28,"U80035  ","305","M  ","Rogue","Loden","0-21033-49948-7","          ",13,null,{"v":42.5,"d":"$42.50"},{"v":85,"d":"$85.00"},{"v":84.95,"d":"$84.95"},0,"U80035-305-M  Rogue"," ",{"$f":"--ISNUMBER(IFERROR(SEARCH(Orders!$E18,O553,1),\"\"))","v":1},{"$f":"IF(Q553=1,COUNTIF($Q$2:Q553,1),\"\")","v":552},{"$f":"IFERROR(INDEX($O2:$O986,MATCH(ROWS($Q$2:Q553),$R2:$R986,0)),\"\")","v":"U80035-305-M  Rogue"}]
[28,"U80035  ","540","M  ","Rogue","Prpl Multi","0-21033-49951-7","          ",4,null,{"v":42.5,"d":"$42.50"},{"v":85,"d":"$85.00"},{"v":84.95,"d":"$84.95"},0,"U80035-540-M  Rogue"," ",{"$f":"--ISNUMBER(IFERROR(SEARCH(Orders!$E18,O554,1),\"\"))","v":1},{"$f":"IF(Q554=1,COUNTIF($Q$2:Q554,1),\"\")","v":553},{"$f":"IFERROR(INDEX($O2:$O986,MATCH(ROWS($Q$2:Q554),$R2:$R986,0)),\"\")","v":"U80035-540-M  Rogue"}]
[28,"U80035  ","540","M  ","Rogue","Prpl Multi","0-21033-49952-4","          ",5,null,{"v":42.5,"d":"$42.50"},{"v":85,"d":"$85.00"},{"v":84.95,"d":"$84.95"},0,"U80035-540-M  Rogue"," ",{"$f":"--ISNUMBER(IFERROR(SEARCH(Orders!$E18,O555,1),\"\"))","v":1},{"$f":"IF(Q555=1,COUNTIF($Q$2:Q555,1),\"\")","v":554},{"$f":"IFERROR(INDEX($O2:$O986,MATCH(ROWS($Q$2:Q555),$R2:$R986,0)),\"\")","v":"U80035-540-M  Rogue"}]
[28,"U80035  ","540","M  ","Rogue","Prpl Multi","0-21033-49953-1","          ",6,null,{"v":42.5,"d":"$42.50"},{"v":85,"d":"$85.00"},{"v":84.95,"d":"$84.95"},0,"U80035-540-M  Rogue"," ",{"$f":"--ISNUMBER(IFERROR(SEARCH(Orders!$E18,O556,1),\"\"))","v":1},{"$f":"IF(Q556=1,COUNTIF($Q$2:Q556,1),\"\")","v":555},{"$f":"IFERROR(INDEX($O2:$O986,MATCH(ROWS($Q$2:Q556),$R2:$R986,0)),\"\")","v":"U80035-540-M  Rogue"}]
[28,"U80035  ","540","M  ","Rogue","Prpl Multi","0-21033-49954-8","          ",7,null,{"v":42.5,"d":"$42.50"},{"v":85,"d":"$85.00"},{"v":84.95,"d":"$84.95"},0,"U80035-540-M  Rogue"," ",{"$f":"--ISNUMBER(IFERROR(SEARCH(Orders!$E18,O557,1),\"\"))","v":1},{"$f":"IF(Q557=1,COUNTIF($Q$2:Q557,1),\"\")","v":556},{"$f":"IFERROR(INDEX($O2:$O986,MATCH(ROWS($Q$2:Q557),$R2:$R986,0)),\"\")","v":"U80035-540-M  Rogue"}]
[28,"U80035  ","540","M  ","Rogue","Prpl Multi","0-21033-49955-5","          ",8,null,{"v":42.5,"d":"$42.50"},{"v":85,"d":"$85.00"},{"v":84.95,"d":"$84.95"},0,"U80035-540-M  Rogue"," ",{"$f":"--ISNUMBER(IFERROR(SEARCH(Orders!$E18,O558,1),\"\"))","v":1},{"$f":"IF(Q558=1,COUNTIF($Q$2:Q558,1),\"\")","v":557},{"$f":"IFERROR(INDEX($O2:$O986,MATCH(ROWS($Q$2:Q558),$R2:$R986,0)),\"\")","v":"U80035-540-M  Rogue"}]
[28,"U80035  ","540","M  ","Rogue","Prpl Multi","0-21033-49956-2","          ",9,null,{"v":42.5,"d":"$42.50"},{"v":85,"d":"$85.00"},{"v":84.95,"d":"$84.95"},0,"U80035-540-M  Rogue"," ",{"$f":"--ISNUMBER(IFERROR(SEARCH(Orders!$E18,O559,1),\"\"))","v":1},{"$f":"IF(Q559=1,COUNTIF($Q$2:Q559,1),\"\")","v":558},{"$f":"IFERROR(INDEX($O2:$O986,MATCH(ROWS($Q$2:Q559),$R2:$R986,0)),\"\")","v":"U80035-540-M  Rogue"}]
[28,"U80035  ","540","M  ","Rogue","Prpl Multi","0-21033-49957-9","          ",10,null,{"v":42.5,"d":"$42.50"},{"v":85,"d":"$85.00"},{"v":84.95,"d":"$84.95"},0,"U80035-540-M  Rogue"," ",{"$f":"--ISNUMBER(IFERROR(SEARCH(Orders!$E18,O560,1),\"\"))","v":1},{"$f":"IF(Q560=1,COUNTIF($Q$2:Q560,1),\"\")","v":559},{"$f":"IFERROR(INDEX($O2:$O986,MATCH(ROWS($Q$2:Q560),$R2:$R986,0)),\"\")","v":"U80035-540-M  Rogue"}]
[28,"U80035  ","540","M  ","Rogue","Prpl Multi","0-21033-49958-6","          ",11,null,{"v":42.5,"d":"$42.50"},{"v":85,"d":"$85.00"},{"v":84.95,"d":"$84.95"},0,"U80035-540-M  Rogue"," ",{"$f":"--ISNUMBER(IFERROR(SEARCH(Orders!$E18,O561,1),\"\"))","v":1},{"$f":"IF(Q561=1,COUNTIF($Q$2:Q561,1),\"\")","v":560},{"$f":"IFERROR(INDEX($O2:$O986,MATCH(ROWS($Q$2:Q561),$R2:$R986,0)),\"\")","v":"U80035-540-M  Rogue"}]
[28,"U80035  ","540","M  ","Rogue","Prpl Multi","0-21033-49959-3","          ",12,null,{"v":42.5,"d":"$42.50"},{"v":85,"d":"$85.00"},{"v":84.95,"d":"$84.95"},0,"U80035-540-M  Rogue"," ",{"$f":"--ISNUMBER(IFERROR(SEARCH(Orders!$E18,O562,1),\"\"))","v":1},{"$f":"IF(Q562=1,COUNTIF($Q$2:Q562,1),\"\")","v":561},{"$f":"IFERROR(INDEX($O2:$O986,MATCH(ROWS($Q$2:Q562),$R2:$R986,0)),\"\")","v":"U80035-540-M  Rogue"}]
[28,"U80035  ","540","M  ","Rogue","Prpl Multi","0-21033-49960-9","          ",13,null,{"v":42.5,"d":"$42.50"},{"v":85,"d":"$85.00"},{"v":84.95,"d":"$84.95"},0,"U80035-540-M  Rogue"," ",{"$f":"--ISNUMBER(IFERROR(SEARCH(Orders!$E18,O563,1),\"\"))","v":1},{"$f":"IF(Q563=1,COUNTIF($Q$2:Q563,1),\"\")","v":562},{"$f":"IFERROR(INDEX($O2:$O986,MATCH(ROWS($Q$2:Q563),$R2:$R986,0)),\"\")","v":"U80035-540-M  Rogue"}]
[23,"WFW16P1 ","988","M  ","W Patch Mid","Tan/Black","7-18598-83080-9","C/O       ",5,null,{"v":85,"d":"$85.00"},{"v":170,"d":"$170.00"},{"v":169.95,"d":"$169.95"},0,"Wfw16p1-988-M  W Patch Mid"," ",{"$f":"--ISNUMBER(IFERROR(SEARCH(Orders!$E18,O564,1),\"\"))","v":1},{"$f":"IF(Q564=1,COUNTIF($Q$2:Q564,1),\"\")","v":563},{"$f":"IFERROR(INDEX($O2:$O986,MATCH(ROWS($Q$2:Q564),$R2:$R986,0)),\"\")","v":"Wfw16p1-988-M  W Patch Mid"}]
[23,"WFW16P1 ","988","M  ","W Patch Mid","Tan/Black","7-18598-83081-6","C/O       ",5.5,null,{"v":85,"d":"$85.00"},{"v":170,"d":"$170.00"},{"v":169.95,"d":"$169.95"},0,"Wfw16p1-988-M  W Patch Mid"," ",{"$f":"--ISNUMBER(IFERROR(SEARCH(Orders!$E18,O565,1),\"\"))","v":1},{"$f":"IF(Q565=1,COUNTIF($Q$2:Q565,1),\"\")","v":564},{"$f":"IFERROR(INDEX($O2:$O986,MATCH(ROWS($Q$2:Q565),$R2:$R986,0)),\"\")","v":"Wfw16p1-988-M  W Patch Mid"}]
[23,"WFW16P1 ","988","M  ","W Patch Mid","Tan/Black","0-46655-24902-9","C/O       ",6,null,{"v":85,"d":"$85.00"},{"v":170,"d":"$170.00"},{"v":169.95,"d":"$169.95"},0,"Wfw16p1-988-M  W Patch Mid"," ",{"$f":"--ISNUMBER(IFERROR(SEARCH(Orders!$E18,O566,1),\"\"))","v":1},{"$f":"IF(Q566=1,COUNTIF($Q$2:Q566,1),\"\")","v":565},{"$f":"IFERROR(INDEX($O2:$O986,MATCH(ROWS($Q$2:Q566),$R2:$R986,0)),\"\")","v":"Wfw16p1-988-M  W Patch Mid"}]
[23,"WFW16P1 ","988","M  ","W Patch Mid","Tan/Black","0-46655-24903-6","C/O       ",6.5,null,{"v":85,"d":"$85.00"},{"v":170,"d":"$170.00"},{"v":169.95,"d":"$169.95"},0,"Wfw16p1-988-M  W Patch Mid"," ",{"$f":"--ISNUMBER(IFERROR(SEARCH(Orders!$E18,O567,1),\"\"))","v":1},{"$f":"IF(Q567=1,COUNTIF($Q$2:Q567,1),\"\")","v":566},{"$f":"IFERROR(INDEX($O2:$O986,MATCH(ROWS($Q$2:Q567),$R2:$R986,0)),\"\")","v":"Wfw16p1-988-M  W Patch Mid"}]
[23,"WFW16P1 ","988","M  ","W Patch Mid","Tan/Black","0-46655-24904-3","C/O       ",7,null,{"v":85,"d":"$85.00"},{"v":170,"d":"$170.00"},{"v":169.95,"d":"$169.95"},0,"Wfw16p1-988-M  W Patch Mid"," ",{"$f":"--ISNUMBER(IFERROR(SEARCH(Orders!$E18,O568,1),\"\"))","v":1},{"$f":"IF(Q568=1,COUNTIF($Q$2:Q568,1),\"\")","v":567},{"$f":"IFERROR(INDEX($O2:$O986,MATCH(ROWS($Q$2:Q568),$R2:$R986,0)),\"\")","v":"Wfw16p1-988-M  W Patch Mid"}]
[23,"WFW16P1 ","988","M  ","W Patch Mid","Tan/Black","0-46655-24905-0","C/O       ",7.5,null,{"v":85,"d":"$85.00"},{"v":170,"d":"$170.00"},{"v":169.95,"d":"$169.95"},0,"Wfw16p1-988-M  W Patch Mid"," ",{"$f":"--ISNUMBER(IFERROR(SEARCH(Orders!$E18,O569,1),\"\"))","v":1},{"$f":"IF(Q569=1,COUNTIF($Q$2:Q569,1),\"\")","v":568},{"$f":"IFERROR(INDEX($O2:$O986,MATCH(ROWS($Q$2:Q569),$R2:$R986,0)),\"\")","v":"Wfw16p1-988-M  W Patch Mid"}]
[23,"WFW16P1 ","988","M  ","W Patch Mid","Tan/Black","0-46655-24906-7","C/O       ",8,null,{"v":85,"d":"$85.00"},{"v":170,"d":"$170.00"},{"v":169.95,"d":"$169.95"},0,"Wfw16p1-988-M  W Patch Mid"," ",{"$f":"--ISNUMBER(IFERROR(SEARCH(Orders!$E18,O570,1),\"\"))","v":1},{"$f":"IF(Q570=1,COUNTIF($Q$2:Q570,1),\"\")","v":569},{"$f":"IFERROR(INDEX($O2:$O986,MATCH(ROWS($Q$2:Q570),$R2:$R986,0)),\"\")","v":"Wfw16p1-988-M  W Patch Mid"}]
[23,"WFW16P1 ","988","M  ","W Patch Mid","Tan/Black","0-46655-24907-4","C/O       ",8.5,null,{"v":85,"d":"$85.00"},{"v":170,"d":"$170.00"},{"v":169.95,"d":"$169.95"},0,"Wfw16p1-988-M  W Patch Mid"," ",{"$f":"--ISNUMBER(IFERROR(SEARCH(Orders!$E18,O571,1),\"\"))","v":1},{"$f":"IF(Q571=1,COUNTIF($Q$2:Q571,1),\"\")","v":570},{"$f":"IFERROR(INDEX($O2:$O986,MATCH(ROWS($Q$2:Q571),$R2:$R986,0)),\"\")","v":"Wfw16p1-988-M  W Patch Mid"}]
[23,"WFW16P1 ","988","M  ","W Patch Mid","Tan/Black","0-46655-24908-1","C/O       ",9,null,{"v":85,"d":"$85.00"},{"v":170,"d":"$170.00"},{"v":169.95,"d":"$169.95"},0,"Wfw16p1-988-M  W Patch Mid"," ",{"$f":"--ISNUMBER(IFERROR(SEARCH(Orders!$E18,O572,1),\"\"))","v":1},{"$f":"IF(Q572=1,COUNTIF($Q$2:Q572,1),\"\")","v":571},{"$f":"IFERROR(INDEX($O2:$O986,MATCH(ROWS($Q$2:Q572),$R2:$R986,0)),\"\")","v":"Wfw16p1-988-M  W Patch Mid"}]
[23,"WFW16P1 ","988","M  ","W Patch Mid","Tan/Black","0-46655-24909-8","C/O       ",9.5,null,{"v":85,"d":"$85.00"},{"v":170,"d":"$170.00"},{"v":169.95,"d":"$169.95"},0,"Wfw16p1-988-M  W Patch Mid"," ",{"$f":"--ISNUMBER(IFERROR(SEARCH(Orders!$E18,O573,1),\"\"))","v":1},{"$f":"IF(Q573=1,COUNTIF($Q$2:Q573,1),\"\")","v":572},{"$f":"IFERROR(INDEX($O2:$O986,MATCH(ROWS($Q$2:Q573),$R2:$R986,0)),\"\")","v":"Wfw16p1-988-M  W Patch Mid"}]
[23,"WFW16P1 ","988","M  ","W Patch Mid","Tan/Black","0-46655-24910-4","C/O       ",10,null,{"v":85,"d":"$85.00"},{"v":170,"d":"$170.00"},{"v":169.95,"d":"$169.95"},0,"Wfw16p1-988-M  W Patch Mid"," ",{"$f":"--ISNUMBER(IFERROR(SEARCH(Orders!$E18,O574,1),\"\"))","v":1},{"$f":"IF(Q574=1,COUNTIF($Q$2:Q574,1),\"\")","v":573},{"$f":"IFERROR(INDEX($O2:$O986,MATCH(ROWS($Q$2:Q574),$R2:$R986,0)),\"\")","v":"Wfw16p1-988-M  W Patch Mid"}]
[23,"WFW16P1 ","988","M  ","W Patch Mid","Tan/Black","0-46655-24911-1","C/O       ",10.5,null,{"v":85,"d":"$85.00"},{"v":170,"d":"$170.00"},{"v":169.95,"d":"$169.95"},0,"Wfw16p1-988-M  W Patch Mid"," ",{"$f":"--ISNUMBER(IFERROR(SEARCH(Orders!$E18,O575,1),\"\"))","v":1},{"$f":"IF(Q575=1,COUNTIF($Q$2:Q575,1),\"\")","v":574},{"$f":"IFERROR(INDEX($O2:$O986,MATCH(ROWS($Q$2:Q575),$R2:$R986,0)),\"\")","v":"Wfw16p1-988-M  W Patch Mid"}]
[23,"WFW16P1 ","988","M  ","W Patch Mid","Tan/Black","0-46655-24912-8","C/O       ",11,null,{"v":85,"d":"$85.00"},{"v":170,"d":"$170.00"},{"v":169.95,"d":"$169.95"},0,"Wfw16p1-988-M  W Patch Mid"," ",{"$f":"--ISNUMBER(IFERROR(SEARCH(Orders!$E18,O576,1),\"\"))","v":1},{"$f":"IF(Q576=1,COUNTIF($Q$2:Q576,1),\"\")","v":575},{"$f":"IFERROR(INDEX($O2:$O986,MATCH(ROWS($Q$2:Q576),$R2:$R986,0)),\"\")","v":"Wfw16p1-988-M  W Patch Mid"}]
[23,"WFW16P12","303","M  ","W Patch Mid","Olive","8-40221-90399-1","C/O       ",5,null,{"v":85,"d":"$85.00"},{"v":170,"d":"$170.00"},{"v":169.95,"d":"$169.95"},0,"Wfw16p12-303-M  W Patch Mid"," ",{"$f":"--ISNUMBER(IFERROR(SEARCH(Orders!$E18,O577,1),\"\"))","v":1},{"$f":"IF(Q577=1,COUNTIF($Q$2:Q577,1),\"\")","v":576},{"$f":"IFERROR(INDEX($O2:$O986,MATCH(ROWS($Q$2:Q577),$R2:$R986,0)),\"\")","v":"Wfw16p12-303-M  W Patch Mid"}]
[23,"WFW16P12","303","M  ","W Patch Mid","Olive","8-40221-90400-4","C/O       ",5.5,null,{"v":85,"d":"$85.00"},{"v":170,"d":"$170.00"},{"v":169.95,"d":"$169.95"},{"$f":"J578*K578","v":0},"Wfw16p12-303-M  W Patch Mid"," ",{"$f":"--ISNUMBER(IFERROR(SEARCH(Orders!$E18,O578,1),\"\"))","v":1},{"$f":"IF(Q578=1,COUNTIF($Q$2:Q578,1),\"\")","v":577},{"$f":"IFERROR(INDEX($O2:$O986,MATCH(ROWS($Q$2:Q578),$R2:$R986,0)),\"\")","v":"Wfw16p12-303-M  W Patch Mid"}]
[23,"WFW16P12","303","M  ","W Patch Mid","Olive","8-40221-90401-1","C/O       ",6,null,{"v":85,"d":"$85.00"},{"v":170,"d":"$170.00"},{"v":169.95,"d":"$169.95"},0,"Wfw16p12-303-M  W Patch Mid"," ",{"$f":"--ISNUMBER(IFERROR(SEARCH(Orders!$E18,O579,1),\"\"))","v":1},{"$f":"IF(Q579=1,COUNTIF($Q$2:Q579,1),\"\")","v":578},{"$f":"IFERROR(INDEX($O2:$O986,MATCH(ROWS($Q$2:Q579),$R2:$R986,0)),\"\")","v":"Wfw16p12-303-M  W Patch Mid"}]
[23,"WFW16P12","303","M  ","W Patch Mid","Olive","8-40221-90402-8","C/O       ",6.5,null,{"v":85,"d":"$85.00"},{"v":170,"d":"$170.00"},{"v":169.95,"d":"$169.95"},0,"Wfw16p12-303-M  W Patch Mid"," ",{"$f":"--ISNUMBER(IFERROR(SEARCH(Orders!$E18,O580,1),\"\"))","v":1},{"$f":"IF(Q580=1,COUNTIF($Q$2:Q580,1),\"\")","v":579},{"$f":"IFERROR(INDEX($O2:$O986,MATCH(ROWS($Q$2:Q580),$R2:$R986,0)),\"\")","v":"Wfw16p12-303-M  W Patch Mid"}]
[23,"WFW16P12","303","M  ","W Patch Mid","Olive","8-40221-90403-5","C/O       ",7,null,{"v":85,"d":"$85.00"},{"v":170,"d":"$170.00"},{"v":169.95,"d":"$169.95"},0,"Wfw16p12-303-M  W Patch Mid"," ",{"$f":"--ISNUMBER(IFERROR(SEARCH(Orders!$E18,O581,1),\"\"))","v":1},{"$f":"IF(Q581=1,COUNTIF($Q$2:Q581,1),\"\")","v":580},{"$f":"IFERROR(INDEX($O2:$O986,MATCH(ROWS($Q$2:Q581),$R2:$R986,0)),\"\")","v":"Wfw16p12-303-M  W Patch Mid"}]
[23,"WFW16P12","303","M  ","W Patch Mid","Olive","8-40221-90404-2","C/O       ",7.5,null,{"v":85,"d":"$85.00"},{"v":170,"d":"$170.00"},{"v":169.95,"d":"$169.95"},0,"Wfw16p12-303-M  W Patch Mid"," ",{"$f":"--ISNUMBER(IFERROR(SEARCH(Orders!$E18,O582,1),\"\"))","v":1},{"$f":"IF(Q582=1,COUNTIF($Q$2:Q582,1),\"\")","v":581},{"$f":"IFERROR(INDEX($O2:$O986,MATCH(ROWS($Q$2:Q582),$R2:$R986,0)),\"\")","v":"Wfw16p12-303-M  W Patch Mid"}]
[23,"WFW16P12","303","M  ","W Patch Mid","Olive","8-40221-90405-9","C/O       ",8,null,{"v":85,"d":"$85.00"},{"v":170,"d":"$170.00"},{"v":169.95,"d":"$169.95"},0,"Wfw16p12-303-M  W Patch Mid"," ",{"$f":"--ISNUMBER(IFERROR(SEARCH(Orders!$E18,O583,1),\"\"))","v":1},{"$f":"IF(Q583=1,COUNTIF($Q$2:Q583,1),\"\")","v":582},{"$f":"IFERROR(INDEX($O2:$O986,MATCH(ROWS($Q$2:Q583),$R2:$R986,0)),\"\")","v":"Wfw16p12-303-M  W Patch Mid"}]
[23,"WFW16P12","303","M  ","W Patch Mid","Olive","8-40221-90406-6","C/O       ",8.5,null,{"v":85,"d":"$85.00"},{"v":170,"d":"$170.00"},{"v":169.95,"d":"$169.95"},0,"Wfw16p12-303-M  W Patch Mid"," ",{"$f":"--ISNUMBER(IFERROR(SEARCH(Orders!$E18,O584,1),\"\"))","v":1},{"$f":"IF(Q584=1,COUNTIF($Q$2:Q584,1),\"\")","v":583},{"$f":"IFERROR(INDEX($O2:$O986,MATCH(ROWS($Q$2:Q584),$R2:$R986,0)),\"\")","v":"Wfw16p12-303-M  W Patch Mid"}]
[23,"WFW16P12","303","M  ","W Patch Mid","Olive","8-40221-90407-3","C/O       ",9,null,{"v":85,"d":"$85.00"},{"v":170,"d":"$170.00"},{"v":169.95,"d":"$169.95"},0,"Wfw16p12-303-M  W Patch Mid"," ",{"$f":"--ISNUMBER(IFERROR(SEARCH(Orders!$E18,O585,1),\"\"))","v":1},{"$f":"IF(Q585=1,COUNTIF($Q$2:Q585,1),\"\")","v":584},{"$f":"IFERROR(INDEX($O2:$O986,MATCH(ROWS($Q$2:Q585),$R2:$R986,0)),\"\")","v":"Wfw16p12-303-M  W Patch Mid"}]
[23,"WFW16P12","303","M  ","W Patch Mid","Olive","8-40221-90408-0","C/O       ",9.5,null,{"v":85,"d":"$85.00"},{"v":170,"d":"$170.00"},{"v":169.95,"d":"$169.95"},0,"Wfw16p12-303-M  W Patch Mid"," ",{"$f":"--ISNUMBER(IFERROR(SEARCH(Orders!$E18,O586,1),\"\"))","v":1},{"$f":"IF(Q586=1,COUNTIF($Q$2:Q586,1),\"\")","v":585},{"$f":"IFERROR(INDEX($O2:$O986,MATCH(ROWS($Q$2:Q586),$R2:$R986,0)),\"\")","v":"Wfw16p12-303-M  W Patch Mid"}]
[23,"WFW16P12","303","M  ","W Patch Mid","Olive","8-40221-90409-7","C/O       ",10,null,{"v":85,"d":"$85.00"},{"v":170,"d":"$170.00"},{"v":169.95,"d":"$169.95"},0,"Wfw16p12-303-M  W Patch Mid"," ",{"$f":"--ISNUMBER(IFERROR(SEARCH(Orders!$E18,O587,1),\"\"))","v":1},{"$f":"IF(Q587=1,COUNTIF($Q$2:Q587,1),\"\")","v":586},{"$f":"IFERROR(INDEX($O2:$O986,MATCH(ROWS($Q$2:Q587),$R2:$R986,0)),\"\")","v":"Wfw16p12-303-M  W Patch Mid"}]
[23,"WFW16P12","303","M  ","W Patch Mid","Olive","8-40221-90410-3","C/O       ",10.5,null,{"v":85,"d":"$85.00"},{"v":170,"d":"$170.00"},{"v":169.95,"d":"$169.95"},0,"Wfw16p12-303-M  W Patch Mid"," ",{"$f":"--ISNUMBER(IFERROR(SEARCH(Orders!$E18,O588,1),\"\"))","v":1},{"$f":"IF(Q588=1,COUNTIF($Q$2:Q588,1),\"\")","v":587},{"$f":"IFERROR(INDEX($O2:$O986,MATCH(ROWS($Q$2:Q588),$R2:$R986,0)),\"\")","v":"Wfw16p12-303-M  W Patch Mid"}]
[23,"WFW16P12","303","M  ","W Patch Mid","Olive","8-40221-90411-0","C/O       ",11,null,{"v":85,"d":"$85.00"},{"v":170,"d":"$170.00"},{"v":169.95,"d":"$169.95"},0,"Wfw16p12-303-M  W Patch Mid"," ",{"$f":"--ISNUMBER(IFERROR(SEARCH(Orders!$E18,O589,1),\"\"))","v":1},{"$f":"IF(Q589=1,COUNTIF($Q$2:Q589,1),\"\")","v":588},{"$f":"IFERROR(INDEX($O2:$O986,MATCH(ROWS($Q$2:Q589),$R2:$R986,0)),\"\")","v":"Wfw16p12-303-M  W Patch Mid"}]
[23,"WFW16P7 ","989","M  ","W Patch Mid","Brwn/Navy","7-18598-83084-7","C/O       ",5,null,{"v":85,"d":"$85.00"},{"v":170,"d":"$170.00"},{"v":169.95,"d":"$169.95"},0,"Wfw16p7-989-M  W Patch Mid"," ",{"$f":"--ISNUMBER(IFERROR(SEARCH(Orders!$E18,O590,1),\"\"))","v":1},{"$f":"IF(Q590=1,COUNTIF($Q$2:Q590,1),\"\")","v":589},{"$f":"IFERROR(INDEX($O2:$O986,MATCH(ROWS($Q$2:Q590),$R2:$R986,0)),\"\")","v":"Wfw16p7-989-M  W Patch Mid"}]
[23,"WFW16P7 ","989","M  ","W Patch Mid","Brwn/Navy","7-18598-83085-4","C/O       ",5.5,null,{"v":85,"d":"$85.00"},{"v":170,"d":"$170.00"},{"v":169.95,"d":"$169.95"},0,"Wfw16p7-989-M  W Patch Mid"," ",{"$f":"--ISNUMBER(IFERROR(SEARCH(Orders!$E18,O591,1),\"\"))","v":1},{"$f":"IF(Q591=1,COUNTIF($Q$2:Q591,1),\"\")","v":590},{"$f":"IFERROR(INDEX($O2:$O986,MATCH(ROWS($Q$2:Q591),$R2:$R986,0)),\"\")","v":"Wfw16p7-989-M  W Patch Mid"}]
[23,"WFW16P7 ","989","M  ","W Patch Mid","Brwn/Navy","0-23821-98266-9","C/O       ",6,null,{"v":85,"d":"$85.00"},{"v":170,"d":"$170.00"},{"v":169.95,"d":"$169.95"},0,"Wfw16p7-989-M  W Patch Mid"," ",{"$f":"--ISNUMBER(IFERROR(SEARCH(Orders!$E18,O592,1),\"\"))","v":1},{"$f":"IF(Q592=1,COUNTIF($Q$2:Q592,1),\"\")","v":591},{"$f":"IFERROR(INDEX($O2:$O986,MATCH(ROWS($Q$2:Q592),$R2:$R986,0)),\"\")","v":"Wfw16p7-989-M  W Patch Mid"}]
[23,"WFW16P7 ","989","M  ","W Patch Mid","Brwn/Navy","0-23821-98267-6","C/O       ",6.5,null,{"v":85,"d":"$85.00"},{"v":170,"d":"$170.00"},{"v":169.95,"d":"$169.95"},0,"Wfw16p7-989-M  W Patch Mid"," ",{"$f":"--ISNUMBER(IFERROR(SEARCH(Orders!$E18,O593,1),\"\"))","v":1},{"$f":"IF(Q593=1,COUNTIF($Q$2:Q593,1),\"\")","v":592},{"$f":"IFERROR(INDEX($O2:$O986,MATCH(ROWS($Q$2:Q593),$R2:$R986,0)),\"\")","v":"Wfw16p7-989-M  W Patch Mid"}]
[23,"WFW16P7 ","989","M  ","W Patch Mid","Brwn/Navy","0-23821-98268-3","C/O       ",7,null,{"v":85,"d":"$85.00"},{"v":170,"d":"$170.00"},{"v":169.95,"d":"$169.95"},0,"Wfw16p7-989-M  W Patch Mid"," ",{"$f":"--ISNUMBER(IFERROR(SEARCH(Orders!$E18,O594,1),\"\"))","v":1},{"$f":"IF(Q594=1,COUNTIF($Q$2:Q594,1),\"\")","v":593},{"$f":"IFERROR(INDEX($O2:$O986,MATCH(ROWS($Q$2:Q594),$R2:$R986,0)),\"\")","v":"Wfw16p7-989-M  W Patch Mid"}]
[23,"WFW16P7 ","989","M  ","W Patch Mid","Brwn/Navy","0-23821-98269-0","C/O       ",7.5,null,{"v":85,"d":"$85.00"},{"v":170,"d":"$170.00"},{"v":169.95,"d":"$169.95"},0,"Wfw16p7-989-M  W Patch Mid"," ",{"$f":"--ISNUMBER(IFERROR(SEARCH(Orders!$E18,O595,1),\"\"))","v":1},{"$f":"IF(Q595=1,COUNTIF($Q$2:Q595,1),\"\")","v":594},{"$f":"IFERROR(INDEX($O2:$O986,MATCH(ROWS($Q$2:Q595),$R2:$R986,0)),\"\")","v":"Wfw16p7-989-M  W Patch Mid"}]
[23,"WFW16P7 ","989","M  ","W Patch Mid","Brwn/Navy","0-23821-98270-6","C/O       ",8,null,{"v":85,"d":"$85.00"},{"v":170,"d":"$170.00"},{"v":169.95,"d":"$169.95"},0,"Wfw16p7-989-M  W Patch Mid"," ",{"$f":"--ISNUMBER(IFERROR(SEARCH(Orders!$E18,O596,1),\"\"))","v":1},{"$f":"IF(Q596=1,COUNTIF($Q$2:Q596,1),\"\")","v":595},{"$f":"IFERROR(INDEX($O2:$O986,MATCH(ROWS($Q$2:Q596),$R2:$R986,0)),\"\")","v":"Wfw16p7-989-M  W Patch Mid"}]
[23,"WFW16P7 ","989","M  ","W Patch Mid","Brwn/Navy","0-23821-98271-3","C/O       ",8.5,null,{"v":85,"d":"$85.00"},{"v":170,"d":"$170.00"},{"v":169.95,"d":"$169.95"},0,"Wfw16p7-989-M  W Patch Mid"," ",{"$f":"--ISNUMBER(IFERROR(SEARCH(Orders!$E18,O597,1),\"\"))","v":1},{"$f":"IF(Q597=1,COUNTIF($Q$2:Q597,1),\"\")","v":596},{"$f":"IFERROR(INDEX($O2:$O986,MATCH(ROWS($Q$2:Q597),$R2:$R986,0)),\"\")","v":"Wfw16p7-989-M  W Patch Mid"}]
[23,"WFW16P7 ","989","M  ","W Patch Mid","Brwn/Navy","0-23821-98272-0","C/O       ",9,null,{"v":85,"d":"$85.00"},{"v":170,"d":"$170.00"},{"v":169.95,"d":"$169.95"},0,"Wfw16p7-989-M  W Patch Mid"," ",{"$f":"--ISNUMBER(IFERROR(SEARCH(Orders!$E18,O598,1),\"\"))","v":1},{"$f":"IF(Q598=1,COUNTIF($Q$2:Q598,1),\"\")","v":597},{"$f":"IFERROR(INDEX($O2:$O986,MATCH(ROWS($Q$2:Q598),$R2:$R986,0)),\"\")","v":"Wfw16p7-989-M  W Patch Mid"}]
[23,"WFW16P7 ","989","M  ","W Patch Mid","Brwn/Navy","0-23821-98273-7","C/O       ",9.5,null,{"v":85,"d":"$85.00"},{"v":170,"d":"$170.00"},{"v":169.95,"d":"$169.95"},0,"Wfw16p7-989-M  W Patch Mid"," ",{"$f":"--ISNUMBER(IFERROR(SEARCH(Orders!$E18,O599,1),\"\"))","v":1},{"$f":"IF(Q599=1,COUNTIF($Q$2:Q599,1),\"\")","v":598},{"$f":"IFERROR(INDEX($O2:$O986,MATCH(ROWS($Q$2:Q599),$R2:$R986,0)),\"\")","v":"Wfw16p7-989-M  W Patch Mid"}]
[23,"WFW16P7 ","989","M  ","W Patch Mid","Brwn/Navy","0-23821-98274-4","C/O       ",10,null,{"v":85,"d":"$85.00"},{"v":170,"d":"$170.00"},{"v":169.95,"d":"$169.95"},0,"Wfw16p7-989-M  W Patch Mid"," ",{"$f":"--ISNUMBER(IFERROR(SEARCH(Orders!$E18,O600,1),\"\"))","v":1},{"$f":"IF(Q600=1,COUNTIF($Q$2:Q600,1),\"\")","v":599},{"$f":"IFERROR(INDEX($O2:$O986,MATCH(ROWS($Q$2:Q600),$R2:$R986,0)),\"\")","v":"Wfw16p7-989-M  W Patch Mid"}]
[23,"WFW16P7 ","989","M  ","W Patch Mid","Brwn/Navy","0-23821-98275-1","C/O       ",10.5,null,{"v":85,"d":"$85.00"},{"v":170,"d":"$170.00"},{"v":169.95,"d":"$169.95"},0,"Wfw16p7-989-M  W Patch Mid"," ",{"$f":"--ISNUMBER(IFERROR(SEARCH(Orders!$E18,O601,1),\"\"))","v":1},{"$f":"IF(Q601=1,COUNTIF($Q$2:Q601,1),\"\")","v":600},{"$f":"IFERROR(INDEX($O2:$O986,MATCH(ROWS($Q$2:Q601),$R2:$R986,0)),\"\")","v":"Wfw16p7-989-M  W Patch Mid"}]
[23,"WFW16P7 ","989","M  ","W Patch Mid","Brwn/Navy","0-23821-98276-8","C/O       ",11,null,{"v":85,"d":"$85.00"},{"v":170,"d":"$170.00"},{"v":169.95,"d":"$169.95"},0,"Wfw16p7-989-M  W Patch Mid"," ",{"$f":"--ISNUMBER(IFERROR(SEARCH(Orders!$E18,O602,1),\"\"))","v":1},{"$f":"IF(Q602=1,COUNTIF($Q$2:Q602,1),\"\")","v":601},{"$f":"IFERROR(INDEX($O2:$O986,MATCH(ROWS($Q$2:Q602),$R2:$R986,0)),\"\")","v":"Wfw16p7-989-M  W Patch Mid"}]
[27,"WFW19LM1","303","M  ","W Lucie Mid","Olive","7-18598-83193-6","C/O       ",5,null,{"v":75,"d":"$75.00"},{"v":150,"d":"$150.00"},{"v":149.95,"d":"$149.95"},0,"Wfw19lm1-303-M  W Lucie Mid"," ",{"$f":"--ISNUMBER(IFERROR(SEARCH(Orders!$E18,O603,1),\"\"))","v":1},{"$f":"IF(Q603=1,COUNTIF($Q$2:Q603,1),\"\")","v":602},{"$f":"IFERROR(INDEX($O2:$O986,MATCH(ROWS($Q$2:Q603),$R2:$R986,0)),\"\")","v":"Wfw19lm1-303-M  W Lucie Mid"}]
[27,"WFW19LM1","303","M  ","W Lucie Mid","Olive","7-18598-83194-3","C/O       ",5.5,null,{"v":75,"d":"$75.00"},{"v":150,"d":"$150.00"},{"v":149.95,"d":"$149.95"},0,"Wfw19lm1-303-M  W Lucie Mid"," ",{"$f":"--ISNUMBER(IFERROR(SEARCH(Orders!$E18,O604,1),\"\"))","v":1},{"$f":"IF(Q604=1,COUNTIF($Q$2:Q604,1),\"\")","v":603},{"$f":"IFERROR(INDEX($O2:$O986,MATCH(ROWS($Q$2:Q604),$R2:$R986,0)),\"\")","v":"Wfw19lm1-303-M  W Lucie Mid"}]
[27,"WFW19LM1","303","M  ","W Lucie Mid","Olive","7-18598-83195-0","C/O       ",6,null,{"v":75,"d":"$75.00"},{"v":150,"d":"$150.00"},{"v":149.95,"d":"$149.95"},0,"Wfw19lm1-303-M  W Lucie Mid"," ",{"$f":"--ISNUMBER(IFERROR(SEARCH(Orders!$E18,O605,1),\"\"))","v":1},{"$f":"IF(Q605=1,COUNTIF($Q$2:Q605,1),\"\")","v":604},{"$f":"IFERROR(INDEX($O2:$O986,MATCH(ROWS($Q$2:Q605),$R2:$R986,0)),\"\")","v":"Wfw19lm1-303-M  W Lucie Mid"}]
[27,"WFW19LM1","303","M  ","W Lucie Mid","Olive","7-18598-83196-7","C/O       ",6.5,null,{"v":75,"d":"$75.00"},{"v":150,"d":"$150.00"},{"v":149.95,"d":"$149.95"},0,"Wfw19lm1-303-M  W Lucie Mid"," ",{"$f":"--ISNUMBER(IFERROR(SEARCH(Orders!$E18,O606,1),\"\"))","v":1},{"$f":"IF(Q606=1,COUNTIF($Q$2:Q606,1),\"\")","v":605},{"$f":"IFERROR(INDEX($O2:$O986,MATCH(ROWS($Q$2:Q606),$R2:$R986,0)),\"\")","v":"Wfw19lm1-303-M  W Lucie Mid"}]
[27,"WFW19LM1","303","M  ","W Lucie Mid","Olive","7-18598-83197-4","C/O       ",7,null,{"v":75,"d":"$75.00"},{"v":150,"d":"$150.00"},{"v":149.95,"d":"$149.95"},0,"Wfw19lm1-303-M  W Lucie Mid"," ",{"$f":"--ISNUMBER(IFERROR(SEARCH(Orders!$E18,O607,1),\"\"))","v":1},{"$f":"IF(Q607=1,COUNTIF($Q$2:Q607,1),\"\")","v":606},{"$f":"IFERROR(INDEX($O2:$O986,MATCH(ROWS($Q$2:Q607),$R2:$R986,0)),\"\")","v":"Wfw19lm1-303-M  W Lucie Mid"}]
[27,"WFW19LM1","303","M  ","W Lucie Mid","Olive","7-18598-83198-1","C/O       ",7.5,null,{"v":75,"d":"$75.00"},{"v":150,"d":"$150.00"},{"v":149.95,"d":"$149.95"},0,"Wfw19lm1-303-M  W Lucie Mid"," ",{"$f":"--ISNUMBER(IFERROR(SEARCH(Orders!$E18,O608,1),\"\"))","v":1},{"$f":"IF(Q608=1,COUNTIF($Q$2:Q608,1),\"\")","v":607},{"$f":"IFERROR(INDEX($O2:$O986,MATCH(ROWS($Q$2:Q608),$R2:$R986,0)),\"\")","v":"Wfw19lm1-303-M  W Lucie Mid"}]
[27,"WFW19LM1","303","M  ","W Lucie Mid","Olive","7-18598-83199-8","C/O       ",8,null,{"v":75,"d":"$75.00"},{"v":150,"d":"$150.00"},{"v":149.95,"d":"$149.95"},0,"Wfw19lm1-303-M  W Lucie Mid"," ",{"$f":"--ISNUMBER(IFERROR(SEARCH(Orders!$E18,O609,1),\"\"))","v":1},{"$f":"IF(Q609=1,COUNTIF($Q$2:Q609,1),\"\")","v":608},{"$f":"IFERROR(INDEX($O2:$O986,MATCH(ROWS($Q$2:Q609),$R2:$R986,0)),\"\")","v":"Wfw19lm1-303-M  W Lucie Mid"}]
[27,"WFW19LM1","303","M  ","W Lucie Mid","Olive","7-18598-83200-1","C/O       ",8.5,null,{"v":75,"d":"$75.00"},{"v":150,"d":"$150.00"},{"v":149.95,"d":"$149.95"},0,"Wfw19lm1-303-M  W Lucie Mid"," ",{"$f":"--ISNUMBER(IFERROR(SEARCH(Orders!$E18,O610,1),\"\"))","v":1},{"$f":"IF(Q610=1,COUNTIF($Q$2:Q610,1),\"\")","v":609},{"$f":"IFERROR(INDEX($O2:$O986,MATCH(ROWS($Q$2:Q610),$R2:$R986,0)),\"\")","v":"Wfw19lm1-303-M  W Lucie Mid"}]
[27,"WFW19LM1","303","M  ","W Lucie Mid","Olive","7-18598-83201-8","C/O       ",9,null,{"v":75,"d":"$75.00"},{"v":150,"d":"$150.00"},{"v":149.95,"d":"$149.95"},0,"Wfw19lm1-303-M  W Lucie Mid"," ",{"$f":"--ISNUMBER(IFERROR(SEARCH(Orders!$E18,O611,1),\"\"))","v":1},{"$f":"IF(Q611=1,COUNTIF($Q$2:Q611,1),\"\")","v":610},{"$f":"IFERROR(INDEX($O2:$O986,MATCH(ROWS($Q$2:Q611),$R2:$R986,0)),\"\")","v":"Wfw19lm1-303-M  W Lucie Mid"}]
[27,"WFW19LM1","303","M  ","W Lucie Mid","Olive","7-18598-83202-5","C/O       ",9.5,null,{"v":75,"d":"$75.00"},{"v":150,"d":"$150.00"},{"v":149.95,"d":"$149.95"},0,"Wfw19lm1-303-M  W Lucie Mid"," ",{"$f":"--ISNUMBER(IFERROR(SEARCH(Orders!$E18,O612,1),\"\"))","v":1},{"$f":"IF(Q612=1,COUNTIF($Q$2:Q612,1),\"\")","v":611},{"$f":"IFERROR(INDEX($O2:$O986,MATCH(ROWS($Q$2:Q612),$R2:$R986,0)),\"\")","v":"Wfw19lm1-303-M  W Lucie Mid"}]
[27,"WFW19LM1","303","M  ","W Lucie Mid","Olive","7-18598-83203-2","C/O       ",10,null,{"v":75,"d":"$75.00"},{"v":150,"d":"$150.00"},{"v":149.95,"d":"$149.95"},0,"Wfw19lm1-303-M  W Lucie Mid"," ",{"$f":"--ISNUMBER(IFERROR(SEARCH(Orders!$E18,O613,1),\"\"))","v":1},{"$f":"IF(Q613=1,COUNTIF($Q$2:Q613,1),\"\")","v":612},{"$f":"IFERROR(INDEX($O2:$O986,MATCH(ROWS($Q$2:Q613),$R2:$R986,0)),\"\")","v":"Wfw19lm1-303-M  W Lucie Mid"}]
[27,"WFW19LM1","303","M  ","W Lucie Mid","Olive","7-18598-83204-9","C/O       ",10.5,null,{"v":75,"d":"$75.00"},{"v":150,"d":"$150.00"},{"v":149.95,"d":"$149.95"},0,"Wfw19lm1-303-M  W Lucie Mid"," ",{"$f":"--ISNUMBER(IFERROR(SEARCH(Orders!$E18,O614,1),\"\"))","v":1},{"$f":"IF(Q614=1,COUNTIF($Q$2:Q614,1),\"\")","v":613},{"$f":"IFERROR(INDEX($O2:$O986,MATCH(ROWS($Q$2:Q614),$R2:$R986,0)),\"\")","v":"Wfw19lm1-303-M  W Lucie Mid"}]
[27,"WFW19LM1","303","M  ","W Lucie Mid","Olive","7-18598-83205-6","C/O       ",11,null,{"v":75,"d":"$75.00"},{"v":150,"d":"$150.00"},{"v":149.95,"d":"$149.95"},0,"Wfw19lm1-303-M  W Lucie Mid"," ",{"$f":"--ISNUMBER(IFERROR(SEARCH(Orders!$E18,O615,1),\"\"))","v":1},{"$f":"IF(Q615=1,COUNTIF($Q$2:Q615,1),\"\")","v":614},{"$f":"IFERROR(INDEX($O2:$O986,MATCH(ROWS($Q$2:Q615),$R2:$R986,0)),\"\")","v":"Wfw19lm1-303-M  W Lucie Mid"}]
[27,"WFW19LM9","009","M  ","W Lucie Mid","Blk Multi","8-40221-90362-5","C/O       ",5,null,{"v":75,"d":"$75.00"},{"v":150,"d":"$150.00"},{"v":149.95,"d":"$149.95"},0,"Wfw19lm9-009-M  W Lucie Mid"," ",{"$f":"--ISNUMBER(IFERROR(SEARCH(Orders!$E18,O616,1),\"\"))","v":1},{"$f":"IF(Q616=1,COUNTIF($Q$2:Q616,1),\"\")","v":615},{"$f":"IFERROR(INDEX($O2:$O986,MATCH(ROWS($Q$2:Q616),$R2:$R986,0)),\"\")","v":"Wfw19lm9-009-M  W Lucie Mid"}]
[27,"WFW19LM9","009","M  ","W Lucie Mid","Blk Multi","8-40221-90363-2","C/O       ",5.5,null,{"v":75,"d":"$75.00"},{"v":150,"d":"$150.00"},{"v":149.95,"d":"$149.95"},0,"Wfw19lm9-009-M  W Lucie Mid"," ",{"$f":"--ISNUMBER(IFERROR(SEARCH(Orders!$E18,O617,1),\"\"))","v":1},{"$f":"IF(Q617=1,COUNTIF($Q$2:Q617,1),\"\")","v":616},{"$f":"IFERROR(INDEX($O2:$O986,MATCH(ROWS($Q$2:Q617),$R2:$R986,0)),\"\")","v":"Wfw19lm9-009-M  W Lucie Mid"}]
[27,"WFW19LM9","009","M  ","W Lucie Mid","Blk Multi","8-40221-90364-9","C/O       ",6,null,{"v":75,"d":"$75.00"},{"v":150,"d":"$150.00"},{"v":149.95,"d":"$149.95"},0,"Wfw19lm9-009-M  W Lucie Mid"," ",{"$f":"--ISNUMBER(IFERROR(SEARCH(Orders!$E18,O618,1),\"\"))","v":1},{"$f":"IF(Q618=1,COUNTIF($Q$2:Q618,1),\"\")","v":617},{"$f":"IFERROR(INDEX($O2:$O986,MATCH(ROWS($Q$2:Q618),$R2:$R986,0)),\"\")","v":"Wfw19lm9-009-M  W Lucie Mid"}]
[27,"WFW19LM9","009","M  ","W Lucie Mid","Blk Multi","8-40221-90365-6","C/O       ",6.5,null,{"v":75,"d":"$75.00"},{"v":150,"d":"$150.00"},{"v":149.95,"d":"$149.95"},0,"Wfw19lm9-009-M  W Lucie Mid"," ",{"$f":"--ISNUMBER(IFERROR(SEARCH(Orders!$E18,O619,1),\"\"))","v":1},{"$f":"IF(Q619=1,COUNTIF($Q$2:Q619,1),\"\")","v":618},{"$f":"IFERROR(INDEX($O2:$O986,MATCH(ROWS($Q$2:Q619),$R2:$R986,0)),\"\")","v":"Wfw19lm9-009-M  W Lucie Mid"}]
[27,"WFW19LM9","009","M  ","W Lucie Mid","Blk Multi","8-40221-90366-3","C/O       ",7,null,{"v":75,"d":"$75.00"},{"v":150,"d":"$150.00"},{"v":149.95,"d":"$149.95"},0,"Wfw19lm9-009-M  W Lucie Mid"," ",{"$f":"--ISNUMBER(IFERROR(SEARCH(Orders!$E18,O620,1),\"\"))","v":1},{"$f":"IF(Q620=1,COUNTIF($Q$2:Q620,1),\"\")","v":619},{"$f":"IFERROR(INDEX($O2:$O986,MATCH(ROWS($Q$2:Q620),$R2:$R986,0)),\"\")","v":"Wfw19lm9-009-M  W Lucie Mid"}]
[27,"WFW19LM9","009","M  ","W Lucie Mid","Blk Multi","8-40221-90367-0","C/O       ",7.5,null,{"v":75,"d":"$75.00"},{"v":150,"d":"$150.00"},{"v":149.95,"d":"$149.95"},0,"Wfw19lm9-009-M  W Lucie Mid"," ",{"$f":"--ISNUMBER(IFERROR(SEARCH(Orders!$E18,O621,1),\"\"))","v":1},{"$f":"IF(Q621=1,COUNTIF($Q$2:Q621,1),\"\")","v":620},{"$f":"IFERROR(INDEX($O2:$O986,MATCH(ROWS($Q$2:Q621),$R2:$R986,0)),\"\")","v":"Wfw19lm9-009-M  W Lucie Mid"}]
[27,"WFW19LM9","009","M  ","W Lucie Mid","Blk Multi","8-40221-90368-7","C/O       ",8,null,{"v":75,"d":"$75.00"},{"v":150,"d":"$150.00"},{"v":149.95,"d":"$149.95"},0,"Wfw19lm9-009-M  W Lucie Mid"," ",{"$f":"--ISNUMBER(IFERROR(SEARCH(Orders!$E18,O622,1),\"\"))","v":1},{"$f":"IF(Q622=1,COUNTIF($Q$2:Q622,1),\"\")","v":621},{"$f":"IFERROR(INDEX($O2:$O986,MATCH(ROWS($Q$2:Q622),$R2:$R986,0)),\"\")","v":"Wfw19lm9-009-M  W Lucie Mid"}]
[27,"WFW19LM9","009","M  ","W Lucie Mid","Blk Multi","8-40221-90369-4","C/O       ",8.5,null,{"v":75,"d":"$75.00"},{"v":150,"d":"$150.00"},{"v":149.95,"d":"$149.95"},0,"Wfw19lm9-009-M  W Lucie Mid"," ",{"$f":"--ISNUMBER(IFERROR(SEARCH(Orders!$E18,O623,1),\"\"))","v":1},{"$f":"IF(Q623=1,COUNTIF($Q$2:Q623,1),\"\")","v":622},{"$f":"IFERROR(INDEX($O2:$O986,MATCH(ROWS($Q$2:Q623),$R2:$R986,0)),\"\")","v":"Wfw19lm9-009-M  W Lucie Mid"}]
[27,"WFW19LM9","009","M  ","W Lucie Mid","Blk Multi","8-40221-90370-0","C/O       ",9,null,{"v":75,"d":"$75.00"},{"v":150,"d":"$150.00"},{"v":149.95,"d":"$149.95"},0,"Wfw19lm9-009-M  W Lucie Mid"," ",{"$f":"--ISNUMBER(IFERROR(SEARCH(Orders!$E18,O624,1),\"\"))","v":1},{"$f":"IF(Q624=1,COUNTIF($Q$2:Q624,1),\"\")","v":623},{"$f":"IFERROR(INDEX($O2:$O986,MATCH(ROWS($Q$2:Q624),$R2:$R986,0)),\"\")","v":"Wfw19lm9-009-M  W Lucie Mid"}]
[27,"WFW19LM9","009","M  ","W Lucie Mid","Blk Multi","8-40221-90371-7","C/O       ",9.5,null,{"v":75,"d":"$75.00"},{"v":150,"d":"$150.00"},{"v":149.95,"d":"$149.95"},0,"Wfw19lm9-009-M  W Lucie Mid"," ",{"$f":"--ISNUMBER(IFERROR(SEARCH(Orders!$E18,O625,1),\"\"))","v":1},{"$f":"IF(Q625=1,COUNTIF($Q$2:Q625,1),\"\")","v":624},{"$f":"IFERROR(INDEX($O2:$O986,MATCH(ROWS($Q$2:Q625),$R2:$R986,0)),\"\")","v":"Wfw19lm9-009-M  W Lucie Mid"}]
[27,"WFW19LM9","009","M  ","W Lucie Mid","Blk Multi","8-40221-90372-4","C/O       ",10,null,{"v":75,"d":"$75.00"},{"v":150,"d":"$150.00"},{"v":149.95,"d":"$149.95"},0,"Wfw19lm9-009-M  W Lucie Mid"," ",{"$f":"--ISNUMBER(IFERROR(SEARCH(Orders!$E18,O626,1),\"\"))","v":1},{"$f":"IF(Q626=1,COUNTIF($Q$2:Q626,1),\"\")","v":625},{"$f":"IFERROR(INDEX($O2:$O986,MATCH(ROWS($Q$2:Q626),$R2:$R986,0)),\"\")","v":"Wfw19lm9-009-M  W Lucie Mid"}]
[27,"WFW19LM9","009","M  ","W Lucie Mid","Blk Multi","8-40221-90373-1","C/O       ",10.5,null,{"v":75,"d":"$75.00"},{"v":150,"d":"$150.00"},{"v":149.95,"d":"$149.95"},0,"Wfw19lm9-009-M  W Lucie Mid"," ",{"$f":"--ISNUMBER(IFERROR(SEARCH(Orders!$E18,O627,1),\"\"))","v":1},{"$f":"IF(Q627=1,COUNTIF($Q$2:Q627,1),\"\")","v":626},{"$f":"IFERROR(INDEX($O2:$O986,MATCH(ROWS($Q$2:Q627),$R2:$R986,0)),\"\")","v":"Wfw19lm9-009-M  W Lucie Mid"}]
[27,"WFW19LM9","009","M  ","W Lucie Mid","Blk Multi","8-40221-90374-8","C/O       ",11,null,{"v":75,"d":"$75.00"},{"v":150,"d":"$150.00"},{"v":149.95,"d":"$149.95"},0,"Wfw19lm9-009-M  W Lucie Mid"," ",{"$f":"--ISNUMBER(IFERROR(SEARCH(Orders!$E18,O628,1),\"\"))","v":1},{"$f":"IF(Q628=1,COUNTIF($Q$2:Q628,1),\"\")","v":627},{"$f":"IFERROR(INDEX($O2:$O986,MATCH(ROWS($Q$2:Q628),$R2:$R986,0)),\"\")","v":"Wfw19lm9-009-M  W Lucie Mid"}]
[17,"WFW20T1 ","001","M  ","W Thatcher Mid","Black","7-52505-95533-9","C/O       ",6,null,{"v":85,"d":"$85.00"},{"v":170,"d":"$170.00"},{"v":169.95,"d":"$169.95"},0,"Wfw20t1-001-M  W Thatcher Mid"," ",{"$f":"--ISNUMBER(IFERROR(SEARCH(Orders!$E18,O629,1),\"\"))","v":1},{"$f":"IF(Q629=1,COUNTIF($Q$2:Q629,1),\"\")","v":628},{"$f":"IFERROR(INDEX($O2:$O986,MATCH(ROWS($Q$2:Q629),$R2:$R986,0)),\"\")","v":"Wfw20t1-001-M  W Thatcher Mid"}]
[17,"WFW20T1 ","001","M  ","W Thatcher Mid","Black","7-52505-95534-6","C/O       ",6.5,null,{"v":85,"d":"$85.00"},{"v":170,"d":"$170.00"},{"v":169.95,"d":"$169.95"},0,"Wfw20t1-001-M  W Thatcher Mid"," ",{"$f":"--ISNUMBER(IFERROR(SEARCH(Orders!$E18,O630,1),\"\"))","v":1},{"$f":"IF(Q630=1,COUNTIF($Q$2:Q630,1),\"\")","v":629},{"$f":"IFERROR(INDEX($O2:$O986,MATCH(ROWS($Q$2:Q630),$R2:$R986,0)),\"\")","v":"Wfw20t1-001-M  W Thatcher Mid"}]
[17,"WFW20T1 ","001","M  ","W Thatcher Mid","Black","7-52505-95535-3","C/O       ",7,null,{"v":85,"d":"$85.00"},{"v":170,"d":"$170.00"},{"v":169.95,"d":"$169.95"},0,"Wfw20t1-001-M  W Thatcher Mid"," ",{"$f":"--ISNUMBER(IFERROR(SEARCH(Orders!$E18,O631,1),\"\"))","v":1},{"$f":"IF(Q631=1,COUNTIF($Q$2:Q631,1),\"\")","v":630},{"$f":"IFERROR(INDEX($O2:$O986,MATCH(ROWS($Q$2:Q631),$R2:$R986,0)),\"\")","v":"Wfw20t1-001-M  W Thatcher Mid"}]
[17,"WFW20T1 ","001","M  ","W Thatcher Mid","Black","7-52505-95536-0","C/O       ",7.5,null,{"v":85,"d":"$85.00"},{"v":170,"d":"$170.00"},{"v":169.95,"d":"$169.95"},0,"Wfw20t1-001-M  W Thatcher Mid"," ",{"$f":"--ISNUMBER(IFERROR(SEARCH(Orders!$E18,O632,1),\"\"))","v":1},{"$f":"IF(Q632=1,COUNTIF($Q$2:Q632,1),\"\")","v":631},{"$f":"IFERROR(INDEX($O2:$O986,MATCH(ROWS($Q$2:Q632),$R2:$R986,0)),\"\")","v":"Wfw20t1-001-M  W Thatcher Mid"}]
[17,"WFW20T1 ","001","M  ","W Thatcher Mid","Black","7-52505-95537-7","C/O       ",8,null,{"v":85,"d":"$85.00"},{"v":170,"d":"$170.00"},{"v":169.95,"d":"$169.95"},0,"Wfw20t1-001-M  W Thatcher Mid"," ",{"$f":"--ISNUMBER(IFERROR(SEARCH(Orders!$E18,O633,1),\"\"))","v":1},{"$f":"IF(Q633=1,COUNTIF($Q$2:Q633,1),\"\")","v":632},{"$f":"IFERROR(INDEX($O2:$O986,MATCH(ROWS($Q$2:Q633),$R2:$R986,0)),\"\")","v":"Wfw20t1-001-M  W Thatcher Mid"}]
[17,"WFW20T1 ","001","M  ","W Thatcher Mid","Black","7-52505-95538-4","C/O       ",8.5,null,{"v":85,"d":"$85.00"},{"v":170,"d":"$170.00"},{"v":169.95,"d":"$169.95"},0,"Wfw20t1-001-M  W Thatcher Mid"," ",{"$f":"--ISNUMBER(IFERROR(SEARCH(Orders!$E18,O634,1),\"\"))","v":1},{"$f":"IF(Q634=1,COUNTIF($Q$2:Q634,1),\"\")","v":633},{"$f":"IFERROR(INDEX($O2:$O986,MATCH(ROWS($Q$2:Q634),$R2:$R986,0)),\"\")","v":"Wfw20t1-001-M  W Thatcher Mid"}]
[17,"WFW20T1 ","001","M  ","W Thatcher Mid","Black","7-52505-95539-1","C/O       ",9,null,{"v":85,"d":"$85.00"},{"v":170,"d":"$170.00"},{"v":169.95,"d":"$169.95"},0,"Wfw20t1-001-M  W Thatcher Mid"," ",{"$f":"--ISNUMBER(IFERROR(SEARCH(Orders!$E18,O635,1),\"\"))","v":1},{"$f":"IF(Q635=1,COUNTIF($Q$2:Q635,1),\"\")","v":634},{"$f":"IFERROR(INDEX($O2:$O986,MATCH(ROWS($Q$2:Q635),$R2:$R986,0)),\"\")","v":"Wfw20t1-001-M  W Thatcher Mid"}]
[17,"WFW20T1 ","001","M  ","W Thatcher Mid","Black","7-52505-95540-7","C/O       ",9.5,null,{"v":85,"d":"$85.00"},{"v":170,"d":"$170.00"},{"v":169.95,"d":"$169.95"},0,"Wfw20t1-001-M  W Thatcher Mid"," ",{"$f":"--ISNUMBER(IFERROR(SEARCH(Orders!$E18,O636,1),\"\"))","v":1},{"$f":"IF(Q636=1,COUNTIF($Q$2:Q636,1),\"\")","v":635},{"$f":"IFERROR(INDEX($O2:$O986,MATCH(ROWS($Q$2:Q636),$R2:$R986,0)),\"\")","v":"Wfw20t1-001-M  W Thatcher Mid"}]
[17,"WFW20T1 ","001","M  ","W Thatcher Mid","Black","7-52505-95541-4","C/O       ",10,null,{"v":85,"d":"$85.00"},{"v":170,"d":"$170.00"},{"v":169.95,"d":"$169.95"},0,"Wfw20t1-001-M  W Thatcher Mid"," ",{"$f":"--ISNUMBER(IFERROR(SEARCH(Orders!$E18,O637,1),\"\"))","v":1},{"$f":"IF(Q637=1,COUNTIF($Q$2:Q637,1),\"\")","v":636},{"$f":"IFERROR(INDEX($O2:$O986,MATCH(ROWS($Q$2:Q637),$R2:$R986,0)),\"\")","v":"Wfw20t1-001-M  W Thatcher Mid"}]
[17,"WFW20T1 ","001","M  ","W Thatcher Mid","Black","7-52505-95542-1","C/O       ",10.5,null,{"v":85,"d":"$85.00"},{"v":170,"d":"$170.00"},{"v":169.95,"d":"$169.95"},0,"Wfw20t1-001-M  W Thatcher Mid"," ",{"$f":"--ISNUMBER(IFERROR(SEARCH(Orders!$E18,O638,1),\"\"))","v":1},{"$f":"IF(Q638=1,COUNTIF($Q$2:Q638,1),\"\")","v":637},{"$f":"IFERROR(INDEX($O2:$O986,MATCH(ROWS($Q$2:Q638),$R2:$R986,0)),\"\")","v":"Wfw20t1-001-M  W Thatcher Mid"}]
[17,"WFW20T1 ","001","M  ","W Thatcher Mid","Black","7-52505-95543-8","C/O       ",11,null,{"v":85,"d":"$85.00"},{"v":170,"d":"$170.00"},{"v":169.95,"d":"$169.95"},0,"Wfw20t1-001-M  W Thatcher Mid"," ",{"$f":"--ISNUMBER(IFERROR(SEARCH(Orders!$E18,O639,1),\"\"))","v":1},{"$f":"IF(Q639=1,COUNTIF($Q$2:Q639,1),\"\")","v":638},{"$f":"IFERROR(INDEX($O2:$O986,MATCH(ROWS($Q$2:Q639),$R2:$R986,0)),\"\")","v":"Wfw20t1-001-M  W Thatcher Mid"}]
[17,"WFW20T2 ","235","M  ","W Thatcher Mid","Toffee","7-52505-95546-9","C/O       ",6,null,{"v":85,"d":"$85.00"},{"v":170,"d":"$170.00"},{"v":169.95,"d":"$169.95"},0,"Wfw20t2-235-M  W Thatcher Mid"," ",{"$f":"--ISNUMBER(IFERROR(SEARCH(Orders!$E18,O640,1),\"\"))","v":1},{"$f":"IF(Q640=1,COUNTIF($Q$2:Q640,1),\"\")","v":639},{"$f":"IFERROR(INDEX($O2:$O986,MATCH(ROWS($Q$2:Q640),$R2:$R986,0)),\"\")","v":"Wfw20t2-235-M  W Thatcher Mid"}]
[17,"WFW20T2 ","235","M  ","W Thatcher Mid","Toffee","7-52505-95547-6","C/O       ",6.5,null,{"v":85,"d":"$85.00"},{"v":170,"d":"$170.00"},{"v":169.95,"d":"$169.95"},0,"Wfw20t2-235-M  W Thatcher Mid"," ",{"$f":"--ISNUMBER(IFERROR(SEARCH(Orders!$E18,O641,1),\"\"))","v":1},{"$f":"IF(Q641=1,COUNTIF($Q$2:Q641,1),\"\")","v":640},{"$f":"IFERROR(INDEX($O2:$O986,MATCH(ROWS($Q$2:Q641),$R2:$R986,0)),\"\")","v":"Wfw20t2-235-M  W Thatcher Mid"}]
[17,"WFW20T2 ","235","M  ","W Thatcher Mid","Toffee","7-52505-95548-3","C/O       ",7,null,{"v":85,"d":"$85.00"},{"v":170,"d":"$170.00"},{"v":169.95,"d":"$169.95"},{"$f":"J642*K642","v":0},"Wfw20t2-235-M  W Thatcher Mid"," ",{"$f":"--ISNUMBER(IFERROR(SEARCH(Orders!$E18,O642,1),\"\"))","v":1},{"$f":"IF(Q642=1,COUNTIF($Q$2:Q642,1),\"\")","v":641},{"$f":"IFERROR(INDEX($O2:$O986,MATCH(ROWS($Q$2:Q642),$R2:$R986,0)),\"\")","v":"Wfw20t2-235-M  W Thatcher Mid"}]
[17,"WFW20T2 ","235","M  ","W Thatcher Mid","Toffee","7-52505-95549-0","C/O       ",7.5,null,{"v":85,"d":"$85.00"},{"v":170,"d":"$170.00"},{"v":169.95,"d":"$169.95"},0,"Wfw20t2-235-M  W Thatcher Mid"," ",{"$f":"--ISNUMBER(IFERROR(SEARCH(Orders!$E18,O643,1),\"\"))","v":1},{"$f":"IF(Q643=1,COUNTIF($Q$2:Q643,1),\"\")","v":642},{"$f":"IFERROR(INDEX($O2:$O986,MATCH(ROWS($Q$2:Q643),$R2:$R986,0)),\"\")","v":"Wfw20t2-235-M  W Thatcher Mid"}]
[17,"WFW20T2 ","235","M  ","W Thatcher Mid","Toffee","7-52505-95550-6","C/O       ",8,null,{"v":85,"d":"$85.00"},{"v":170,"d":"$170.00"},{"v":169.95,"d":"$169.95"},0,"Wfw20t2-235-M  W Thatcher Mid"," ",{"$f":"--ISNUMBER(IFERROR(SEARCH(Orders!$E18,O644,1),\"\"))","v":1},{"$f":"IF(Q644=1,COUNTIF($Q$2:Q644,1),\"\")","v":643},{"$f":"IFERROR(INDEX($O2:$O986,MATCH(ROWS($Q$2:Q644),$R2:$R986,0)),\"\")","v":"Wfw20t2-235-M  W Thatcher Mid"}]
[17,"WFW20T2 ","235","M  ","W Thatcher Mid","Toffee","7-52505-95551-3","C/O       ",8.5,null,{"v":85,"d":"$85.00"},{"v":170,"d":"$170.00"},{"v":169.95,"d":"$169.95"},0,"Wfw20t2-235-M  W Thatcher Mid"," ",{"$f":"--ISNUMBER(IFERROR(SEARCH(Orders!$E18,O645,1),\"\"))","v":1},{"$f":"IF(Q645=1,COUNTIF($Q$2:Q645,1),\"\")","v":644},{"$f":"IFERROR(INDEX($O2:$O986,MATCH(ROWS($Q$2:Q645),$R2:$R986,0)),\"\")","v":"Wfw20t2-235-M  W Thatcher Mid"}]
[17,"WFW20T2 ","235","M  ","W Thatcher Mid","Toffee","7-52505-95552-0","C/O       ",9,null,{"v":85,"d":"$85.00"},{"v":170,"d":"$170.00"},{"v":169.95,"d":"$169.95"},0,"Wfw20t2-235-M  W Thatcher Mid"," ",{"$f":"--ISNUMBER(IFERROR(SEARCH(Orders!$E18,O646,1),\"\"))","v":1},{"$f":"IF(Q646=1,COUNTIF($Q$2:Q646,1),\"\")","v":645},{"$f":"IFERROR(INDEX($O2:$O986,MATCH(ROWS($Q$2:Q646),$R2:$R986,0)),\"\")","v":"Wfw20t2-235-M  W Thatcher Mid"}]
[17,"WFW20T2 ","235","M  ","W Thatcher Mid","Toffee","7-52505-95553-7","C/O       ",9.5,null,{"v":85,"d":"$85.00"},{"v":170,"d":"$170.00"},{"v":169.95,"d":"$169.95"},0,"Wfw20t2-235-M  W Thatcher Mid"," ",{"$f":"--ISNUMBER(IFERROR(SEARCH(Orders!$E18,O647,1),\"\"))","v":1},{"$f":"IF(Q647=1,COUNTIF($Q$2:Q647,1),\"\")","v":646},{"$f":"IFERROR(INDEX($O2:$O986,MATCH(ROWS($Q$2:Q647),$R2:$R986,0)),\"\")","v":"Wfw20t2-235-M  W Thatcher Mid"}]
[17,"WFW20T2 ","235","M  ","W Thatcher Mid","Toffee","7-52505-95554-4","C/O       ",10,null,{"v":85,"d":"$85.00"},{"v":170,"d":"$170.00"},{"v":169.95,"d":"$169.95"},0,"Wfw20t2-235-M  W Thatcher Mid"," ",{"$f":"--ISNUMBER(IFERROR(SEARCH(Orders!$E18,O648,1),\"\"))","v":1},{"$f":"IF(Q648=1,COUNTIF($Q$2:Q648,1),\"\")","v":647},{"$f":"IFERROR(INDEX($O2:$O986,MATCH(ROWS($Q$2:Q648),$R2:$R986,0)),\"\")","v":"Wfw20t2-235-M  W Thatcher Mid"}]
[17,"WFW20T2 ","235","M  ","W Thatcher Mid","Toffee","7-52505-95555-1","C/O       ",10.5,null,{"v":85,"d":"$85.00"},{"v":170,"d":"$170.00"},{"v":169.95,"d":"$169.95"},0,"Wfw20t2-235-M  W Thatcher Mid"," ",{"$f":"--ISNUMBER(IFERROR(SEARCH(Orders!$E18,O649,1),\"\"))","v":1},{"$f":"IF(Q649=1,COUNTIF($Q$2:Q649,1),\"\")","v":648},{"$f":"IFERROR(INDEX($O2:$O986,MATCH(ROWS($Q$2:Q649),$R2:$R986,0)),\"\")","v":"Wfw20t2-235-M  W Thatcher Mid"}]
[17,"WFW20T2 ","235","M  ","W Thatcher Mid","Toffee","7-52505-95556-8","C/O       ",11,null,{"v":85,"d":"$85.00"},{"v":170,"d":"$170.00"},{"v":169.95,"d":"$169.95"},0,"Wfw20t2-235-M  W Thatcher Mid"," ",{"$f":"--ISNUMBER(IFERROR(SEARCH(Orders!$E18,O650,1),\"\"))","v":1},{"$f":"IF(Q650=1,COUNTIF($Q$2:Q650,1),\"\")","v":649},{"$f":"IFERROR(INDEX($O2:$O986,MATCH(ROWS($Q$2:Q650),$R2:$R986,0)),\"\")","v":"Wfw20t2-235-M  W Thatcher Mid"}]
[26,"WFW21LC1","001","M  ","W Lucie Chelsea","Black","8-40221-90284-0","C/O       ",5,null,{"v":77.5,"d":"$77.50"},{"v":155,"d":"$155.00"},{"v":154.95,"d":"$154.95"},0,"Wfw21lc1-001-M  W Lucie Chelsea"," ",{"$f":"--ISNUMBER(IFERROR(SEARCH(Orders!$E18,O651,1),\"\"))","v":1},{"$f":"IF(Q651=1,COUNTIF($Q$2:Q651,1),\"\")","v":650},{"$f":"IFERROR(INDEX($O2:$O986,MATCH(ROWS($Q$2:Q651),$R2:$R986,0)),\"\")","v":"Wfw21lc1-001-M  W Lucie Chelsea"}]
[26,"WFW21LC1","001","M  ","W Lucie Chelsea","Black","8-40221-90285-7","C/O       ",5.5,null,{"v":77.5,"d":"$77.50"},{"v":155,"d":"$155.00"},{"v":154.95,"d":"$154.95"},0,"Wfw21lc1-001-M  W Lucie Chelsea"," ",{"$f":"--ISNUMBER(IFERROR(SEARCH(Orders!$E18,O652,1),\"\"))","v":1},{"$f":"IF(Q652=1,COUNTIF($Q$2:Q652,1),\"\")","v":651},{"$f":"IFERROR(INDEX($O2:$O986,MATCH(ROWS($Q$2:Q652),$R2:$R986,0)),\"\")","v":"Wfw21lc1-001-M  W Lucie Chelsea"}]
[26,"WFW21LC1","001","M  ","W Lucie Chelsea","Black","8-40221-90286-4","C/O       ",6,null,{"v":77.5,"d":"$77.50"},{"v":155,"d":"$155.00"},{"v":154.95,"d":"$154.95"},0,"Wfw21lc1-001-M  W Lucie Chelsea"," ",{"$f":"--ISNUMBER(IFERROR(SEARCH(Orders!$E18,O653,1),\"\"))","v":1},{"$f":"IF(Q653=1,COUNTIF($Q$2:Q653,1),\"\")","v":652},{"$f":"IFERROR(INDEX($O2:$O986,MATCH(ROWS($Q$2:Q653),$R2:$R986,0)),\"\")","v":"Wfw21lc1-001-M  W Lucie Chelsea"}]
[26,"WFW21LC1","001","M  ","W Lucie Chelsea","Black","8-40221-90287-1","C/O       ",6.5,null,{"v":77.5,"d":"$77.50"},{"v":155,"d":"$155.00"},{"v":154.95,"d":"$154.95"},0,"Wfw21lc1-001-M  W Lucie Chelsea"," ",{"$f":"--ISNUMBER(IFERROR(SEARCH(Orders!$E18,O654,1),\"\"))","v":1},{"$f":"IF(Q654=1,COUNTIF($Q$2:Q654,1),\"\")","v":653},{"$f":"IFERROR(INDEX($O2:$O986,MATCH(ROWS($Q$2:Q654),$R2:$R986,0)),\"\")","v":"Wfw21lc1-001-M  W Lucie Chelsea"}]
[26,"WFW21LC1","001","M  ","W Lucie Chelsea","Black","8-40221-90288-8","C/O       ",7,null,{"v":77.5,"d":"$77.50"},{"v":155,"d":"$155.00"},{"v":154.95,"d":"$154.95"},0,"Wfw21lc1-001-M  W Lucie Chelsea"," ",{"$f":"--ISNUMBER(IFERROR(SEARCH(Orders!$E18,O655,1),\"\"))","v":1},{"$f":"IF(Q655=1,COUNTIF($Q$2:Q655,1),\"\")","v":654},{"$f":"IFERROR(INDEX($O2:$O986,MATCH(ROWS($Q$2:Q655),$R2:$R986,0)),\"\")","v":"Wfw21lc1-001-M  W Lucie Chelsea"}]
[26,"WFW21LC1","001","M  ","W Lucie Chelsea","Black","8-40221-90289-5","C/O       ",7.5,null,{"v":77.5,"d":"$77.50"},{"v":155,"d":"$155.00"},{"v":154.95,"d":"$154.95"},0,"Wfw21lc1-001-M  W Lucie Chelsea"," ",{"$f":"--ISNUMBER(IFERROR(SEARCH(Orders!$E18,O656,1),\"\"))","v":1},{"$f":"IF(Q656=1,COUNTIF($Q$2:Q656,1),\"\")","v":655},{"$f":"IFERROR(INDEX($O2:$O986,MATCH(ROWS($Q$2:Q656),$R2:$R986,0)),\"\")","v":"Wfw21lc1-001-M  W Lucie Chelsea"}]
[26,"WFW21LC1","001","M  ","W Lucie Chelsea","Black","8-40221-90290-1","C/O       ",8,null,{"v":77.5,"d":"$77.50"},{"v":155,"d":"$155.00"},{"v":154.95,"d":"$154.95"},0,"Wfw21lc1-001-M  W Lucie Chelsea"," ",{"$f":"--ISNUMBER(IFERROR(SEARCH(Orders!$E18,O657,1),\"\"))","v":1},{"$f":"IF(Q657=1,COUNTIF($Q$2:Q657,1),\"\")","v":656},{"$f":"IFERROR(INDEX($O2:$O986,MATCH(ROWS($Q$2:Q657),$R2:$R986,0)),\"\")","v":"Wfw21lc1-001-M  W Lucie Chelsea"}]
[26,"WFW21LC1","001","M  ","W Lucie Chelsea","Black","8-40221-90291-8","C/O       ",8.5,null,{"v":77.5,"d":"$77.50"},{"v":155,"d":"$155.00"},{"v":154.95,"d":"$154.95"},0,"Wfw21lc1-001-M  W Lucie Chelsea"," ",{"$f":"--ISNUMBER(IFERROR(SEARCH(Orders!$E18,O658,1),\"\"))","v":1},{"$f":"IF(Q658=1,COUNTIF($Q$2:Q658,1),\"\")","v":657},{"$f":"IFERROR(INDEX($O2:$O986,MATCH(ROWS($Q$2:Q658),$R2:$R986,0)),\"\")","v":"Wfw21lc1-001-M  W Lucie Chelsea"}]
[26,"WFW21LC1","001","M  ","W Lucie Chelsea","Black","8-40221-90292-5","C/O       ",9,null,{"v":77.5,"d":"$77.50"},{"v":155,"d":"$155.00"},{"v":154.95,"d":"$154.95"},0,"Wfw21lc1-001-M  W Lucie Chelsea"," ",{"$f":"--ISNUMBER(IFERROR(SEARCH(Orders!$E18,O659,1),\"\"))","v":1},{"$f":"IF(Q659=1,COUNTIF($Q$2:Q659,1),\"\")","v":658},{"$f":"IFERROR(INDEX($O2:$O986,MATCH(ROWS($Q$2:Q659),$R2:$R986,0)),\"\")","v":"Wfw21lc1-001-M  W Lucie Chelsea"}]
[26,"WFW21LC1","001","M  ","W Lucie Chelsea","Black","8-40221-90293-2","C/O       ",9.5,null,{"v":77.5,"d":"$77.50"},{"v":155,"d":"$155.00"},{"v":154.95,"d":"$154.95"},0,"Wfw21lc1-001-M  W Lucie Chelsea"," ",{"$f":"--ISNUMBER(IFERROR(SEARCH(Orders!$E18,O660,1),\"\"))","v":1},{"$f":"IF(Q660=1,COUNTIF($Q$2:Q660,1),\"\")","v":659},{"$f":"IFERROR(INDEX($O2:$O986,MATCH(ROWS($Q$2:Q660),$R2:$R986,0)),\"\")","v":"Wfw21lc1-001-M  W Lucie Chelsea"}]
[26,"WFW21LC1","001","M  ","W Lucie Chelsea","Black","8-40221-90294-9","C/O       ",10,null,{"v":77.5,"d":"$77.50"},{"v":155,"d":"$155.00"},{"v":154.95,"d":"$154.95"},0,"Wfw21lc1-001-M  W Lucie Chelsea"," ",{"$f":"--ISNUMBER(IFERROR(SEARCH(Orders!$E18,O661,1),\"\"))","v":1},{"$f":"IF(Q661=1,COUNTIF($Q$2:Q661,1),\"\")","v":660},{"$f":"IFERROR(INDEX($O2:$O986,MATCH(ROWS($Q$2:Q661),$R2:$R986,0)),\"\")","v":"Wfw21lc1-001-M  W Lucie Chelsea"}]
[26,"WFW21LC1","001","M  ","W Lucie Chelsea","Black","8-40221-90295-6","C/O       ",10.5,null,{"v":77.5,"d":"$77.50"},{"v":155,"d":"$155.00"},{"v":154.95,"d":"$154.95"},0,"Wfw21lc1-001-M  W Lucie Chelsea"," ",{"$f":"--ISNUMBER(IFERROR(SEARCH(Orders!$E18,O662,1),\"\"))","v":1},{"$f":"IF(Q662=1,COUNTIF($Q$2:Q662,1),\"\")","v":661},{"$f":"IFERROR(INDEX($O2:$O986,MATCH(ROWS($Q$2:Q662),$R2:$R986,0)),\"\")","v":"Wfw21lc1-001-M  W Lucie Chelsea"}]
[26,"WFW21LC1","001","M  ","W Lucie Chelsea","Black","8-40221-90296-3","C/O       ",11,null,{"v":77.5,"d":"$77.50"},{"v":155,"d":"$155.00"},{"v":154.95,"d":"$154.95"},0,"Wfw21lc1-001-M  W Lucie Chelsea"," ",{"$f":"--ISNUMBER(IFERROR(SEARCH(Orders!$E18,O663,1),\"\"))","v":1},{"$f":"IF(Q663=1,COUNTIF($Q$2:Q663,1),\"\")","v":662},{"$f":"IFERROR(INDEX($O2:$O986,MATCH(ROWS($Q$2:Q663),$R2:$R986,0)),\"\")","v":"Wfw21lc1-001-M  W Lucie Chelsea"}]
[26,"WFW21LC2","240","M  ","W Lucie Chelsea","Tan","8-40221-90297-0","C/O       ",5,null,{"v":77.5,"d":"$77.50"},{"v":155,"d":"$155.00"},{"v":154.95,"d":"$154.95"},0,"Wfw21lc2-240-M  W Lucie Chelsea"," ",{"$f":"--ISNUMBER(IFERROR(SEARCH(Orders!$E18,O664,1),\"\"))","v":1},{"$f":"IF(Q664=1,COUNTIF($Q$2:Q664,1),\"\")","v":663},{"$f":"IFERROR(INDEX($O2:$O986,MATCH(ROWS($Q$2:Q664),$R2:$R986,0)),\"\")","v":"Wfw21lc2-240-M  W Lucie Chelsea"}]
[26,"WFW21LC2","240","M  ","W Lucie Chelsea","Tan","8-40221-90298-7","C/O       ",5.5,null,{"v":77.5,"d":"$77.50"},{"v":155,"d":"$155.00"},{"v":154.95,"d":"$154.95"},0,"Wfw21lc2-240-M  W Lucie Chelsea"," ",{"$f":"--ISNUMBER(IFERROR(SEARCH(Orders!$E18,O665,1),\"\"))","v":1},{"$f":"IF(Q665=1,COUNTIF($Q$2:Q665,1),\"\")","v":664},{"$f":"IFERROR(INDEX($O2:$O986,MATCH(ROWS($Q$2:Q665),$R2:$R986,0)),\"\")","v":"Wfw21lc2-240-M  W Lucie Chelsea"}]
[26,"WFW21LC2","240","M  ","W Lucie Chelsea","Tan","8-40221-90299-4","C/O       ",6,null,{"v":77.5,"d":"$77.50"},{"v":155,"d":"$155.00"},{"v":154.95,"d":"$154.95"},0,"Wfw21lc2-240-M  W Lucie Chelsea"," ",{"$f":"--ISNUMBER(IFERROR(SEARCH(Orders!$E18,O666,1),\"\"))","v":1},{"$f":"IF(Q666=1,COUNTIF($Q$2:Q666,1),\"\")","v":665},{"$f":"IFERROR(INDEX($O2:$O986,MATCH(ROWS($Q$2:Q666),$R2:$R986,0)),\"\")","v":"Wfw21lc2-240-M  W Lucie Chelsea"}]
[26,"WFW21LC2","240","M  ","W Lucie Chelsea","Tan","8-40221-90300-7","C/O       ",6.5,null,{"v":77.5,"d":"$77.50"},{"v":155,"d":"$155.00"},{"v":154.95,"d":"$154.95"},0,"Wfw21lc2-240-M  W Lucie Chelsea"," ",{"$f":"--ISNUMBER(IFERROR(SEARCH(Orders!$E18,O667,1),\"\"))","v":1},{"$f":"IF(Q667=1,COUNTIF($Q$2:Q667,1),\"\")","v":666},{"$f":"IFERROR(INDEX($O2:$O986,MATCH(ROWS($Q$2:Q667),$R2:$R986,0)),\"\")","v":"Wfw21lc2-240-M  W Lucie Chelsea"}]
[26,"WFW21LC2","240","M  ","W Lucie Chelsea","Tan","8-40221-90301-4","C/O       ",7,null,{"v":77.5,"d":"$77.50"},{"v":155,"d":"$155.00"},{"v":154.95,"d":"$154.95"},0,"Wfw21lc2-240-M  W Lucie Chelsea"," ",{"$f":"--ISNUMBER(IFERROR(SEARCH(Orders!$E18,O668,1),\"\"))","v":1},{"$f":"IF(Q668=1,COUNTIF($Q$2:Q668,1),\"\")","v":667},{"$f":"IFERROR(INDEX($O2:$O986,MATCH(ROWS($Q$2:Q668),$R2:$R986,0)),\"\")","v":"Wfw21lc2-240-M  W Lucie Chelsea"}]
[26,"WFW21LC2","240","M  ","W Lucie Chelsea","Tan","8-40221-90302-1","C/O       ",7.5,null,{"v":77.5,"d":"$77.50"},{"v":155,"d":"$155.00"},{"v":154.95,"d":"$154.95"},0,"Wfw21lc2-240-M  W Lucie Chelsea"," ",{"$f":"--ISNUMBER(IFERROR(SEARCH(Orders!$E18,O669,1),\"\"))","v":1},{"$f":"IF(Q669=1,COUNTIF($Q$2:Q669,1),\"\")","v":668},{"$f":"IFERROR(INDEX($O2:$O986,MATCH(ROWS($Q$2:Q669),$R2:$R986,0)),\"\")","v":"Wfw21lc2-240-M  W Lucie Chelsea"}]
[26,"WFW21LC2","240","M  ","W Lucie Chelsea","Tan","8-40221-90303-8","C/O       ",8,null,{"v":77.5,"d":"$77.50"},{"v":155,"d":"$155.00"},{"v":154.95,"d":"$154.95"},0,"Wfw21lc2-240-M  W Lucie Chelsea"," ",{"$f":"--ISNUMBER(IFERROR(SEARCH(Orders!$E18,O670,1),\"\"))","v":1},{"$f":"IF(Q670=1,COUNTIF($Q$2:Q670,1),\"\")","v":669},{"$f":"IFERROR(INDEX($O2:$O986,MATCH(ROWS($Q$2:Q670),$R2:$R986,0)),\"\")","v":"Wfw21lc2-240-M  W Lucie Chelsea"}]
[26,"WFW21LC2","240","M  ","W Lucie Chelsea","Tan","8-40221-90304-5","C/O       ",8.5,null,{"v":77.5,"d":"$77.50"},{"v":155,"d":"$155.00"},{"v":154.95,"d":"$154.95"},0,"Wfw21lc2-240-M  W Lucie Chelsea"," ",{"$f":"--ISNUMBER(IFERROR(SEARCH(Orders!$E18,O671,1),\"\"))","v":1},{"$f":"IF(Q671=1,COUNTIF($Q$2:Q671,1),\"\")","v":670},{"$f":"IFERROR(INDEX($O2:$O986,MATCH(ROWS($Q$2:Q671),$R2:$R986,0)),\"\")","v":"Wfw21lc2-240-M  W Lucie Chelsea"}]
[26,"WFW21LC2","240","M  ","W Lucie Chelsea","Tan","8-40221-90305-2","C/O       ",9,null,{"v":77.5,"d":"$77.50"},{"v":155,"d":"$155.00"},{"v":154.95,"d":"$154.95"},0,"Wfw21lc2-240-M  W Lucie Chelsea"," ",{"$f":"--ISNUMBER(IFERROR(SEARCH(Orders!$E18,O672,1),\"\"))","v":1},{"$f":"IF(Q672=1,COUNTIF($Q$2:Q672,1),\"\")","v":671},{"$f":"IFERROR(INDEX($O2:$O986,MATCH(ROWS($Q$2:Q672),$R2:$R986,0)),\"\")","v":"Wfw21lc2-240-M  W Lucie Chelsea"}]
[26,"WFW21LC2","240","M  ","W Lucie Chelsea","Tan","8-40221-90306-9","C/O       ",9.5,null,{"v":77.5,"d":"$77.50"},{"v":155,"d":"$155.00"},{"v":154.95,"d":"$154.95"},0,"Wfw21lc2-240-M  W Lucie Chelsea"," ",{"$f":"--ISNUMBER(IFERROR(SEARCH(Orders!$E18,O673,1),\"\"))","v":1},{"$f":"IF(Q673=1,COUNTIF($Q$2:Q673,1),\"\")","v":672},{"$f":"IFERROR(INDEX($O2:$O986,MATCH(ROWS($Q$2:Q673),$R2:$R986,0)),\"\")","v":"Wfw21lc2-240-M  W Lucie Chelsea"}]
[26,"WFW21LC2","240","M  ","W Lucie Chelsea","Tan","8-40221-90307-6","C/O       ",10,null,{"v":77.5,"d":"$77.50"},{"v":155,"d":"$155.00"},{"v":154.95,"d":"$154.95"},0,"Wfw21lc2-240-M  W Lucie Chelsea"," ",{"$f":"--ISNUMBER(IFERROR(SEARCH(Orders!$E18,O674,1),\"\"))","v":1},{"$f":"IF(Q674=1,COUNTIF($Q$2:Q674,1),\"\")","v":673},{"$f":"IFERROR(INDEX($O2:$O986,MATCH(ROWS($Q$2:Q674),$R2:$R986,0)),\"\")","v":"Wfw21lc2-240-M  W Lucie Chelsea"}]
[26,"WFW21LC2","240","M  ","W Lucie Chelsea","Tan","8-40221-90308-3","C/O       ",10.5,null,{"v":77.5,"d":"$77.50"},{"v":155,"d":"$155.00"},{"v":154.95,"d":"$154.95"},0,"Wfw21lc2-240-M  W Lucie Chelsea"," ",{"$f":"--ISNUMBER(IFERROR(SEARCH(Orders!$E18,O675,1),\"\"))","v":1},{"$f":"IF(Q675=1,COUNTIF($Q$2:Q675,1),\"\")","v":674},{"$f":"IFERROR(INDEX($O2:$O986,MATCH(ROWS($Q$2:Q675),$R2:$R986,0)),\"\")","v":"Wfw21lc2-240-M  W Lucie Chelsea"}]
[26,"WFW21LC2","240","M  ","W Lucie Chelsea","Tan","8-40221-90309-0","C/O       ",11,null,{"v":77.5,"d":"$77.50"},{"v":155,"d":"$155.00"},{"v":154.95,"d":"$154.95"},0,"Wfw21lc2-240-M  W Lucie Chelsea"," ",{"$f":"--ISNUMBER(IFERROR(SEARCH(Orders!$E18,O676,1),\"\"))","v":1},{"$f":"IF(Q676=1,COUNTIF($Q$2:Q676,1),\"\")","v":675},{"$f":"IFERROR(INDEX($O2:$O986,MATCH(ROWS($Q$2:Q676),$R2:$R986,0)),\"\")","v":"Wfw21lc2-240-M  W Lucie Chelsea"}]
[18,"WSS21TW1","988","M  ","W Thatcher Low Wp","Tan/Black","8-40221-90035-8","C/O       ",6,null,{"v":75,"d":"$75.00"},{"v":150,"d":"$150.00"},{"v":149.95,"d":"$149.95"},0,"Wss21tw1-988-M  W Thatcher Low Wp"," ",{"$f":"--ISNUMBER(IFERROR(SEARCH(Orders!$E18,O677,1),\"\"))","v":1},{"$f":"IF(Q677=1,COUNTIF($Q$2:Q677,1),\"\")","v":676},{"$f":"IFERROR(INDEX($O2:$O986,MATCH(ROWS($Q$2:Q677),$R2:$R986,0)),\"\")","v":"Wss21tw1-988-M  W Thatcher Low Wp"}]
[18,"WSS21TW1","988","M  ","W Thatcher Low Wp","Tan/Black","8-40221-90036-5","C/O       ",6.5,null,{"v":75,"d":"$75.00"},{"v":150,"d":"$150.00"},{"v":149.95,"d":"$149.95"},0,"Wss21tw1-988-M  W Thatcher Low Wp"," ",{"$f":"--ISNUMBER(IFERROR(SEARCH(Orders!$E18,O678,1),\"\"))","v":1},{"$f":"IF(Q678=1,COUNTIF($Q$2:Q678,1),\"\")","v":677},{"$f":"IFERROR(INDEX($O2:$O986,MATCH(ROWS($Q$2:Q678),$R2:$R986,0)),\"\")","v":"Wss21tw1-988-M  W Thatcher Low Wp"}]
[18,"WSS21TW1","988","M  ","W Thatcher Low Wp","Tan/Black","8-40221-90037-2","C/O       ",7,null,{"v":75,"d":"$75.00"},{"v":150,"d":"$150.00"},{"v":149.95,"d":"$149.95"},0,"Wss21tw1-988-M  W Thatcher Low Wp"," ",{"$f":"--ISNUMBER(IFERROR(SEARCH(Orders!$E18,O679,1),\"\"))","v":1},{"$f":"IF(Q679=1,COUNTIF($Q$2:Q679,1),\"\")","v":678},{"$f":"IFERROR(INDEX($O2:$O986,MATCH(ROWS($Q$2:Q679),$R2:$R986,0)),\"\")","v":"Wss21tw1-988-M  W Thatcher Low Wp"}]
[18,"WSS21TW1","988","M  ","W Thatcher Low Wp","Tan/Black","8-40221-90038-9","C/O       ",7.5,null,{"v":75,"d":"$75.00"},{"v":150,"d":"$150.00"},{"v":149.95,"d":"$149.95"},0,"Wss21tw1-988-M  W Thatcher Low Wp"," ",{"$f":"--ISNUMBER(IFERROR(SEARCH(Orders!$E18,O680,1),\"\"))","v":1},{"$f":"IF(Q680=1,COUNTIF($Q$2:Q680,1),\"\")","v":679},{"$f":"IFERROR(INDEX($O2:$O986,MATCH(ROWS($Q$2:Q680),$R2:$R986,0)),\"\")","v":"Wss21tw1-988-M  W Thatcher Low Wp"}]
[18,"WSS21TW1","988","M  ","W Thatcher Low Wp","Tan/Black","8-40221-90039-6","C/O       ",8,null,{"v":75,"d":"$75.00"},{"v":150,"d":"$150.00"},{"v":149.95,"d":"$149.95"},0,"Wss21tw1-988-M  W Thatcher Low Wp"," ",{"$f":"--ISNUMBER(IFERROR(SEARCH(Orders!$E18,O681,1),\"\"))","v":1},{"$f":"IF(Q681=1,COUNTIF($Q$2:Q681,1),\"\")","v":680},{"$f":"IFERROR(INDEX($O2:$O986,MATCH(ROWS($Q$2:Q681),$R2:$R986,0)),\"\")","v":"Wss21tw1-988-M  W Thatcher Low Wp"}]
[18,"WSS21TW1","988","M  ","W Thatcher Low Wp","Tan/Black","8-40221-90040-2","C/O       ",8.5,null,{"v":75,"d":"$75.00"},{"v":150,"d":"$150.00"},{"v":149.95,"d":"$149.95"},0,"Wss21tw1-988-M  W Thatcher Low Wp"," ",{"$f":"--ISNUMBER(IFERROR(SEARCH(Orders!$E18,O682,1),\"\"))","v":1},{"$f":"IF(Q682=1,COUNTIF($Q$2:Q682,1),\"\")","v":681},{"$f":"IFERROR(INDEX($O2:$O986,MATCH(ROWS($Q$2:Q682),$R2:$R986,0)),\"\")","v":"Wss21tw1-988-M  W Thatcher Low Wp"}]
[18,"WSS21TW1","988","M  ","W Thatcher Low Wp","Tan/Black","8-40221-90041-9","C/O       ",9,null,{"v":75,"d":"$75.00"},{"v":150,"d":"$150.00"},{"v":149.95,"d":"$149.95"},0,"Wss21tw1-988-M  W Thatcher Low Wp"," ",{"$f":"--ISNUMBER(IFERROR(SEARCH(Orders!$E18,O683,1),\"\"))","v":1},{"$f":"IF(Q683=1,COUNTIF($Q$2:Q683,1),\"\")","v":682},{"$f":"IFERROR(INDEX($O2:$O986,MATCH(ROWS($Q$2:Q683),$R2:$R986,0)),\"\")","v":"Wss21tw1-988-M  W Thatcher Low Wp"}]
[18,"WSS21TW1","988","M  ","W Thatcher Low Wp","Tan/Black","8-40221-90042-6","C/O       ",9.5,null,{"v":75,"d":"$75.00"},{"v":150,"d":"$150.00"},{"v":149.95,"d":"$149.95"},0,"Wss21tw1-988-M  W Thatcher Low Wp"," ",{"$f":"--ISNUMBER(IFERROR(SEARCH(Orders!$E18,O684,1),\"\"))","v":1},{"$f":"IF(Q684=1,COUNTIF($Q$2:Q684,1),\"\")","v":683},{"$f":"IFERROR(INDEX($O2:$O986,MATCH(ROWS($Q$2:Q684),$R2:$R986,0)),\"\")","v":"Wss21tw1-988-M  W Thatcher Low Wp"}]
[18,"WSS21TW1","988","M  ","W Thatcher Low Wp","Tan/Black","8-40221-90043-3","C/O       ",10,null,{"v":75,"d":"$75.00"},{"v":150,"d":"$150.00"},{"v":149.95,"d":"$149.95"},0,"Wss21tw1-988-M  W Thatcher Low Wp"," ",{"$f":"--ISNUMBER(IFERROR(SEARCH(Orders!$E18,O685,1),\"\"))","v":1},{"$f":"IF(Q685=1,COUNTIF($Q$2:Q685,1),\"\")","v":684},{"$f":"IFERROR(INDEX($O2:$O986,MATCH(ROWS($Q$2:Q685),$R2:$R986,0)),\"\")","v":"Wss21tw1-988-M  W Thatcher Low Wp"}]
[18,"WSS21TW1","988","M  ","W Thatcher Low Wp","Tan/Black","8-40221-90044-0","C/O       ",10.5,null,{"v":75,"d":"$75.00"},{"v":150,"d":"$150.00"},{"v":149.95,"d":"$149.95"},0,"Wss21tw1-988-M  W Thatcher Low Wp"," ",{"$f":"--ISNUMBER(IFERROR(SEARCH(Orders!$E18,O686,1),\"\"))","v":1},{"$f":"IF(Q686=1,COUNTIF($Q$2:Q686,1),\"\")","v":685},{"$f":"IFERROR(INDEX($O2:$O986,MATCH(ROWS($Q$2:Q686),$R2:$R986,0)),\"\")","v":"Wss21tw1-988-M  W Thatcher Low Wp"}]
[18,"WSS21TW1","988","M  ","W Thatcher Low Wp","Tan/Black","8-40221-90045-7","C/O       ",11,null,{"v":75,"d":"$75.00"},{"v":150,"d":"$150.00"},{"v":149.95,"d":"$149.95"},0,"Wss21tw1-988-M  W Thatcher Low Wp"," ",{"$f":"--ISNUMBER(IFERROR(SEARCH(Orders!$E18,O687,1),\"\"))","v":1},{"$f":"IF(Q687=1,COUNTIF($Q$2:Q687,1),\"\")","v":686},{"$f":"IFERROR(INDEX($O2:$O986,MATCH(ROWS($Q$2:Q687),$R2:$R986,0)),\"\")","v":"Wss21tw1-988-M  W Thatcher Low Wp"}]
[18,"W80004  ","235","M  ","W Thatcher Low Wp","Toffee","0-21033-49641-7","          ",6,null,{"v":75,"d":"$75.00"},{"v":150,"d":"$150.00"},{"v":149.95,"d":"$149.95"},0,"W80004-235-M  W Thatcher Low Wp"," ",{"$f":"--ISNUMBER(IFERROR(SEARCH(Orders!$E18,O688,1),\"\"))","v":1},{"$f":"IF(Q688=1,COUNTIF($Q$2:Q688,1),\"\")","v":687},{"$f":"IFERROR(INDEX($O2:$O986,MATCH(ROWS($Q$2:Q688),$R2:$R986,0)),\"\")","v":"W80004-235-M  W Thatcher Low Wp"}]
[18,"W80004  ","235","M  ","W Thatcher Low Wp","Toffee","0-21033-49642-4","          ",6.5,null,{"v":75,"d":"$75.00"},{"v":150,"d":"$150.00"},{"v":149.95,"d":"$149.95"},0,"W80004-235-M  W Thatcher Low Wp"," ",{"$f":"--ISNUMBER(IFERROR(SEARCH(Orders!$E18,O689,1),\"\"))","v":1},{"$f":"IF(Q689=1,COUNTIF($Q$2:Q689,1),\"\")","v":688},{"$f":"IFERROR(INDEX($O2:$O986,MATCH(ROWS($Q$2:Q689),$R2:$R986,0)),\"\")","v":"W80004-235-M  W Thatcher Low Wp"}]
[18,"W80004  ","235","M  ","W Thatcher Low Wp","Toffee","0-21033-49643-1","          ",7,null,{"v":75,"d":"$75.00"},{"v":150,"d":"$150.00"},{"v":149.95,"d":"$149.95"},0,"W80004-235-M  W Thatcher Low Wp"," ",{"$f":"--ISNUMBER(IFERROR(SEARCH(Orders!$E18,O690,1),\"\"))","v":1},{"$f":"IF(Q690=1,COUNTIF($Q$2:Q690,1),\"\")","v":689},{"$f":"IFERROR(INDEX($O2:$O986,MATCH(ROWS($Q$2:Q690),$R2:$R986,0)),\"\")","v":"W80004-235-M  W Thatcher Low Wp"}]
[18,"W80004  ","235","M  ","W Thatcher Low Wp","Toffee","0-21033-49644-8","          ",7.5,null,{"v":75,"d":"$75.00"},{"v":150,"d":"$150.00"},{"v":149.95,"d":"$149.95"},0,"W80004-235-M  W Thatcher Low Wp"," ",{"$f":"--ISNUMBER(IFERROR(SEARCH(Orders!$E18,O691,1),\"\"))","v":1},{"$f":"IF(Q691=1,COUNTIF($Q$2:Q691,1),\"\")","v":690},{"$f":"IFERROR(INDEX($O2:$O986,MATCH(ROWS($Q$2:Q691),$R2:$R986,0)),\"\")","v":"W80004-235-M  W Thatcher Low Wp"}]
[18,"W80004  ","235","M  ","W Thatcher Low Wp","Toffee","0-21033-49645-5","          ",8,null,{"v":75,"d":"$75.00"},{"v":150,"d":"$150.00"},{"v":149.95,"d":"$149.95"},0,"W80004-235-M  W Thatcher Low Wp"," ",{"$f":"--ISNUMBER(IFERROR(SEARCH(Orders!$E18,O692,1),\"\"))","v":1},{"$f":"IF(Q692=1,COUNTIF($Q$2:Q692,1),\"\")","v":691},{"$f":"IFERROR(INDEX($O2:$O986,MATCH(ROWS($Q$2:Q692),$R2:$R986,0)),\"\")","v":"W80004-235-M  W Thatcher Low Wp"}]
[18,"W80004  ","235","M  ","W Thatcher Low Wp","Toffee","0-21033-49646-2","          ",8.5,null,{"v":75,"d":"$75.00"},{"v":150,"d":"$150.00"},{"v":149.95,"d":"$149.95"},0,"W80004-235-M  W Thatcher Low Wp"," ",{"$f":"--ISNUMBER(IFERROR(SEARCH(Orders!$E18,O693,1),\"\"))","v":1},{"$f":"IF(Q693=1,COUNTIF($Q$2:Q693,1),\"\")","v":692},{"$f":"IFERROR(INDEX($O2:$O986,MATCH(ROWS($Q$2:Q693),$R2:$R986,0)),\"\")","v":"W80004-235-M  W Thatcher Low Wp"}]
[18,"W80004  ","235","M  ","W Thatcher Low Wp","Toffee","0-21033-49647-9","          ",9,null,{"v":75,"d":"$75.00"},{"v":150,"d":"$150.00"},{"v":149.95,"d":"$149.95"},0,"W80004-235-M  W Thatcher Low Wp"," ",{"$f":"--ISNUMBER(IFERROR(SEARCH(Orders!$E18,O694,1),\"\"))","v":1},{"$f":"IF(Q694=1,COUNTIF($Q$2:Q694,1),\"\")","v":693},{"$f":"IFERROR(INDEX($O2:$O986,MATCH(ROWS($Q$2:Q694),$R2:$R986,0)),\"\")","v":"W80004-235-M  W Thatcher Low Wp"}]
[18,"W80004  ","235","M  ","W Thatcher Low Wp","Toffee","0-21033-49648-6","          ",9.5,null,{"v":75,"d":"$75.00"},{"v":150,"d":"$150.00"},{"v":149.95,"d":"$149.95"},0,"W80004-235-M  W Thatcher Low Wp"," ",{"$f":"--ISNUMBER(IFERROR(SEARCH(Orders!$E18,O695,1),\"\"))","v":1},{"$f":"IF(Q695=1,COUNTIF($Q$2:Q695,1),\"\")","v":694},{"$f":"IFERROR(INDEX($O2:$O986,MATCH(ROWS($Q$2:Q695),$R2:$R986,0)),\"\")","v":"W80004-235-M  W Thatcher Low Wp"}]
[18,"W80004  ","235","M  ","W Thatcher Low Wp","Toffee","0-21033-49649-3","          ",10,null,{"v":75,"d":"$75.00"},{"v":150,"d":"$150.00"},{"v":149.95,"d":"$149.95"},0,"W80004-235-M  W Thatcher Low Wp"," ",{"$f":"--ISNUMBER(IFERROR(SEARCH(Orders!$E18,O696,1),\"\"))","v":1},{"$f":"IF(Q696=1,COUNTIF($Q$2:Q696,1),\"\")","v":695},{"$f":"IFERROR(INDEX($O2:$O986,MATCH(ROWS($Q$2:Q696),$R2:$R986,0)),\"\")","v":"W80004-235-M  W Thatcher Low Wp"},{"v":149.95,"d":"$149.95"}]
[18,"W80004  ","235","M  ","W Thatcher Low Wp","Toffee","0-21033-49650-9","          ",10.5,null,{"v":75,"d":"$75.00"},{"v":150,"d":"$150.00"},{"v":149.95,"d":"$149.95"},0,"W80004-235-M  W Thatcher Low Wp"," ",{"$f":"--ISNUMBER(IFERROR(SEARCH(Orders!$E18,O697,1),\"\"))","v":1},{"$f":"IF(Q697=1,COUNTIF($Q$2:Q697,1),\"\")","v":696},{"$f":"IFERROR(INDEX($O2:$O986,MATCH(ROWS($Q$2:Q697),$R2:$R986,0)),\"\")","v":"W80004-235-M  W Thatcher Low Wp"}]
[18,"W80004  ","235","M  ","W Thatcher Low Wp","Toffee","0-21033-49651-6","          ",11,null,{"v":75,"d":"$75.00"},{"v":150,"d":"$150.00"},{"v":149.95,"d":"$149.95"},0,"W80004-235-M  W Thatcher Low Wp"," ",{"$f":"--ISNUMBER(IFERROR(SEARCH(Orders!$E18,O698,1),\"\"))","v":1},{"$f":"IF(Q698=1,COUNTIF($Q$2:Q698,1),\"\")","v":697},{"$f":"IFERROR(INDEX($O2:$O986,MATCH(ROWS($Q$2:Q698),$R2:$R986,0)),\"\")","v":"W80004-235-M  W Thatcher Low Wp"}]
[18,"W80004  ","260","M  ","W Thatcher Low Wp","Taupe","0-21033-49652-3","          ",6,null,{"v":75,"d":"$75.00"},{"v":150,"d":"$150.00"},{"v":149.95,"d":"$149.95"},0,"W80004-260-M  W Thatcher Low Wp"," ",{"$f":"--ISNUMBER(IFERROR(SEARCH(Orders!$E18,O699,1),\"\"))","v":1},{"$f":"IF(Q699=1,COUNTIF($Q$2:Q699,1),\"\")","v":698},{"$f":"IFERROR(INDEX($O2:$O986,MATCH(ROWS($Q$2:Q699),$R2:$R986,0)),\"\")","v":"W80004-260-M  W Thatcher Low Wp"}]
[18,"W80004  ","260","M  ","W Thatcher Low Wp","Taupe","0-21033-49653-0","          ",6.5,null,{"v":75,"d":"$75.00"},{"v":150,"d":"$150.00"},{"v":149.95,"d":"$149.95"},0,"W80004-260-M  W Thatcher Low Wp"," ",{"$f":"--ISNUMBER(IFERROR(SEARCH(Orders!$E18,O700,1),\"\"))","v":1},{"$f":"IF(Q700=1,COUNTIF($Q$2:Q700,1),\"\")","v":699},{"$f":"IFERROR(INDEX($O2:$O986,MATCH(ROWS($Q$2:Q700),$R2:$R986,0)),\"\")","v":"W80004-260-M  W Thatcher Low Wp"}]
[18,"W80004  ","260","M  ","W Thatcher Low Wp","Taupe","0-21033-49654-7","          ",7,null,{"v":75,"d":"$75.00"},{"v":150,"d":"$150.00"},{"v":149.95,"d":"$149.95"},0,"W80004-260-M  W Thatcher Low Wp"," ",{"$f":"--ISNUMBER(IFERROR(SEARCH(Orders!$E18,O701,1),\"\"))","v":1},{"$f":"IF(Q701=1,COUNTIF($Q$2:Q701,1),\"\")","v":700},{"$f":"IFERROR(INDEX($O2:$O986,MATCH(ROWS($Q$2:Q701),$R2:$R986,0)),\"\")","v":"W80004-260-M  W Thatcher Low Wp"}]
[18,"W80004  ","260","M  ","W Thatcher Low Wp","Taupe","0-21033-49655-4","          ",7.5,null,{"v":75,"d":"$75.00"},{"v":150,"d":"$150.00"},{"v":149.95,"d":"$149.95"},0,"W80004-260-M  W Thatcher Low Wp"," ",{"$f":"--ISNUMBER(IFERROR(SEARCH(Orders!$E18,O702,1),\"\"))","v":1},{"$f":"IF(Q702=1,COUNTIF($Q$2:Q702,1),\"\")","v":701},{"$f":"IFERROR(INDEX($O2:$O986,MATCH(ROWS($Q$2:Q702),$R2:$R986,0)),\"\")","v":"W80004-260-M  W Thatcher Low Wp"}]
[18,"W80004  ","260","M  ","W Thatcher Low Wp","Taupe","0-21033-49656-1","          ",8,null,{"v":75,"d":"$75.00"},{"v":150,"d":"$150.00"},{"v":149.95,"d":"$149.95"},0,"W80004-260-M  W Thatcher Low Wp"," ",{"$f":"--ISNUMBER(IFERROR(SEARCH(Orders!$E18,O703,1),\"\"))","v":1},{"$f":"IF(Q703=1,COUNTIF($Q$2:Q703,1),\"\")","v":702},{"$f":"IFERROR(INDEX($O2:$O986,MATCH(ROWS($Q$2:Q703),$R2:$R986,0)),\"\")","v":"W80004-260-M  W Thatcher Low Wp"}]
[18,"W80004  ","260","M  ","W Thatcher Low Wp","Taupe","0-21033-49657-8","          ",8.5,null,{"v":75,"d":"$75.00"},{"v":150,"d":"$150.00"},{"v":149.95,"d":"$149.95"},0,"W80004-260-M  W Thatcher Low Wp"," ",{"$f":"--ISNUMBER(IFERROR(SEARCH(Orders!$E18,O704,1),\"\"))","v":1},{"$f":"IF(Q704=1,COUNTIF($Q$2:Q704,1),\"\")","v":703},{"$f":"IFERROR(INDEX($O2:$O986,MATCH(ROWS($Q$2:Q704),$R2:$R986,0)),\"\")","v":"W80004-260-M  W Thatcher Low Wp"}]
[18,"W80004  ","260","M  ","W Thatcher Low Wp","Taupe","0-21033-49658-5","          ",9,null,{"v":75,"d":"$75.00"},{"v":150,"d":"$150.00"},{"v":149.95,"d":"$149.95"},0,"W80004-260-M  W Thatcher Low Wp"," ",{"$f":"--ISNUMBER(IFERROR(SEARCH(Orders!$E18,O705,1),\"\"))","v":1},{"$f":"IF(Q705=1,COUNTIF($Q$2:Q705,1),\"\")","v":704},{"$f":"IFERROR(INDEX($O2:$O986,MATCH(ROWS($Q$2:Q705),$R2:$R986,0)),\"\")","v":"W80004-260-M  W Thatcher Low Wp"}]
[18,"W80004  ","260","M  ","W Thatcher Low Wp","Taupe","0-21033-49659-2","          ",9.5,null,{"v":75,"d":"$75.00"},{"v":150,"d":"$150.00"},{"v":149.95,"d":"$149.95"},{"$f":"J706*K706","v":0},"W80004-260-M  W Thatcher Low Wp"," ",{"$f":"--ISNUMBER(IFERROR(SEARCH(Orders!$E18,O706,1),\"\"))","v":1},{"$f":"IF(Q706=1,COUNTIF($Q$2:Q706,1),\"\")","v":705},{"$f":"IFERROR(INDEX($O2:$O986,MATCH(ROWS($Q$2:Q706),$R2:$R986,0)),\"\")","v":"W80004-260-M  W Thatcher Low Wp"}]
[18,"W80004  ","260","M  ","W Thatcher Low Wp","Taupe","0-21033-49660-8","          ",10,null,{"v":75,"d":"$75.00"},{"v":150,"d":"$150.00"},{"v":149.95,"d":"$149.95"},0,"W80004-260-M  W Thatcher Low Wp"," ",{"$f":"--ISNUMBER(IFERROR(SEARCH(Orders!$E18,O707,1),\"\"))","v":1},{"$f":"IF(Q707=1,COUNTIF($Q$2:Q707,1),\"\")","v":706},{"$f":"IFERROR(INDEX($O2:$O986,MATCH(ROWS($Q$2:Q707),$R2:$R986,0)),\"\")","v":"W80004-260-M  W Thatcher Low Wp"}]
[18,"W80004  ","260","M  ","W Thatcher Low Wp","Taupe","0-21033-49661-5","          ",10.5,null,{"v":75,"d":"$75.00"},{"v":150,"d":"$150.00"},{"v":149.95,"d":"$149.95"},0,"W80004-260-M  W Thatcher Low Wp"," ",{"$f":"--ISNUMBER(IFERROR(SEARCH(Orders!$E18,O708,1),\"\"))","v":1},{"$f":"IF(Q708=1,COUNTIF($Q$2:Q708,1),\"\")","v":707},{"$f":"IFERROR(INDEX($O2:$O986,MATCH(ROWS($Q$2:Q708),$R2:$R986,0)),\"\")","v":"W80004-260-M  W Thatcher Low Wp"}]
[18,"W80004  ","260","M  ","W Thatcher Low Wp","Taupe","0-21033-49662-2","          ",11,null,{"v":75,"d":"$75.00"},{"v":150,"d":"$150.00"},{"v":149.95,"d":"$149.95"},0,"W80004-260-M  W Thatcher Low Wp"," ",{"$f":"--ISNUMBER(IFERROR(SEARCH(Orders!$E18,O709,1),\"\"))","v":1},{"$f":"IF(Q709=1,COUNTIF($Q$2:Q709,1),\"\")","v":708},{"$f":"IFERROR(INDEX($O2:$O986,MATCH(ROWS($Q$2:Q709),$R2:$R986,0)),\"\")","v":"W80004-260-M  W Thatcher Low Wp"}]
[0,"W80005  ","062","M  ","W Cascade Trail Low","Gray Multi","0-21033-48792-7","          ",6,null,{"v":65,"d":"$65.00"},{"v":130,"d":"$130.00"},{"v":129.95,"d":"$129.95"},0,"W80005-062-M  W Cascade Trail Low"," ",{"$f":"--ISNUMBER(IFERROR(SEARCH(Orders!$E18,O710,1),\"\"))","v":1},{"$f":"IF(Q710=1,COUNTIF($Q$2:Q710,1),\"\")","v":709},{"$f":"IFERROR(INDEX($O2:$O986,MATCH(ROWS($Q$2:Q710),$R2:$R986,0)),\"\")","v":"W80005-062-M  W Cascade Trail Low"}]
[0,"W80005  ","062","M  ","W Cascade Trail Low","Gray Multi","0-21033-48793-4","          ",6.5,null,{"v":65,"d":"$65.00"},{"v":130,"d":"$130.00"},{"v":129.95,"d":"$129.95"},0,"W80005-062-M  W Cascade Trail Low"," ",{"$f":"--ISNUMBER(IFERROR(SEARCH(Orders!$E18,O711,1),\"\"))","v":1},{"$f":"IF(Q711=1,COUNTIF($Q$2:Q711,1),\"\")","v":710},{"$f":"IFERROR(INDEX($O2:$O986,MATCH(ROWS($Q$2:Q711),$R2:$R986,0)),\"\")","v":"W80005-062-M  W Cascade Trail Low"}]
[0,"W80005  ","062","M  ","W Cascade Trail Low","Gray Multi","0-21033-48794-1","          ",7,null,{"v":65,"d":"$65.00"},{"v":130,"d":"$130.00"},{"v":129.95,"d":"$129.95"},0,"W80005-062-M  W Cascade Trail Low"," ",{"$f":"--ISNUMBER(IFERROR(SEARCH(Orders!$E18,O712,1),\"\"))","v":1},{"$f":"IF(Q712=1,COUNTIF($Q$2:Q712,1),\"\")","v":711},{"$f":"IFERROR(INDEX($O2:$O986,MATCH(ROWS($Q$2:Q712),$R2:$R986,0)),\"\")","v":"W80005-062-M  W Cascade Trail Low"}]
[0,"W80005  ","062","M  ","W Cascade Trail Low","Gray Multi","0-21033-48795-8","          ",7.5,null,{"v":65,"d":"$65.00"},{"v":130,"d":"$130.00"},{"v":129.95,"d":"$129.95"},0,"W80005-062-M  W Cascade Trail Low"," ",{"$f":"--ISNUMBER(IFERROR(SEARCH(Orders!$E18,O713,1),\"\"))","v":1},{"$f":"IF(Q713=1,COUNTIF($Q$2:Q713,1),\"\")","v":712},{"$f":"IFERROR(INDEX($O2:$O986,MATCH(ROWS($Q$2:Q713),$R2:$R986,0)),\"\")","v":"W80005-062-M  W Cascade Trail Low"}]
[0,"W80005  ","062","M  ","W Cascade Trail Low","Gray Multi","0-21033-48796-5","          ",8,null,{"v":65,"d":"$65.00"},{"v":130,"d":"$130.00"},{"v":129.95,"d":"$129.95"},0,"W80005-062-M  W Cascade Trail Low"," ",{"$f":"--ISNUMBER(IFERROR(SEARCH(Orders!$E18,O714,1),\"\"))","v":1},{"$f":"IF(Q714=1,COUNTIF($Q$2:Q714,1),\"\")","v":713},{"$f":"IFERROR(INDEX($O2:$O986,MATCH(ROWS($Q$2:Q714),$R2:$R986,0)),\"\")","v":"W80005-062-M  W Cascade Trail Low"}]
[0,"W80005  ","062","M  ","W Cascade Trail Low","Gray Multi","0-21033-48797-2","          ",8.5,null,{"v":65,"d":"$65.00"},{"v":130,"d":"$130.00"},{"v":129.95,"d":"$129.95"},0,"W80005-062-M  W Cascade Trail Low"," ",{"$f":"--ISNUMBER(IFERROR(SEARCH(Orders!$E18,O715,1),\"\"))","v":1},{"$f":"IF(Q715=1,COUNTIF($Q$2:Q715,1),\"\")","v":714},{"$f":"IFERROR(INDEX($O2:$O986,MATCH(ROWS($Q$2:Q715),$R2:$R986,0)),\"\")","v":"W80005-062-M  W Cascade Trail Low"}]
[0,"W80005  ","062","M  ","W Cascade Trail Low","Gray Multi","0-21033-48798-9","          ",9,null,{"v":65,"d":"$65.00"},{"v":130,"d":"$130.00"},{"v":129.95,"d":"$129.95"},0,"W80005-062-M  W Cascade Trail Low"," ",{"$f":"--ISNUMBER(IFERROR(SEARCH(Orders!$E18,O716,1),\"\"))","v":1},{"$f":"IF(Q716=1,COUNTIF($Q$2:Q716,1),\"\")","v":715},{"$f":"IFERROR(INDEX($O2:$O986,MATCH(ROWS($Q$2:Q716),$R2:$R986,0)),\"\")","v":"W80005-062-M  W Cascade Trail Low"}]
[0,"W80005  ","062","M  ","W Cascade Trail Low","Gray Multi","0-21033-48799-6","          ",9.5,null,{"v":65,"d":"$65.00"},{"v":130,"d":"$130.00"},{"v":129.95,"d":"$129.95"},0,"W80005-062-M  W Cascade Trail Low"," ",{"$f":"--ISNUMBER(IFERROR(SEARCH(Orders!$E18,O717,1),\"\"))","v":1},{"$f":"IF(Q717=1,COUNTIF($Q$2:Q717,1),\"\")","v":716},{"$f":"IFERROR(INDEX($O2:$O986,MATCH(ROWS($Q$2:Q717),$R2:$R986,0)),\"\")","v":"W80005-062-M  W Cascade Trail Low"}]
[0,"W80005  ","062","M  ","W Cascade Trail Low","Gray Multi","0-21033-48800-9","          ",10,null,{"v":65,"d":"$65.00"},{"v":130,"d":"$130.00"},{"v":129.95,"d":"$129.95"},0,"W80005-062-M  W Cascade Trail Low"," ",{"$f":"--ISNUMBER(IFERROR(SEARCH(Orders!$E18,O718,1),\"\"))","v":1},{"$f":"IF(Q718=1,COUNTIF($Q$2:Q718,1),\"\")","v":717},{"$f":"IFERROR(INDEX($O2:$O986,MATCH(ROWS($Q$2:Q718),$R2:$R986,0)),\"\")","v":"W80005-062-M  W Cascade Trail Low"}]
[0,"W80005  ","062","M  ","W Cascade Trail Low","Gray Multi","0-21033-48801-6","          ",10.5,null,{"v":65,"d":"$65.00"},{"v":130,"d":"$130.00"},{"v":129.95,"d":"$129.95"},0,"W80005-062-M  W Cascade Trail Low"," ",{"$f":"--ISNUMBER(IFERROR(SEARCH(Orders!$E18,O719,1),\"\"))","v":1},{"$f":"IF(Q719=1,COUNTIF($Q$2:Q719,1),\"\")","v":718},{"$f":"IFERROR(INDEX($O2:$O986,MATCH(ROWS($Q$2:Q719),$R2:$R986,0)),\"\")","v":"W80005-062-M  W Cascade Trail Low"}]
[0,"W80005  ","062","M  ","W Cascade Trail Low","Gray Multi","0-21033-48802-3","          ",11,null,{"v":65,"d":"$65.00"},{"v":130,"d":"$130.00"},{"v":129.95,"d":"$129.95"},0,"W80005-062-M  W Cascade Trail Low"," ",{"$f":"--ISNUMBER(IFERROR(SEARCH(Orders!$E18,O720,1),\"\"))","v":1},{"$f":"IF(Q720=1,COUNTIF($Q$2:Q720,1),\"\")","v":719},{"$f":"IFERROR(INDEX($O2:$O986,MATCH(ROWS($Q$2:Q720),$R2:$R986,0)),\"\")","v":"W80005-062-M  W Cascade Trail Low"}]
[0,"W80005  ","450","M  ","W Cascade Trail Low","Sky Blue","0-21033-48825-2","          ",6,null,{"v":65,"d":"$65.00"},{"v":130,"d":"$130.00"},{"v":129.95,"d":"$129.95"},0,"W80005-450-M  W Cascade Trail Low"," ",{"$f":"--ISNUMBER(IFERROR(SEARCH(Orders!$E18,O721,1),\"\"))","v":1},{"$f":"IF(Q721=1,COUNTIF($Q$2:Q721,1),\"\")","v":720},{"$f":"IFERROR(INDEX($O2:$O986,MATCH(ROWS($Q$2:Q721),$R2:$R986,0)),\"\")","v":"W80005-450-M  W Cascade Trail Low"}]
[0,"W80005  ","450","M  ","W Cascade Trail Low","Sky Blue","0-21033-48826-9","          ",6.5,null,{"v":65,"d":"$65.00"},{"v":130,"d":"$130.00"},{"v":129.95,"d":"$129.95"},0,"W80005-450-M  W Cascade Trail Low"," ",{"$f":"--ISNUMBER(IFERROR(SEARCH(Orders!$E18,O722,1),\"\"))","v":1},{"$f":"IF(Q722=1,COUNTIF($Q$2:Q722,1),\"\")","v":721},{"$f":"IFERROR(INDEX($O2:$O986,MATCH(ROWS($Q$2:Q722),$R2:$R986,0)),\"\")","v":"W80005-450-M  W Cascade Trail Low"}]
[0,"W80005  ","450","M  ","W Cascade Trail Low","Sky Blue","0-21033-48827-6","          ",7,null,{"v":65,"d":"$65.00"},{"v":130,"d":"$130.00"},{"v":129.95,"d":"$129.95"},0,"W80005-450-M  W Cascade Trail Low"," ",{"$f":"--ISNUMBER(IFERROR(SEARCH(Orders!$E18,O723,1),\"\"))","v":1},{"$f":"IF(Q723=1,COUNTIF($Q$2:Q723,1),\"\")","v":722},{"$f":"IFERROR(INDEX($O2:$O986,MATCH(ROWS($Q$2:Q723),$R2:$R986,0)),\"\")","v":"W80005-450-M  W Cascade Trail Low"}]
[0,"W80005  ","450","M  ","W Cascade Trail Low","Sky Blue","0-21033-48828-3","          ",7.5,null,{"v":65,"d":"$65.00"},{"v":130,"d":"$130.00"},{"v":129.95,"d":"$129.95"},0,"W80005-450-M  W Cascade Trail Low"," ",{"$f":"--ISNUMBER(IFERROR(SEARCH(Orders!$E18,O724,1),\"\"))","v":1},{"$f":"IF(Q724=1,COUNTIF($Q$2:Q724,1),\"\")","v":723},{"$f":"IFERROR(INDEX($O2:$O986,MATCH(ROWS($Q$2:Q724),$R2:$R986,0)),\"\")","v":"W80005-450-M  W Cascade Trail Low"}]
[0,"W80005  ","450","M  ","W Cascade Trail Low","Sky Blue","0-21033-48829-0","          ",8,null,{"v":65,"d":"$65.00"},{"v":130,"d":"$130.00"},{"v":129.95,"d":"$129.95"},0,"W80005-450-M  W Cascade Trail Low"," ",{"$f":"--ISNUMBER(IFERROR(SEARCH(Orders!$E18,O725,1),\"\"))","v":1},{"$f":"IF(Q725=1,COUNTIF($Q$2:Q725,1),\"\")","v":724},{"$f":"IFERROR(INDEX($O2:$O986,MATCH(ROWS($Q$2:Q725),$R2:$R986,0)),\"\")","v":"W80005-450-M  W Cascade Trail Low"}]
[0,"W80005  ","450","M  ","W Cascade Trail Low","Sky Blue","0-21033-48830-6","          ",8.5,null,{"v":65,"d":"$65.00"},{"v":130,"d":"$130.00"},{"v":129.95,"d":"$129.95"},0,"W80005-450-M  W Cascade Trail Low"," ",{"$f":"--ISNUMBER(IFERROR(SEARCH(Orders!$E18,O726,1),\"\"))","v":1},{"$f":"IF(Q726=1,COUNTIF($Q$2:Q726,1),\"\")","v":725},{"$f":"IFERROR(INDEX($O2:$O986,MATCH(ROWS($Q$2:Q726),$R2:$R986,0)),\"\")","v":"W80005-450-M  W Cascade Trail Low"}]
[0,"W80005  ","450","M  ","W Cascade Trail Low","Sky Blue","0-21033-48831-3","          ",9,null,{"v":65,"d":"$65.00"},{"v":130,"d":"$130.00"},{"v":129.95,"d":"$129.95"},0,"W80005-450-M  W Cascade Trail Low"," ",{"$f":"--ISNUMBER(IFERROR(SEARCH(Orders!$E18,O727,1),\"\"))","v":1},{"$f":"IF(Q727=1,COUNTIF($Q$2:Q727,1),\"\")","v":726},{"$f":"IFERROR(INDEX($O2:$O986,MATCH(ROWS($Q$2:Q727),$R2:$R986,0)),\"\")","v":"W80005-450-M  W Cascade Trail Low"}]
[0,"W80005  ","450","M  ","W Cascade Trail Low","Sky Blue","0-21033-48832-0","          ",9.5,null,{"v":65,"d":"$65.00"},{"v":130,"d":"$130.00"},{"v":129.95,"d":"$129.95"},0,"W80005-450-M  W Cascade Trail Low"," ",{"$f":"--ISNUMBER(IFERROR(SEARCH(Orders!$E18,O728,1),\"\"))","v":1},{"$f":"IF(Q728=1,COUNTIF($Q$2:Q728,1),\"\")","v":727},{"$f":"IFERROR(INDEX($O2:$O986,MATCH(ROWS($Q$2:Q728),$R2:$R986,0)),\"\")","v":"W80005-450-M  W Cascade Trail Low"}]
[0,"W80005  ","450","M  ","W Cascade Trail Low","Sky Blue","0-21033-48833-7","          ",10,null,{"v":65,"d":"$65.00"},{"v":130,"d":"$130.00"},{"v":129.95,"d":"$129.95"},0,"W80005-450-M  W Cascade Trail Low"," ",{"$f":"--ISNUMBER(IFERROR(SEARCH(Orders!$E18,O729,1),\"\"))","v":1},{"$f":"IF(Q729=1,COUNTIF($Q$2:Q729,1),\"\")","v":728},{"$f":"IFERROR(INDEX($O2:$O986,MATCH(ROWS($Q$2:Q729),$R2:$R986,0)),\"\")","v":"W80005-450-M  W Cascade Trail Low"}]
[0,"W80005  ","450","M  ","W Cascade Trail Low","Sky Blue","0-21033-48834-4","          ",10.5,null,{"v":65,"d":"$65.00"},{"v":130,"d":"$130.00"},{"v":129.95,"d":"$129.95"},0,"W80005-450-M  W Cascade Trail Low"," ",{"$f":"--ISNUMBER(IFERROR(SEARCH(Orders!$E18,O730,1),\"\"))","v":1},{"$f":"IF(Q730=1,COUNTIF($Q$2:Q730,1),\"\")","v":729},{"$f":"IFERROR(INDEX($O2:$O986,MATCH(ROWS($Q$2:Q730),$R2:$R986,0)),\"\")","v":"W80005-450-M  W Cascade Trail Low"}]
[0,"W80005  ","450","M  ","W Cascade Trail Low","Sky Blue","0-21033-48835-1","          ",11,null,{"v":65,"d":"$65.00"},{"v":130,"d":"$130.00"},{"v":129.95,"d":"$129.95"},0,"W80005-450-M  W Cascade Trail Low"," ",{"$f":"--ISNUMBER(IFERROR(SEARCH(Orders!$E18,O731,1),\"\"))","v":1},{"$f":"IF(Q731=1,COUNTIF($Q$2:Q731,1),\"\")","v":730},{"$f":"IFERROR(INDEX($O2:$O986,MATCH(ROWS($Q$2:Q731),$R2:$R986,0)),\"\")","v":"W80005-450-M  W Cascade Trail Low"}]
[19,"W80006  ","240","M  ","W Thatcher Low","Tan","0-21033-48836-8","          ",6,null,{"v":60,"d":"$60.00"},{"v":120,"d":"$120.00"},{"v":119.95,"d":"$119.95"},0,"W80006-240-M  W Thatcher Low"," ",{"$f":"--ISNUMBER(IFERROR(SEARCH(Orders!$E18,O732,1),\"\"))","v":1},{"$f":"IF(Q732=1,COUNTIF($Q$2:Q732,1),\"\")","v":731},{"$f":"IFERROR(INDEX($O2:$O986,MATCH(ROWS($Q$2:Q732),$R2:$R986,0)),\"\")","v":"W80006-240-M  W Thatcher Low"}]
[19,"W80006  ","240","M  ","W Thatcher Low","Tan","0-21033-48837-5","          ",6.5,null,{"v":60,"d":"$60.00"},{"v":120,"d":"$120.00"},{"v":119.95,"d":"$119.95"},0,"W80006-240-M  W Thatcher Low"," ",{"$f":"--ISNUMBER(IFERROR(SEARCH(Orders!$E18,O733,1),\"\"))","v":1},{"$f":"IF(Q733=1,COUNTIF($Q$2:Q733,1),\"\")","v":732},{"$f":"IFERROR(INDEX($O2:$O986,MATCH(ROWS($Q$2:Q733),$R2:$R986,0)),\"\")","v":"W80006-240-M  W Thatcher Low"}]
[19,"W80006  ","240","M  ","W Thatcher Low","Tan","0-21033-48838-2","          ",7,null,{"v":60,"d":"$60.00"},{"v":120,"d":"$120.00"},{"v":119.95,"d":"$119.95"},0,"W80006-240-M  W Thatcher Low"," ",{"$f":"--ISNUMBER(IFERROR(SEARCH(Orders!$E18,O734,1),\"\"))","v":1},{"$f":"IF(Q734=1,COUNTIF($Q$2:Q734,1),\"\")","v":733},{"$f":"IFERROR(INDEX($O2:$O986,MATCH(ROWS($Q$2:Q734),$R2:$R986,0)),\"\")","v":"W80006-240-M  W Thatcher Low"}]
[19,"W80006  ","240","M  ","W Thatcher Low","Tan","0-21033-48839-9","          ",7.5,null,{"v":60,"d":"$60.00"},{"v":120,"d":"$120.00"},{"v":119.95,"d":"$119.95"},0,"W80006-240-M  W Thatcher Low"," ",{"$f":"--ISNUMBER(IFERROR(SEARCH(Orders!$E18,O735,1),\"\"))","v":1},{"$f":"IF(Q735=1,COUNTIF($Q$2:Q735,1),\"\")","v":734},{"$f":"IFERROR(INDEX($O2:$O986,MATCH(ROWS($Q$2:Q735),$R2:$R986,0)),\"\")","v":"W80006-240-M  W Thatcher Low"}]
[19,"W80006  ","240","M  ","W Thatcher Low","Tan","0-21033-48840-5","          ",8,null,{"v":60,"d":"$60.00"},{"v":120,"d":"$120.00"},{"v":119.95,"d":"$119.95"},0,"W80006-240-M  W Thatcher Low"," ",{"$f":"--ISNUMBER(IFERROR(SEARCH(Orders!$E18,O736,1),\"\"))","v":1},{"$f":"IF(Q736=1,COUNTIF($Q$2:Q736,1),\"\")","v":735},{"$f":"IFERROR(INDEX($O2:$O986,MATCH(ROWS($Q$2:Q736),$R2:$R986,0)),\"\")","v":"W80006-240-M  W Thatcher Low"}]
[19,"W80006  ","240","M  ","W Thatcher Low","Tan","0-21033-48841-2","          ",8.5,null,{"v":60,"d":"$60.00"},{"v":120,"d":"$120.00"},{"v":119.95,"d":"$119.95"},0,"W80006-240-M  W Thatcher Low"," ",{"$f":"--ISNUMBER(IFERROR(SEARCH(Orders!$E18,O737,1),\"\"))","v":1},{"$f":"IF(Q737=1,COUNTIF($Q$2:Q737,1),\"\")","v":736},{"$f":"IFERROR(INDEX($O2:$O986,MATCH(ROWS($Q$2:Q737),$R2:$R986,0)),\"\")","v":"W80006-240-M  W Thatcher Low"}]
[19,"W80006  ","240","M  ","W Thatcher Low","Tan","0-21033-48842-9","          ",9,null,{"v":60,"d":"$60.00"},{"v":120,"d":"$120.00"},{"v":119.95,"d":"$119.95"},0,"W80006-240-M  W Thatcher Low"," ",{"$f":"--ISNUMBER(IFERROR(SEARCH(Orders!$E18,O738,1),\"\"))","v":1},{"$f":"IF(Q738=1,COUNTIF($Q$2:Q738,1),\"\")","v":737},{"$f":"IFERROR(INDEX($O2:$O986,MATCH(ROWS($Q$2:Q738),$R2:$R986,0)),\"\")","v":"W80006-240-M  W Thatcher Low"}]
[19,"W80006  ","240","M  ","W Thatcher Low","Tan","0-21033-48843-6","          ",9.5,null,{"v":60,"d":"$60.00"},{"v":120,"d":"$120.00"},{"v":119.95,"d":"$119.95"},0,"W80006-240-M  W Thatcher Low"," ",{"$f":"--ISNUMBER(IFERROR(SEARCH(Orders!$E18,O739,1),\"\"))","v":1},{"$f":"IF(Q739=1,COUNTIF($Q$2:Q739,1),\"\")","v":738},{"$f":"IFERROR(INDEX($O2:$O986,MATCH(ROWS($Q$2:Q739),$R2:$R986,0)),\"\")","v":"W80006-240-M  W Thatcher Low"}]
[19,"W80006  ","240","M  ","W Thatcher Low","Tan","0-21033-48844-3","          ",10,null,{"v":60,"d":"$60.00"},{"v":120,"d":"$120.00"},{"v":119.95,"d":"$119.95"},0,"W80006-240-M  W Thatcher Low"," ",{"$f":"--ISNUMBER(IFERROR(SEARCH(Orders!$E18,O740,1),\"\"))","v":1},{"$f":"IF(Q740=1,COUNTIF($Q$2:Q740,1),\"\")","v":739},{"$f":"IFERROR(INDEX($O2:$O986,MATCH(ROWS($Q$2:Q740),$R2:$R986,0)),\"\")","v":"W80006-240-M  W Thatcher Low"}]
[19,"W80006  ","240","M  ","W Thatcher Low","Tan","0-21033-48845-0","          ",10.5,null,{"v":60,"d":"$60.00"},{"v":120,"d":"$120.00"},{"v":119.95,"d":"$119.95"},0,"W80006-240-M  W Thatcher Low"," ",{"$f":"--ISNUMBER(IFERROR(SEARCH(Orders!$E18,O741,1),\"\"))","v":1},{"$f":"IF(Q741=1,COUNTIF($Q$2:Q741,1),\"\")","v":740},{"$f":"IFERROR(INDEX($O2:$O986,MATCH(ROWS($Q$2:Q741),$R2:$R986,0)),\"\")","v":"W80006-240-M  W Thatcher Low"}]
[19,"W80006  ","240","M  ","W Thatcher Low","Tan","0-21033-48846-7","          ",11,null,{"v":60,"d":"$60.00"},{"v":120,"d":"$120.00"},{"v":119.95,"d":"$119.95"},0,"W80006-240-M  W Thatcher Low"," ",{"$f":"--ISNUMBER(IFERROR(SEARCH(Orders!$E18,O742,1),\"\"))","v":1},{"$f":"IF(Q742=1,COUNTIF($Q$2:Q742,1),\"\")","v":741},{"$f":"IFERROR(INDEX($O2:$O986,MATCH(ROWS($Q$2:Q742),$R2:$R986,0)),\"\")","v":"W80006-240-M  W Thatcher Low"}]
[19,"W80006  ","261","M  ","W Thatcher Low","Taupe Mult","0-21033-49674-5","          ",6,null,{"v":60,"d":"$60.00"},{"v":120,"d":"$120.00"},{"v":119.95,"d":"$119.95"},0,"W80006-261-M  W Thatcher Low"," ",{"$f":"--ISNUMBER(IFERROR(SEARCH(Orders!$E18,O743,1),\"\"))","v":1},{"$f":"IF(Q743=1,COUNTIF($Q$2:Q743,1),\"\")","v":742},{"$f":"IFERROR(INDEX($O2:$O986,MATCH(ROWS($Q$2:Q743),$R2:$R986,0)),\"\")","v":"W80006-261-M  W Thatcher Low"}]
[19,"W80006  ","261","M  ","W Thatcher Low","Taupe Mult","0-21033-49675-2","          ",6.5,null,{"v":60,"d":"$60.00"},{"v":120,"d":"$120.00"},{"v":119.95,"d":"$119.95"},0,"W80006-261-M  W Thatcher Low"," ",{"$f":"--ISNUMBER(IFERROR(SEARCH(Orders!$E18,O744,1),\"\"))","v":1},{"$f":"IF(Q744=1,COUNTIF($Q$2:Q744,1),\"\")","v":743},{"$f":"IFERROR(INDEX($O2:$O986,MATCH(ROWS($Q$2:Q744),$R2:$R986,0)),\"\")","v":"W80006-261-M  W Thatcher Low"}]
[19,"W80006  ","261","M  ","W Thatcher Low","Taupe Mult","0-21033-49676-9","          ",7,null,{"v":60,"d":"$60.00"},{"v":120,"d":"$120.00"},{"v":119.95,"d":"$119.95"},0,"W80006-261-M  W Thatcher Low"," ",{"$f":"--ISNUMBER(IFERROR(SEARCH(Orders!$E18,O745,1),\"\"))","v":1},{"$f":"IF(Q745=1,COUNTIF($Q$2:Q745,1),\"\")","v":744},{"$f":"IFERROR(INDEX($O2:$O986,MATCH(ROWS($Q$2:Q745),$R2:$R986,0)),\"\")","v":"W80006-261-M  W Thatcher Low"}]
[19,"W80006  ","261","M  ","W Thatcher Low","Taupe Mult","0-21033-49677-6","          ",7.5,null,{"v":60,"d":"$60.00"},{"v":120,"d":"$120.00"},{"v":119.95,"d":"$119.95"},0,"W80006-261-M  W Thatcher Low"," ",{"$f":"--ISNUMBER(IFERROR(SEARCH(Orders!$E18,O746,1),\"\"))","v":1},{"$f":"IF(Q746=1,COUNTIF($Q$2:Q746,1),\"\")","v":745},{"$f":"IFERROR(INDEX($O2:$O986,MATCH(ROWS($Q$2:Q746),$R2:$R986,0)),\"\")","v":"W80006-261-M  W Thatcher Low"}]
[19,"W80006  ","261","M  ","W Thatcher Low","Taupe Mult","0-21033-49678-3","          ",8,null,{"v":60,"d":"$60.00"},{"v":120,"d":"$120.00"},{"v":119.95,"d":"$119.95"},0,"W80006-261-M  W Thatcher Low"," ",{"$f":"--ISNUMBER(IFERROR(SEARCH(Orders!$E18,O747,1),\"\"))","v":1},{"$f":"IF(Q747=1,COUNTIF($Q$2:Q747,1),\"\")","v":746},{"$f":"IFERROR(INDEX($O2:$O986,MATCH(ROWS($Q$2:Q747),$R2:$R986,0)),\"\")","v":"W80006-261-M  W Thatcher Low"}]
[19,"W80006  ","261","M  ","W Thatcher Low","Taupe Mult","0-21033-49679-0","          ",8.5,null,{"v":60,"d":"$60.00"},{"v":120,"d":"$120.00"},{"v":119.95,"d":"$119.95"},0,"W80006-261-M  W Thatcher Low"," ",{"$f":"--ISNUMBER(IFERROR(SEARCH(Orders!$E18,O748,1),\"\"))","v":1},{"$f":"IF(Q748=1,COUNTIF($Q$2:Q748,1),\"\")","v":747},{"$f":"IFERROR(INDEX($O2:$O986,MATCH(ROWS($Q$2:Q748),$R2:$R986,0)),\"\")","v":"W80006-261-M  W Thatcher Low"}]
[19,"W80006  ","261","M  ","W Thatcher Low","Taupe Mult","0-21033-49680-6","          ",9,null,{"v":60,"d":"$60.00"},{"v":120,"d":"$120.00"},{"v":119.95,"d":"$119.95"},0,"W80006-261-M  W Thatcher Low"," ",{"$f":"--ISNUMBER(IFERROR(SEARCH(Orders!$E18,O749,1),\"\"))","v":1},{"$f":"IF(Q749=1,COUNTIF($Q$2:Q749,1),\"\")","v":748},{"$f":"IFERROR(INDEX($O2:$O986,MATCH(ROWS($Q$2:Q749),$R2:$R986,0)),\"\")","v":"W80006-261-M  W Thatcher Low"}]
[19,"W80006  ","261","M  ","W Thatcher Low","Taupe Mult","0-21033-49681-3","          ",9.5,null,{"v":60,"d":"$60.00"},{"v":120,"d":"$120.00"},{"v":119.95,"d":"$119.95"},0,"W80006-261-M  W Thatcher Low"," ",{"$f":"--ISNUMBER(IFERROR(SEARCH(Orders!$E18,O750,1),\"\"))","v":1},{"$f":"IF(Q750=1,COUNTIF($Q$2:Q750,1),\"\")","v":749},{"$f":"IFERROR(INDEX($O2:$O986,MATCH(ROWS($Q$2:Q750),$R2:$R986,0)),\"\")","v":"W80006-261-M  W Thatcher Low"}]
[19,"W80006  ","261","M  ","W Thatcher Low","Taupe Mult","0-21033-49682-0","          ",10,null,{"v":60,"d":"$60.00"},{"v":120,"d":"$120.00"},{"v":119.95,"d":"$119.95"},0,"W80006-261-M  W Thatcher Low"," ",{"$f":"--ISNUMBER(IFERROR(SEARCH(Orders!$E18,O751,1),\"\"))","v":1},{"$f":"IF(Q751=1,COUNTIF($Q$2:Q751,1),\"\")","v":750},{"$f":"IFERROR(INDEX($O2:$O986,MATCH(ROWS($Q$2:Q751),$R2:$R986,0)),\"\")","v":"W80006-261-M  W Thatcher Low"}]
[19,"W80006  ","261","M  ","W Thatcher Low","Taupe Mult","0-21033-49683-7","          ",10.5,null,{"v":60,"d":"$60.00"},{"v":120,"d":"$120.00"},{"v":119.95,"d":"$119.95"},0,"W80006-261-M  W Thatcher Low"," ",{"$f":"--ISNUMBER(IFERROR(SEARCH(Orders!$E18,O752,1),\"\"))","v":1},{"$f":"IF(Q752=1,COUNTIF($Q$2:Q752,1),\"\")","v":751},{"$f":"IFERROR(INDEX($O2:$O986,MATCH(ROWS($Q$2:Q752),$R2:$R986,0)),\"\")","v":"W80006-261-M  W Thatcher Low"}]
[19,"W80006  ","261","M  ","W Thatcher Low","Taupe Mult","0-21033-49684-4","          ",11,null,{"v":60,"d":"$60.00"},{"v":120,"d":"$120.00"},{"v":119.95,"d":"$119.95"},0,"W80006-261-M  W Thatcher Low"," ",{"$f":"--ISNUMBER(IFERROR(SEARCH(Orders!$E18,O753,1),\"\"))","v":1},{"$f":"IF(Q753=1,COUNTIF($Q$2:Q753,1),\"\")","v":752},{"$f":"IFERROR(INDEX($O2:$O986,MATCH(ROWS($Q$2:Q753),$R2:$R986,0)),\"\")","v":"W80006-261-M  W Thatcher Low"}]
[24,"W80017  ","001","M  ","W Sofia Lace","Black","0-21033-49360-7","          ",6,null,{"v":87.5,"d":"$87.50"},{"v":175,"d":"$175.00"},{"v":174.95,"d":"$174.95"},0,"W80017-001-M  W Sofia Lace"," ",{"$f":"--ISNUMBER(IFERROR(SEARCH(Orders!$E18,O754,1),\"\"))","v":1},{"$f":"IF(Q754=1,COUNTIF($Q$2:Q754,1),\"\")","v":753},{"$f":"IFERROR(INDEX($O2:$O986,MATCH(ROWS($Q$2:Q754),$R2:$R986,0)),\"\")","v":"W80017-001-M  W Sofia Lace"}]
[24,"W80017  ","001","M  ","W Sofia Lace","Black","0-21033-49361-4","          ",6.5,null,{"v":87.5,"d":"$87.50"},{"v":175,"d":"$175.00"},{"v":174.95,"d":"$174.95"},0,"W80017-001-M  W Sofia Lace"," ",{"$f":"--ISNUMBER(IFERROR(SEARCH(Orders!$E18,O755,1),\"\"))","v":1},{"$f":"IF(Q755=1,COUNTIF($Q$2:Q755,1),\"\")","v":754},{"$f":"IFERROR(INDEX($O2:$O986,MATCH(ROWS($Q$2:Q755),$R2:$R986,0)),\"\")","v":"W80017-001-M  W Sofia Lace"}]
[24,"W80017  ","001","M  ","W Sofia Lace","Black","0-21033-49362-1","          ",7,null,{"v":87.5,"d":"$87.50"},{"v":175,"d":"$175.00"},{"v":174.95,"d":"$174.95"},0,"W80017-001-M  W Sofia Lace"," ",{"$f":"--ISNUMBER(IFERROR(SEARCH(Orders!$E18,O756,1),\"\"))","v":1},{"$f":"IF(Q756=1,COUNTIF($Q$2:Q756,1),\"\")","v":755},{"$f":"IFERROR(INDEX($O2:$O986,MATCH(ROWS($Q$2:Q756),$R2:$R986,0)),\"\")","v":"W80017-001-M  W Sofia Lace"}]
[24,"W80017  ","001","M  ","W Sofia Lace","Black","0-21033-49363-8","          ",7.5,null,{"v":87.5,"d":"$87.50"},{"v":175,"d":"$175.00"},{"v":174.95,"d":"$174.95"},0,"W80017-001-M  W Sofia Lace"," ",{"$f":"--ISNUMBER(IFERROR(SEARCH(Orders!$E18,O757,1),\"\"))","v":1},{"$f":"IF(Q757=1,COUNTIF($Q$2:Q757,1),\"\")","v":756},{"$f":"IFERROR(INDEX($O2:$O986,MATCH(ROWS($Q$2:Q757),$R2:$R986,0)),\"\")","v":"W80017-001-M  W Sofia Lace"}]
[24,"W80017  ","001","M  ","W Sofia Lace","Black","0-21033-49364-5","          ",8,null,{"v":87.5,"d":"$87.50"},{"v":175,"d":"$175.00"},{"v":174.95,"d":"$174.95"},0,"W80017-001-M  W Sofia Lace"," ",{"$f":"--ISNUMBER(IFERROR(SEARCH(Orders!$E18,O758,1),\"\"))","v":1},{"$f":"IF(Q758=1,COUNTIF($Q$2:Q758,1),\"\")","v":757},{"$f":"IFERROR(INDEX($O2:$O986,MATCH(ROWS($Q$2:Q758),$R2:$R986,0)),\"\")","v":"W80017-001-M  W Sofia Lace"}]
[24,"W80017  ","001","M  ","W Sofia Lace","Black","0-21033-49365-2","          ",8.5,null,{"v":87.5,"d":"$87.50"},{"v":175,"d":"$175.00"},{"v":174.95,"d":"$174.95"},0,"W80017-001-M  W Sofia Lace"," ",{"$f":"--ISNUMBER(IFERROR(SEARCH(Orders!$E18,O759,1),\"\"))","v":1},{"$f":"IF(Q759=1,COUNTIF($Q$2:Q759,1),\"\")","v":758},{"$f":"IFERROR(INDEX($O2:$O986,MATCH(ROWS($Q$2:Q759),$R2:$R986,0)),\"\")","v":"W80017-001-M  W Sofia Lace"}]
[24,"W80017  ","001","M  ","W Sofia Lace","Black","0-21033-49366-9","          ",9,null,{"v":87.5,"d":"$87.50"},{"v":175,"d":"$175.00"},{"v":174.95,"d":"$174.95"},0,"W80017-001-M  W Sofia Lace"," ",{"$f":"--ISNUMBER(IFERROR(SEARCH(Orders!$E18,O760,1),\"\"))","v":1},{"$f":"IF(Q760=1,COUNTIF($Q$2:Q760,1),\"\")","v":759},{"$f":"IFERROR(INDEX($O2:$O986,MATCH(ROWS($Q$2:Q760),$R2:$R986,0)),\"\")","v":"W80017-001-M  W Sofia Lace"}]
[24,"W80017  ","001","M  ","W Sofia Lace","Black","0-21033-49367-6","          ",9.5,null,{"v":87.5,"d":"$87.50"},{"v":175,"d":"$175.00"},{"v":174.95,"d":"$174.95"},0,"W80017-001-M  W Sofia Lace"," ",{"$f":"--ISNUMBER(IFERROR(SEARCH(Orders!$E18,O761,1),\"\"))","v":1},{"$f":"IF(Q761=1,COUNTIF($Q$2:Q761,1),\"\")","v":760},{"$f":"IFERROR(INDEX($O2:$O986,MATCH(ROWS($Q$2:Q761),$R2:$R986,0)),\"\")","v":"W80017-001-M  W Sofia Lace"}]
[24,"W80017  ","001","M  ","W Sofia Lace","Black","0-21033-49368-3","          ",10,null,{"v":87.5,"d":"$87.50"},{"v":175,"d":"$175.00"},{"v":174.95,"d":"$174.95"},0,"W80017-001-M  W Sofia Lace"," ",{"$f":"--ISNUMBER(IFERROR(SEARCH(Orders!$E18,O762,1),\"\"))","v":1},{"$f":"IF(Q762=1,COUNTIF($Q$2:Q762,1),\"\")","v":761},{"$f":"IFERROR(INDEX($O2:$O986,MATCH(ROWS($Q$2:Q762),$R2:$R986,0)),\"\")","v":"W80017-001-M  W Sofia Lace"}]
[24,"W80017  ","001","M  ","W Sofia Lace","Black","0-21033-49369-0","          ",10.5,null,{"v":87.5,"d":"$87.50"},{"v":175,"d":"$175.00"},{"v":174.95,"d":"$174.95"},0,"W80017-001-M  W Sofia Lace"," ",{"$f":"--ISNUMBER(IFERROR(SEARCH(Orders!$E18,O763,1),\"\"))","v":1},{"$f":"IF(Q763=1,COUNTIF($Q$2:Q763,1),\"\")","v":762},{"$f":"IFERROR(INDEX($O2:$O986,MATCH(ROWS($Q$2:Q763),$R2:$R986,0)),\"\")","v":"W80017-001-M  W Sofia Lace"}]
[24,"W80017  ","001","M  ","W Sofia Lace","Black","0-21033-49370-6","          ",11,null,{"v":87.5,"d":"$87.50"},{"v":175,"d":"$175.00"},{"v":174.95,"d":"$174.95"},0,"W80017-001-M  W Sofia Lace"," ",{"$f":"--ISNUMBER(IFERROR(SEARCH(Orders!$E18,O764,1),\"\"))","v":1},{"$f":"IF(Q764=1,COUNTIF($Q$2:Q764,1),\"\")","v":763},{"$f":"IFERROR(INDEX($O2:$O986,MATCH(ROWS($Q$2:Q764),$R2:$R986,0)),\"\")","v":"W80017-001-M  W Sofia Lace"}]
[24,"W80017  ","235","M  ","W Sofia Lace","Toffee","0-21033-49371-3","          ",6,null,{"v":87.5,"d":"$87.50"},{"v":175,"d":"$175.00"},{"v":174.95,"d":"$174.95"},0,"W80017-235-M  W Sofia Lace"," ",{"$f":"--ISNUMBER(IFERROR(SEARCH(Orders!$E18,O765,1),\"\"))","v":1},{"$f":"IF(Q765=1,COUNTIF($Q$2:Q765,1),\"\")","v":764},{"$f":"IFERROR(INDEX($O2:$O986,MATCH(ROWS($Q$2:Q765),$R2:$R986,0)),\"\")","v":"W80017-235-M  W Sofia Lace"}]
[24,"W80017  ","235","M  ","W Sofia Lace","Toffee","0-21033-49372-0","          ",6.5,null,{"v":87.5,"d":"$87.50"},{"v":175,"d":"$175.00"},{"v":174.95,"d":"$174.95"},0,"W80017-235-M  W Sofia Lace"," ",{"$f":"--ISNUMBER(IFERROR(SEARCH(Orders!$E18,O766,1),\"\"))","v":1},{"$f":"IF(Q766=1,COUNTIF($Q$2:Q766,1),\"\")","v":765},{"$f":"IFERROR(INDEX($O2:$O986,MATCH(ROWS($Q$2:Q766),$R2:$R986,0)),\"\")","v":"W80017-235-M  W Sofia Lace"}]
[24,"W80017  ","235","M  ","W Sofia Lace","Toffee","0-21033-49373-7","          ",7,null,{"v":87.5,"d":"$87.50"},{"v":175,"d":"$175.00"},{"v":174.95,"d":"$174.95"},0,"W80017-235-M  W Sofia Lace"," ",{"$f":"--ISNUMBER(IFERROR(SEARCH(Orders!$E18,O767,1),\"\"))","v":1},{"$f":"IF(Q767=1,COUNTIF($Q$2:Q767,1),\"\")","v":766},{"$f":"IFERROR(INDEX($O2:$O986,MATCH(ROWS($Q$2:Q767),$R2:$R986,0)),\"\")","v":"W80017-235-M  W Sofia Lace"}]
[24,"W80017  ","235","M  ","W Sofia Lace","Toffee","0-21033-49374-4","          ",7.5,null,{"v":87.5,"d":"$87.50"},{"v":175,"d":"$175.00"},{"v":174.95,"d":"$174.95"},0,"W80017-235-M  W Sofia Lace"," ",{"$f":"--ISNUMBER(IFERROR(SEARCH(Orders!$E18,O768,1),\"\"))","v":1},{"$f":"IF(Q768=1,COUNTIF($Q$2:Q768,1),\"\")","v":767},{"$f":"IFERROR(INDEX($O2:$O986,MATCH(ROWS($Q$2:Q768),$R2:$R986,0)),\"\")","v":"W80017-235-M  W Sofia Lace"}]
[24,"W80017  ","235","M  ","W Sofia Lace","Toffee","0-21033-49375-1","          ",8,null,{"v":87.5,"d":"$87.50"},{"v":175,"d":"$175.00"},{"v":174.95,"d":"$174.95"},0,"W80017-235-M  W Sofia Lace"," ",{"$f":"--ISNUMBER(IFERROR(SEARCH(Orders!$E18,O769,1),\"\"))","v":1},{"$f":"IF(Q769=1,COUNTIF($Q$2:Q769,1),\"\")","v":768},{"$f":"IFERROR(INDEX($O2:$O986,MATCH(ROWS($Q$2:Q769),$R2:$R986,0)),\"\")","v":"W80017-235-M  W Sofia Lace"}]
[24,"W80017  ","235","M  ","W Sofia Lace","Toffee","0-21033-49376-8","          ",8.5,null,{"v":87.5,"d":"$87.50"},{"v":175,"d":"$175.00"},{"v":174.95,"d":"$174.95"},{"$f":"J770*K770","v":0},"W80017-235-M  W Sofia Lace"," ",{"$f":"--ISNUMBER(IFERROR(SEARCH(Orders!$E18,O770,1),\"\"))","v":1},{"$f":"IF(Q770=1,COUNTIF($Q$2:Q770,1),\"\")","v":769},{"$f":"IFERROR(INDEX($O2:$O986,MATCH(ROWS($Q$2:Q770),$R2:$R986,0)),\"\")","v":"W80017-235-M  W Sofia Lace"}]
[24,"W80017  ","235","M  ","W Sofia Lace","Toffee","0-21033-49377-5","          ",9,null,{"v":87.5,"d":"$87.50"},{"v":175,"d":"$175.00"},{"v":174.95,"d":"$174.95"},0,"W80017-235-M  W Sofia Lace"," ",{"$f":"--ISNUMBER(IFERROR(SEARCH(Orders!$E18,O771,1),\"\"))","v":1},{"$f":"IF(Q771=1,COUNTIF($Q$2:Q771,1),\"\")","v":770},{"$f":"IFERROR(INDEX($O2:$O986,MATCH(ROWS($Q$2:Q771),$R2:$R986,0)),\"\")","v":"W80017-235-M  W Sofia Lace"}]
[24,"W80017  ","235","M  ","W Sofia Lace","Toffee","0-21033-49378-2","          ",9.5,null,{"v":87.5,"d":"$87.50"},{"v":175,"d":"$175.00"},{"v":174.95,"d":"$174.95"},0,"W80017-235-M  W Sofia Lace"," ",{"$f":"--ISNUMBER(IFERROR(SEARCH(Orders!$E18,O772,1),\"\"))","v":1},{"$f":"IF(Q772=1,COUNTIF($Q$2:Q772,1),\"\")","v":771},{"$f":"IFERROR(INDEX($O2:$O986,MATCH(ROWS($Q$2:Q772),$R2:$R986,0)),\"\")","v":"W80017-235-M  W Sofia Lace"}]
[24,"W80017  ","235","M  ","W Sofia Lace","Toffee","0-21033-49379-9","          ",10,null,{"v":87.5,"d":"$87.50"},{"v":175,"d":"$175.00"},{"v":174.95,"d":"$174.95"},0,"W80017-235-M  W Sofia Lace"," ",{"$f":"--ISNUMBER(IFERROR(SEARCH(Orders!$E18,O773,1),\"\"))","v":1},{"$f":"IF(Q773=1,COUNTIF($Q$2:Q773,1),\"\")","v":772},{"$f":"IFERROR(INDEX($O2:$O986,MATCH(ROWS($Q$2:Q773),$R2:$R986,0)),\"\")","v":"W80017-235-M  W Sofia Lace"}]
[24,"W80017  ","235","M  ","W Sofia Lace","Toffee","0-21033-49380-5","          ",10.5,null,{"v":87.5,"d":"$87.50"},{"v":175,"d":"$175.00"},{"v":174.95,"d":"$174.95"},0,"W80017-235-M  W Sofia Lace"," ",{"$f":"--ISNUMBER(IFERROR(SEARCH(Orders!$E18,O774,1),\"\"))","v":1},{"$f":"IF(Q774=1,COUNTIF($Q$2:Q774,1),\"\")","v":773},{"$f":"IFERROR(INDEX($O2:$O986,MATCH(ROWS($Q$2:Q774),$R2:$R986,0)),\"\")","v":"W80017-235-M  W Sofia Lace"}]
[24,"W80017  ","235","M  ","W Sofia Lace","Toffee","0-21033-49381-2","          ",11,null,{"v":87.5,"d":"$87.50"},{"v":175,"d":"$175.00"},{"v":174.95,"d":"$174.95"},0,"W80017-235-M  W Sofia Lace"," ",{"$f":"--ISNUMBER(IFERROR(SEARCH(Orders!$E18,O775,1),\"\"))","v":1},{"$f":"IF(Q775=1,COUNTIF($Q$2:Q775,1),\"\")","v":774},{"$f":"IFERROR(INDEX($O2:$O986,MATCH(ROWS($Q$2:Q775),$R2:$R986,0)),\"\")","v":"W80017-235-M  W Sofia Lace"}]
[24,"W80017  ","305","M  ","W Sofia Lace","Loden","0-21033-49382-9","          ",6,null,{"v":87.5,"d":"$87.50"},{"v":175,"d":"$175.00"},{"v":174.95,"d":"$174.95"},0,"W80017-305-M  W Sofia Lace"," ",{"$f":"--ISNUMBER(IFERROR(SEARCH(Orders!$E18,O776,1),\"\"))","v":1},{"$f":"IF(Q776=1,COUNTIF($Q$2:Q776,1),\"\")","v":775},{"$f":"IFERROR(INDEX($O2:$O986,MATCH(ROWS($Q$2:Q776),$R2:$R986,0)),\"\")","v":"W80017-305-M  W Sofia Lace"}]
[24,"W80017  ","305","M  ","W Sofia Lace","Loden","0-21033-49383-6","          ",6.5,null,{"v":87.5,"d":"$87.50"},{"v":175,"d":"$175.00"},{"v":174.95,"d":"$174.95"},0,"W80017-305-M  W Sofia Lace"," ",{"$f":"--ISNUMBER(IFERROR(SEARCH(Orders!$E18,O777,1),\"\"))","v":1},{"$f":"IF(Q777=1,COUNTIF($Q$2:Q777,1),\"\")","v":776},{"$f":"IFERROR(INDEX($O2:$O986,MATCH(ROWS($Q$2:Q777),$R2:$R986,0)),\"\")","v":"W80017-305-M  W Sofia Lace"}]
[24,"W80017  ","305","M  ","W Sofia Lace","Loden","0-21033-49384-3","          ",7,null,{"v":87.5,"d":"$87.50"},{"v":175,"d":"$175.00"},{"v":174.95,"d":"$174.95"},0,"W80017-305-M  W Sofia Lace"," ",{"$f":"--ISNUMBER(IFERROR(SEARCH(Orders!$E18,O778,1),\"\"))","v":1},{"$f":"IF(Q778=1,COUNTIF($Q$2:Q778,1),\"\")","v":777},{"$f":"IFERROR(INDEX($O2:$O986,MATCH(ROWS($Q$2:Q778),$R2:$R986,0)),\"\")","v":"W80017-305-M  W Sofia Lace"}]
[24,"W80017  ","305","M  ","W Sofia Lace","Loden","0-21033-49385-0","          ",7.5,null,{"v":87.5,"d":"$87.50"},{"v":175,"d":"$175.00"},{"v":174.95,"d":"$174.95"},0,"W80017-305-M  W Sofia Lace"," ",{"$f":"--ISNUMBER(IFERROR(SEARCH(Orders!$E18,O779,1),\"\"))","v":1},{"$f":"IF(Q779=1,COUNTIF($Q$2:Q779,1),\"\")","v":778},{"$f":"IFERROR(INDEX($O2:$O986,MATCH(ROWS($Q$2:Q779),$R2:$R986,0)),\"\")","v":"W80017-305-M  W Sofia Lace"}]
[24,"W80017  ","305","M  ","W Sofia Lace","Loden","0-21033-49386-7","          ",8,null,{"v":87.5,"d":"$87.50"},{"v":175,"d":"$175.00"},{"v":174.95,"d":"$174.95"},0,"W80017-305-M  W Sofia Lace"," ",{"$f":"--ISNUMBER(IFERROR(SEARCH(Orders!$E18,O780,1),\"\"))","v":1},{"$f":"IF(Q780=1,COUNTIF($Q$2:Q780,1),\"\")","v":779},{"$f":"IFERROR(INDEX($O2:$O986,MATCH(ROWS($Q$2:Q780),$R2:$R986,0)),\"\")","v":"W80017-305-M  W Sofia Lace"}]
[24,"W80017  ","305","M  ","W Sofia Lace","Loden","0-21033-49387-4","          ",8.5,null,{"v":87.5,"d":"$87.50"},{"v":175,"d":"$175.00"},{"v":174.95,"d":"$174.95"},0,"W80017-305-M  W Sofia Lace"," ",{"$f":"--ISNUMBER(IFERROR(SEARCH(Orders!$E18,O781,1),\"\"))","v":1},{"$f":"IF(Q781=1,COUNTIF($Q$2:Q781,1),\"\")","v":780},{"$f":"IFERROR(INDEX($O2:$O986,MATCH(ROWS($Q$2:Q781),$R2:$R986,0)),\"\")","v":"W80017-305-M  W Sofia Lace"}]
[24,"W80017  ","305","M  ","W Sofia Lace","Loden","0-21033-49388-1","          ",9,null,{"v":87.5,"d":"$87.50"},{"v":175,"d":"$175.00"},{"v":174.95,"d":"$174.95"},0,"W80017-305-M  W Sofia Lace"," ",{"$f":"--ISNUMBER(IFERROR(SEARCH(Orders!$E18,O782,1),\"\"))","v":1},{"$f":"IF(Q782=1,COUNTIF($Q$2:Q782,1),\"\")","v":781},{"$f":"IFERROR(INDEX($O2:$O986,MATCH(ROWS($Q$2:Q782),$R2:$R986,0)),\"\")","v":"W80017-305-M  W Sofia Lace"}]
[24,"W80017  ","305","M  ","W Sofia Lace","Loden","0-21033-49389-8","          ",9.5,null,{"v":87.5,"d":"$87.50"},{"v":175,"d":"$175.00"},{"v":174.95,"d":"$174.95"},0,"W80017-305-M  W Sofia Lace"," ",{"$f":"--ISNUMBER(IFERROR(SEARCH(Orders!$E18,O783,1),\"\"))","v":1},{"$f":"IF(Q783=1,COUNTIF($Q$2:Q783,1),\"\")","v":782},{"$f":"IFERROR(INDEX($O2:$O986,MATCH(ROWS($Q$2:Q783),$R2:$R986,0)),\"\")","v":"W80017-305-M  W Sofia Lace"}]
[24,"W80017  ","305","M  ","W Sofia Lace","Loden","0-21033-49390-4","          ",10,null,{"v":87.5,"d":"$87.50"},{"v":175,"d":"$175.00"},{"v":174.95,"d":"$174.95"},0,"W80017-305-M  W Sofia Lace"," ",{"$f":"--ISNUMBER(IFERROR(SEARCH(Orders!$E18,O784,1),\"\"))","v":1},{"$f":"IF(Q784=1,COUNTIF($Q$2:Q784,1),\"\")","v":783},{"$f":"IFERROR(INDEX($O2:$O986,MATCH(ROWS($Q$2:Q784),$R2:$R986,0)),\"\")","v":"W80017-305-M  W Sofia Lace"}]
[24,"W80017  ","305","M  ","W Sofia Lace","Loden","0-21033-49391-1","          ",10.5,null,{"v":87.5,"d":"$87.50"},{"v":175,"d":"$175.00"},{"v":174.95,"d":"$174.95"},0,"W80017-305-M  W Sofia Lace"," ",{"$f":"--ISNUMBER(IFERROR(SEARCH(Orders!$E18,O785,1),\"\"))","v":1},{"$f":"IF(Q785=1,COUNTIF($Q$2:Q785,1),\"\")","v":784},{"$f":"IFERROR(INDEX($O2:$O986,MATCH(ROWS($Q$2:Q785),$R2:$R986,0)),\"\")","v":"W80017-305-M  W Sofia Lace"}]
[24,"W80017  ","305","M  ","W Sofia Lace","Loden","0-21033-49392-8","          ",11,null,{"v":87.5,"d":"$87.50"},{"v":175,"d":"$175.00"},{"v":174.95,"d":"$174.95"},0,"W80017-305-M  W Sofia Lace"," ",{"$f":"--ISNUMBER(IFERROR(SEARCH(Orders!$E18,O786,1),\"\"))","v":1},{"$f":"IF(Q786=1,COUNTIF($Q$2:Q786,1),\"\")","v":785},{"$f":"IFERROR(INDEX($O2:$O986,MATCH(ROWS($Q$2:Q786),$R2:$R986,0)),\"\")","v":"W80017-305-M  W Sofia Lace"}]
[20,"W80019  ","001","M  ","W Cascade Trail Mid","Black","0-21033-49210-5","          ",6,null,{"v":75,"d":"$75.00"},{"v":150,"d":"$150.00"},{"v":149.95,"d":"$149.95"},0,"W80019-001-M  W Cascade Trail Mid"," ",{"$f":"--ISNUMBER(IFERROR(SEARCH(Orders!$E18,O787,1),\"\"))","v":1},{"$f":"IF(Q787=1,COUNTIF($Q$2:Q787,1),\"\")","v":786},{"$f":"IFERROR(INDEX($O2:$O986,MATCH(ROWS($Q$2:Q787),$R2:$R986,0)),\"\")","v":"W80019-001-M  W Cascade Trail Mid"}]
[20,"W80019  ","001","M  ","W Cascade Trail Mid","Black","0-21033-49211-2","          ",6.5,null,{"v":75,"d":"$75.00"},{"v":150,"d":"$150.00"},{"v":149.95,"d":"$149.95"},0,"W80019-001-M  W Cascade Trail Mid"," ",{"$f":"--ISNUMBER(IFERROR(SEARCH(Orders!$E18,O788,1),\"\"))","v":1},{"$f":"IF(Q788=1,COUNTIF($Q$2:Q788,1),\"\")","v":787},{"$f":"IFERROR(INDEX($O2:$O986,MATCH(ROWS($Q$2:Q788),$R2:$R986,0)),\"\")","v":"W80019-001-M  W Cascade Trail Mid"}]
[20,"W80019  ","001","M  ","W Cascade Trail Mid","Black","0-21033-49212-9","          ",7,null,{"v":75,"d":"$75.00"},{"v":150,"d":"$150.00"},{"v":149.95,"d":"$149.95"},0,"W80019-001-M  W Cascade Trail Mid"," ",{"$f":"--ISNUMBER(IFERROR(SEARCH(Orders!$E18,O789,1),\"\"))","v":1},{"$f":"IF(Q789=1,COUNTIF($Q$2:Q789,1),\"\")","v":788},{"$f":"IFERROR(INDEX($O2:$O986,MATCH(ROWS($Q$2:Q789),$R2:$R986,0)),\"\")","v":"W80019-001-M  W Cascade Trail Mid"}]
[20,"W80019  ","001","M  ","W Cascade Trail Mid","Black","0-21033-49213-6","          ",7.5,null,{"v":75,"d":"$75.00"},{"v":150,"d":"$150.00"},{"v":149.95,"d":"$149.95"},0,"W80019-001-M  W Cascade Trail Mid"," ",{"$f":"--ISNUMBER(IFERROR(SEARCH(Orders!$E18,O790,1),\"\"))","v":1},{"$f":"IF(Q790=1,COUNTIF($Q$2:Q790,1),\"\")","v":789},{"$f":"IFERROR(INDEX($O2:$O986,MATCH(ROWS($Q$2:Q790),$R2:$R986,0)),\"\")","v":"W80019-001-M  W Cascade Trail Mid"}]
[20,"W80019  ","001","M  ","W Cascade Trail Mid","Black","0-21033-49214-3","          ",8,null,{"v":75,"d":"$75.00"},{"v":150,"d":"$150.00"},{"v":149.95,"d":"$149.95"},0,"W80019-001-M  W Cascade Trail Mid"," ",{"$f":"--ISNUMBER(IFERROR(SEARCH(Orders!$E18,O791,1),\"\"))","v":1},{"$f":"IF(Q791=1,COUNTIF($Q$2:Q791,1),\"\")","v":790},{"$f":"IFERROR(INDEX($O2:$O986,MATCH(ROWS($Q$2:Q791),$R2:$R986,0)),\"\")","v":"W80019-001-M  W Cascade Trail Mid"}]
[20,"W80019  ","001","M  ","W Cascade Trail Mid","Black","0-21033-49215-0","          ",8.5,null,{"v":75,"d":"$75.00"},{"v":150,"d":"$150.00"},{"v":149.95,"d":"$149.95"},0,"W80019-001-M  W Cascade Trail Mid"," ",{"$f":"--ISNUMBER(IFERROR(SEARCH(Orders!$E18,O792,1),\"\"))","v":1},{"$f":"IF(Q792=1,COUNTIF($Q$2:Q792,1),\"\")","v":791},{"$f":"IFERROR(INDEX($O2:$O986,MATCH(ROWS($Q$2:Q792),$R2:$R986,0)),\"\")","v":"W80019-001-M  W Cascade Trail Mid"}]
[20,"W80019  ","001","M  ","W Cascade Trail Mid","Black","0-21033-49216-7","          ",9,null,{"v":75,"d":"$75.00"},{"v":150,"d":"$150.00"},{"v":149.95,"d":"$149.95"},0,"W80019-001-M  W Cascade Trail Mid"," ",{"$f":"--ISNUMBER(IFERROR(SEARCH(Orders!$E18,O793,1),\"\"))","v":1},{"$f":"IF(Q793=1,COUNTIF($Q$2:Q793,1),\"\")","v":792},{"$f":"IFERROR(INDEX($O2:$O986,MATCH(ROWS($Q$2:Q793),$R2:$R986,0)),\"\")","v":"W80019-001-M  W Cascade Trail Mid"}]
[20,"W80019  ","001","M  ","W Cascade Trail Mid","Black","0-21033-49217-4","          ",9.5,null,{"v":75,"d":"$75.00"},{"v":150,"d":"$150.00"},{"v":149.95,"d":"$149.95"},0,"W80019-001-M  W Cascade Trail Mid"," ",{"$f":"--ISNUMBER(IFERROR(SEARCH(Orders!$E18,O794,1),\"\"))","v":1},{"$f":"IF(Q794=1,COUNTIF($Q$2:Q794,1),\"\")","v":793},{"$f":"IFERROR(INDEX($O2:$O986,MATCH(ROWS($Q$2:Q794),$R2:$R986,0)),\"\")","v":"W80019-001-M  W Cascade Trail Mid"}]
[20,"W80019  ","001","M  ","W Cascade Trail Mid","Black","0-21033-49218-1","          ",10,null,{"v":75,"d":"$75.00"},{"v":150,"d":"$150.00"},{"v":149.95,"d":"$149.95"},0,"W80019-001-M  W Cascade Trail Mid"," ",{"$f":"--ISNUMBER(IFERROR(SEARCH(Orders!$E18,O795,1),\"\"))","v":1},{"$f":"IF(Q795=1,COUNTIF($Q$2:Q795,1),\"\")","v":794},{"$f":"IFERROR(INDEX($O2:$O986,MATCH(ROWS($Q$2:Q795),$R2:$R986,0)),\"\")","v":"W80019-001-M  W Cascade Trail Mid"}]
[20,"W80019  ","001","M  ","W Cascade Trail Mid","Black","0-21033-49219-8","          ",10.5,null,{"v":75,"d":"$75.00"},{"v":150,"d":"$150.00"},{"v":149.95,"d":"$149.95"},0,"W80019-001-M  W Cascade Trail Mid"," ",{"$f":"--ISNUMBER(IFERROR(SEARCH(Orders!$E18,O796,1),\"\"))","v":1},{"$f":"IF(Q796=1,COUNTIF($Q$2:Q796,1),\"\")","v":795},{"$f":"IFERROR(INDEX($O2:$O986,MATCH(ROWS($Q$2:Q796),$R2:$R986,0)),\"\")","v":"W80019-001-M  W Cascade Trail Mid"}]
[20,"W80019  ","001","M  ","W Cascade Trail Mid","Black","0-21033-49220-4","          ",11,null,{"v":75,"d":"$75.00"},{"v":150,"d":"$150.00"},{"v":149.95,"d":"$149.95"},0,"W80019-001-M  W Cascade Trail Mid"," ",{"$f":"--ISNUMBER(IFERROR(SEARCH(Orders!$E18,O797,1),\"\"))","v":1},{"$f":"IF(Q797=1,COUNTIF($Q$2:Q797,1),\"\")","v":796},{"$f":"IFERROR(INDEX($O2:$O986,MATCH(ROWS($Q$2:Q797),$R2:$R986,0)),\"\")","v":"W80019-001-M  W Cascade Trail Mid"}]
[20,"W80019  ","305","M  ","W Cascade Trail Mid","Loden","0-21033-49232-7","          ",6,null,{"v":75,"d":"$75.00"},{"v":150,"d":"$150.00"},{"v":149.95,"d":"$149.95"},0,"W80019-305-M  W Cascade Trail Mid"," ",{"$f":"--ISNUMBER(IFERROR(SEARCH(Orders!$E18,O798,1),\"\"))","v":1},{"$f":"IF(Q798=1,COUNTIF($Q$2:Q798,1),\"\")","v":797},{"$f":"IFERROR(INDEX($O2:$O986,MATCH(ROWS($Q$2:Q798),$R2:$R986,0)),\"\")","v":"W80019-305-M  W Cascade Trail Mid"}]
[20,"W80019  ","305","M  ","W Cascade Trail Mid","Loden","0-21033-49233-4","          ",6.5,null,{"v":75,"d":"$75.00"},{"v":150,"d":"$150.00"},{"v":149.95,"d":"$149.95"},0,"W80019-305-M  W Cascade Trail Mid"," ",{"$f":"--ISNUMBER(IFERROR(SEARCH(Orders!$E18,O799,1),\"\"))","v":1},{"$f":"IF(Q799=1,COUNTIF($Q$2:Q799,1),\"\")","v":798},{"$f":"IFERROR(INDEX($O2:$O986,MATCH(ROWS($Q$2:Q799),$R2:$R986,0)),\"\")","v":"W80019-305-M  W Cascade Trail Mid"}]
[20,"W80019  ","305","M  ","W Cascade Trail Mid","Loden","0-21033-49234-1","          ",7,null,{"v":75,"d":"$75.00"},{"v":150,"d":"$150.00"},{"v":149.95,"d":"$149.95"},0,"W80019-305-M  W Cascade Trail Mid"," ",{"$f":"--ISNUMBER(IFERROR(SEARCH(Orders!$E18,O800,1),\"\"))","v":1},{"$f":"IF(Q800=1,COUNTIF($Q$2:Q800,1),\"\")","v":799},{"$f":"IFERROR(INDEX($O2:$O986,MATCH(ROWS($Q$2:Q800),$R2:$R986,0)),\"\")","v":"W80019-305-M  W Cascade Trail Mid"}]
[20,"W80019  ","305","M  ","W Cascade Trail Mid","Loden","0-21033-49235-8","          ",7.5,null,{"v":75,"d":"$75.00"},{"v":150,"d":"$150.00"},{"v":149.95,"d":"$149.95"},0,"W80019-305-M  W Cascade Trail Mid"," ",{"$f":"--ISNUMBER(IFERROR(SEARCH(Orders!$E18,O801,1),\"\"))","v":1},{"$f":"IF(Q801=1,COUNTIF($Q$2:Q801,1),\"\")","v":800},{"$f":"IFERROR(INDEX($O2:$O986,MATCH(ROWS($Q$2:Q801),$R2:$R986,0)),\"\")","v":"W80019-305-M  W Cascade Trail Mid"}]
[20,"W80019  ","305","M  ","W Cascade Trail Mid","Loden","0-21033-49236-5","          ",8,null,{"v":75,"d":"$75.00"},{"v":150,"d":"$150.00"},{"v":149.95,"d":"$149.95"},0,"W80019-305-M  W Cascade Trail Mid"," ",{"$f":"--ISNUMBER(IFERROR(SEARCH(Orders!$E18,O802,1),\"\"))","v":1},{"$f":"IF(Q802=1,COUNTIF($Q$2:Q802,1),\"\")","v":801},{"$f":"IFERROR(INDEX($O2:$O986,MATCH(ROWS($Q$2:Q802),$R2:$R986,0)),\"\")","v":"W80019-305-M  W Cascade Trail Mid"}]
[20,"W80019  ","305","M  ","W Cascade Trail Mid","Loden","0-21033-49237-2","          ",8.5,null,{"v":75,"d":"$75.00"},{"v":150,"d":"$150.00"},{"v":149.95,"d":"$149.95"},0,"W80019-305-M  W Cascade Trail Mid"," ",{"$f":"--ISNUMBER(IFERROR(SEARCH(Orders!$E18,O803,1),\"\"))","v":1},{"$f":"IF(Q803=1,COUNTIF($Q$2:Q803,1),\"\")","v":802},{"$f":"IFERROR(INDEX($O2:$O986,MATCH(ROWS($Q$2:Q803),$R2:$R986,0)),\"\")","v":"W80019-305-M  W Cascade Trail Mid"}]
[20,"W80019  ","305","M  ","W Cascade Trail Mid","Loden","0-21033-49238-9","          ",9,null,{"v":75,"d":"$75.00"},{"v":150,"d":"$150.00"},{"v":149.95,"d":"$149.95"},0,"W80019-305-M  W Cascade Trail Mid"," ",{"$f":"--ISNUMBER(IFERROR(SEARCH(Orders!$E18,O804,1),\"\"))","v":1},{"$f":"IF(Q804=1,COUNTIF($Q$2:Q804,1),\"\")","v":803},{"$f":"IFERROR(INDEX($O2:$O986,MATCH(ROWS($Q$2:Q804),$R2:$R986,0)),\"\")","v":"W80019-305-M  W Cascade Trail Mid"}]
[20,"W80019  ","305","M  ","W Cascade Trail Mid","Loden","0-21033-49239-6","          ",9.5,null,{"v":75,"d":"$75.00"},{"v":150,"d":"$150.00"},{"v":149.95,"d":"$149.95"},0,"W80019-305-M  W Cascade Trail Mid"," ",{"$f":"--ISNUMBER(IFERROR(SEARCH(Orders!$E18,O805,1),\"\"))","v":1},{"$f":"IF(Q805=1,COUNTIF($Q$2:Q805,1),\"\")","v":804},{"$f":"IFERROR(INDEX($O2:$O986,MATCH(ROWS($Q$2:Q805),$R2:$R986,0)),\"\")","v":"W80019-305-M  W Cascade Trail Mid"}]
[20,"W80019  ","305","M  ","W Cascade Trail Mid","Loden","0-21033-49240-2","          ",10,null,{"v":75,"d":"$75.00"},{"v":150,"d":"$150.00"},{"v":149.95,"d":"$149.95"},0,"W80019-305-M  W Cascade Trail Mid"," ",{"$f":"--ISNUMBER(IFERROR(SEARCH(Orders!$E18,O806,1),\"\"))","v":1},{"$f":"IF(Q806=1,COUNTIF($Q$2:Q806,1),\"\")","v":805},{"$f":"IFERROR(INDEX($O2:$O986,MATCH(ROWS($Q$2:Q806),$R2:$R986,0)),\"\")","v":"W80019-305-M  W Cascade Trail Mid"}]
[20,"W80019  ","305","M  ","W Cascade Trail Mid","Loden","0-21033-49241-9","          ",10.5,null,{"v":75,"d":"$75.00"},{"v":150,"d":"$150.00"},{"v":149.95,"d":"$149.95"},0,"W80019-305-M  W Cascade Trail Mid"," ",{"$f":"--ISNUMBER(IFERROR(SEARCH(Orders!$E18,O807,1),\"\"))","v":1},{"$f":"IF(Q807=1,COUNTIF($Q$2:Q807,1),\"\")","v":806},{"$f":"IFERROR(INDEX($O2:$O986,MATCH(ROWS($Q$2:Q807),$R2:$R986,0)),\"\")","v":"W80019-305-M  W Cascade Trail Mid"}]
[20,"W80019  ","305","M  ","W Cascade Trail Mid","Loden","0-21033-49242-6","          ",11,null,{"v":75,"d":"$75.00"},{"v":150,"d":"$150.00"},{"v":149.95,"d":"$149.95"},0,"W80019-305-M  W Cascade Trail Mid"," ",{"$f":"--ISNUMBER(IFERROR(SEARCH(Orders!$E18,O808,1),\"\"))","v":1},{"$f":"IF(Q808=1,COUNTIF($Q$2:Q808,1),\"\")","v":807},{"$f":"IFERROR(INDEX($O2:$O986,MATCH(ROWS($Q$2:Q808),$R2:$R986,0)),\"\")","v":"W80019-305-M  W Cascade Trail Mid"}]
[20,"W80019  ","450","M  ","W Cascade Trail Mid","Sky Blue","0-21033-49243-3","          ",6,null,{"v":75,"d":"$75.00"},{"v":150,"d":"$150.00"},{"v":149.95,"d":"$149.95"},0,"W80019-450-M  W Cascade Trail Mid"," ",{"$f":"--ISNUMBER(IFERROR(SEARCH(Orders!$E18,O809,1),\"\"))","v":1},{"$f":"IF(Q809=1,COUNTIF($Q$2:Q809,1),\"\")","v":808},{"$f":"IFERROR(INDEX($O2:$O986,MATCH(ROWS($Q$2:Q809),$R2:$R986,0)),\"\")","v":"W80019-450-M  W Cascade Trail Mid"}]
[20,"W80019  ","450","M  ","W Cascade Trail Mid","Sky Blue","0-21033-49244-0","          ",6.5,null,{"v":75,"d":"$75.00"},{"v":150,"d":"$150.00"},{"v":149.95,"d":"$149.95"},0,"W80019-450-M  W Cascade Trail Mid"," ",{"$f":"--ISNUMBER(IFERROR(SEARCH(Orders!$E18,O810,1),\"\"))","v":1},{"$f":"IF(Q810=1,COUNTIF($Q$2:Q810,1),\"\")","v":809},{"$f":"IFERROR(INDEX($O2:$O986,MATCH(ROWS($Q$2:Q810),$R2:$R986,0)),\"\")","v":"W80019-450-M  W Cascade Trail Mid"}]
[20,"W80019  ","450","M  ","W Cascade Trail Mid","Sky Blue","0-21033-49245-7","          ",7,null,{"v":75,"d":"$75.00"},{"v":150,"d":"$150.00"},{"v":149.95,"d":"$149.95"},0,"W80019-450-M  W Cascade Trail Mid"," ",{"$f":"--ISNUMBER(IFERROR(SEARCH(Orders!$E18,O811,1),\"\"))","v":1},{"$f":"IF(Q811=1,COUNTIF($Q$2:Q811,1),\"\")","v":810},{"$f":"IFERROR(INDEX($O2:$O986,MATCH(ROWS($Q$2:Q811),$R2:$R986,0)),\"\")","v":"W80019-450-M  W Cascade Trail Mid"}]
[20,"W80019  ","450","M  ","W Cascade Trail Mid","Sky Blue","0-21033-49246-4","          ",7.5,null,{"v":75,"d":"$75.00"},{"v":150,"d":"$150.00"},{"v":149.95,"d":"$149.95"},0,"W80019-450-M  W Cascade Trail Mid"," ",{"$f":"--ISNUMBER(IFERROR(SEARCH(Orders!$E18,O812,1),\"\"))","v":1},{"$f":"IF(Q812=1,COUNTIF($Q$2:Q812,1),\"\")","v":811},{"$f":"IFERROR(INDEX($O2:$O986,MATCH(ROWS($Q$2:Q812),$R2:$R986,0)),\"\")","v":"W80019-450-M  W Cascade Trail Mid"}]
[20,"W80019  ","450","M  ","W Cascade Trail Mid","Sky Blue","0-21033-49247-1","          ",8,null,{"v":75,"d":"$75.00"},{"v":150,"d":"$150.00"},{"v":149.95,"d":"$149.95"},0,"W80019-450-M  W Cascade Trail Mid"," ",{"$f":"--ISNUMBER(IFERROR(SEARCH(Orders!$E18,O813,1),\"\"))","v":1},{"$f":"IF(Q813=1,COUNTIF($Q$2:Q813,1),\"\")","v":812},{"$f":"IFERROR(INDEX($O2:$O986,MATCH(ROWS($Q$2:Q813),$R2:$R986,0)),\"\")","v":"W80019-450-M  W Cascade Trail Mid"}]
[20,"W80019  ","450","M  ","W Cascade Trail Mid","Sky Blue","0-21033-49248-8","          ",8.5,null,{"v":75,"d":"$75.00"},{"v":150,"d":"$150.00"},{"v":149.95,"d":"$149.95"},0,"W80019-450-M  W Cascade Trail Mid"," ",{"$f":"--ISNUMBER(IFERROR(SEARCH(Orders!$E18,O814,1),\"\"))","v":1},{"$f":"IF(Q814=1,COUNTIF($Q$2:Q814,1),\"\")","v":813},{"$f":"IFERROR(INDEX($O2:$O986,MATCH(ROWS($Q$2:Q814),$R2:$R986,0)),\"\")","v":"W80019-450-M  W Cascade Trail Mid"}]
[20,"W80019  ","450","M  ","W Cascade Trail Mid","Sky Blue","0-21033-49249-5","          ",9,null,{"v":75,"d":"$75.00"},{"v":150,"d":"$150.00"},{"v":149.95,"d":"$149.95"},0,"W80019-450-M  W Cascade Trail Mid"," ",{"$f":"--ISNUMBER(IFERROR(SEARCH(Orders!$E18,O815,1),\"\"))","v":1},{"$f":"IF(Q815=1,COUNTIF($Q$2:Q815,1),\"\")","v":814},{"$f":"IFERROR(INDEX($O2:$O986,MATCH(ROWS($Q$2:Q815),$R2:$R986,0)),\"\")","v":"W80019-450-M  W Cascade Trail Mid"}]
[20,"W80019  ","450","M  ","W Cascade Trail Mid","Sky Blue","0-21033-49250-1","          ",9.5,null,{"v":75,"d":"$75.00"},{"v":150,"d":"$150.00"},{"v":149.95,"d":"$149.95"},0,"W80019-450-M  W Cascade Trail Mid"," ",{"$f":"--ISNUMBER(IFERROR(SEARCH(Orders!$E18,O816,1),\"\"))","v":1},{"$f":"IF(Q816=1,COUNTIF($Q$2:Q816,1),\"\")","v":815},{"$f":"IFERROR(INDEX($O2:$O986,MATCH(ROWS($Q$2:Q816),$R2:$R986,0)),\"\")","v":"W80019-450-M  W Cascade Trail Mid"}]
[20,"W80019  ","450","M  ","W Cascade Trail Mid","Sky Blue","0-21033-49251-8","          ",10,null,{"v":75,"d":"$75.00"},{"v":150,"d":"$150.00"},{"v":149.95,"d":"$149.95"},0,"W80019-450-M  W Cascade Trail Mid"," ",{"$f":"--ISNUMBER(IFERROR(SEARCH(Orders!$E18,O817,1),\"\"))","v":1},{"$f":"IF(Q817=1,COUNTIF($Q$2:Q817,1),\"\")","v":816},{"$f":"IFERROR(INDEX($O2:$O986,MATCH(ROWS($Q$2:Q817),$R2:$R986,0)),\"\")","v":"W80019-450-M  W Cascade Trail Mid"}]
[20,"W80019  ","450","M  ","W Cascade Trail Mid","Sky Blue","0-21033-49252-5","          ",10.5,null,{"v":75,"d":"$75.00"},{"v":150,"d":"$150.00"},{"v":149.95,"d":"$149.95"},0,"W80019-450-M  W Cascade Trail Mid"," ",{"$f":"--ISNUMBER(IFERROR(SEARCH(Orders!$E18,O818,1),\"\"))","v":1},{"$f":"IF(Q818=1,COUNTIF($Q$2:Q818,1),\"\")","v":817},{"$f":"IFERROR(INDEX($O2:$O986,MATCH(ROWS($Q$2:Q818),$R2:$R986,0)),\"\")","v":"W80019-450-M  W Cascade Trail Mid"}]
[20,"W80019  ","450","M  ","W Cascade Trail Mid","Sky Blue","0-21033-49253-2","          ",11,null,{"v":75,"d":"$75.00"},{"v":150,"d":"$150.00"},{"v":149.95,"d":"$149.95"},0,"W80019-450-M  W Cascade Trail Mid"," ",{"$f":"--ISNUMBER(IFERROR(SEARCH(Orders!$E18,O819,1),\"\"))","v":1},{"$f":"IF(Q819=1,COUNTIF($Q$2:Q819,1),\"\")","v":818},{"$f":"IFERROR(INDEX($O2:$O986,MATCH(ROWS($Q$2:Q819),$R2:$R986,0)),\"\")","v":"W80019-450-M  W Cascade Trail Mid"}]
[27,"W80020  ","451","M  ","W Lucie Mid","Mist Blue","0-21033-48847-4","          ",5,null,{"v":75,"d":"$75.00"},{"v":150,"d":"$150.00"},{"v":149.95,"d":"$149.95"},0,"W80020-451-M  W Lucie Mid"," ",{"$f":"--ISNUMBER(IFERROR(SEARCH(Orders!$E18,O820,1),\"\"))","v":1},{"$f":"IF(Q820=1,COUNTIF($Q$2:Q820,1),\"\")","v":819},{"$f":"IFERROR(INDEX($O2:$O986,MATCH(ROWS($Q$2:Q820),$R2:$R986,0)),\"\")","v":"W80020-451-M  W Lucie Mid"}]
[27,"W80020  ","451","M  ","W Lucie Mid","Mist Blue","0-21033-48848-1","          ",5.5,null,{"v":75,"d":"$75.00"},{"v":150,"d":"$150.00"},{"v":149.95,"d":"$149.95"},0,"W80020-451-M  W Lucie Mid"," ",{"$f":"--ISNUMBER(IFERROR(SEARCH(Orders!$E18,O821,1),\"\"))","v":1},{"$f":"IF(Q821=1,COUNTIF($Q$2:Q821,1),\"\")","v":820},{"$f":"IFERROR(INDEX($O2:$O986,MATCH(ROWS($Q$2:Q821),$R2:$R986,0)),\"\")","v":"W80020-451-M  W Lucie Mid"}]
[27,"W80020  ","451","M  ","W Lucie Mid","Mist Blue","0-21033-48849-8","          ",6,null,{"v":75,"d":"$75.00"},{"v":150,"d":"$150.00"},{"v":149.95,"d":"$149.95"},0,"W80020-451-M  W Lucie Mid"," ",{"$f":"--ISNUMBER(IFERROR(SEARCH(Orders!$E18,O822,1),\"\"))","v":1},{"$f":"IF(Q822=1,COUNTIF($Q$2:Q822,1),\"\")","v":821},{"$f":"IFERROR(INDEX($O2:$O986,MATCH(ROWS($Q$2:Q822),$R2:$R986,0)),\"\")","v":"W80020-451-M  W Lucie Mid"}]
[27,"W80020  ","451","M  ","W Lucie Mid","Mist Blue","0-21033-48850-4","          ",6.5,null,{"v":75,"d":"$75.00"},{"v":150,"d":"$150.00"},{"v":149.95,"d":"$149.95"},0,"W80020-451-M  W Lucie Mid"," ",{"$f":"--ISNUMBER(IFERROR(SEARCH(Orders!$E18,O823,1),\"\"))","v":1},{"$f":"IF(Q823=1,COUNTIF($Q$2:Q823,1),\"\")","v":822},{"$f":"IFERROR(INDEX($O2:$O986,MATCH(ROWS($Q$2:Q823),$R2:$R986,0)),\"\")","v":"W80020-451-M  W Lucie Mid"}]
[27,"W80020  ","451","M  ","W Lucie Mid","Mist Blue","0-21033-48851-1","          ",7,null,{"v":75,"d":"$75.00"},{"v":150,"d":"$150.00"},{"v":149.95,"d":"$149.95"},0,"W80020-451-M  W Lucie Mid"," ",{"$f":"--ISNUMBER(IFERROR(SEARCH(Orders!$E18,O824,1),\"\"))","v":1},{"$f":"IF(Q824=1,COUNTIF($Q$2:Q824,1),\"\")","v":823},{"$f":"IFERROR(INDEX($O2:$O986,MATCH(ROWS($Q$2:Q824),$R2:$R986,0)),\"\")","v":"W80020-451-M  W Lucie Mid"}]
[27,"W80020  ","451","M  ","W Lucie Mid","Mist Blue","0-21033-48852-8","          ",7.5,null,{"v":75,"d":"$75.00"},{"v":150,"d":"$150.00"},{"v":149.95,"d":"$149.95"},0,"W80020-451-M  W Lucie Mid"," ",{"$f":"--ISNUMBER(IFERROR(SEARCH(Orders!$E18,O825,1),\"\"))","v":1},{"$f":"IF(Q825=1,COUNTIF($Q$2:Q825,1),\"\")","v":824},{"$f":"IFERROR(INDEX($O2:$O986,MATCH(ROWS($Q$2:Q825),$R2:$R986,0)),\"\")","v":"W80020-451-M  W Lucie Mid"}]
[27,"W80020  ","451","M  ","W Lucie Mid","Mist Blue","0-21033-48853-5","          ",8,null,{"v":75,"d":"$75.00"},{"v":150,"d":"$150.00"},{"v":149.95,"d":"$149.95"},0,"W80020-451-M  W Lucie Mid"," ",{"$f":"--ISNUMBER(IFERROR(SEARCH(Orders!$E18,O826,1),\"\"))","v":1},{"$f":"IF(Q826=1,COUNTIF($Q$2:Q826,1),\"\")","v":825},{"$f":"IFERROR(INDEX($O2:$O986,MATCH(ROWS($Q$2:Q826),$R2:$R986,0)),\"\")","v":"W80020-451-M  W Lucie Mid"}]
[27,"W80020  ","451","M  ","W Lucie Mid","Mist Blue","0-21033-48854-2","          ",8.5,null,{"v":75,"d":"$75.00"},{"v":150,"d":"$150.00"},{"v":149.95,"d":"$149.95"},0,"W80020-451-M  W Lucie Mid"," ",{"$f":"--ISNUMBER(IFERROR(SEARCH(Orders!$E18,O827,1),\"\"))","v":1},{"$f":"IF(Q827=1,COUNTIF($Q$2:Q827,1),\"\")","v":826},{"$f":"IFERROR(INDEX($O2:$O986,MATCH(ROWS($Q$2:Q827),$R2:$R986,0)),\"\")","v":"W80020-451-M  W Lucie Mid"}]
[27,"W80020  ","451","M  ","W Lucie Mid","Mist Blue","0-21033-48855-9","          ",9,null,{"v":75,"d":"$75.00"},{"v":150,"d":"$150.00"},{"v":149.95,"d":"$149.95"},0,"W80020-451-M  W Lucie Mid"," ",{"$f":"--ISNUMBER(IFERROR(SEARCH(Orders!$E18,O828,1),\"\"))","v":1},{"$f":"IF(Q828=1,COUNTIF($Q$2:Q828,1),\"\")","v":827},{"$f":"IFERROR(INDEX($O2:$O986,MATCH(ROWS($Q$2:Q828),$R2:$R986,0)),\"\")","v":"W80020-451-M  W Lucie Mid"}]
[27,"W80020  ","451","M  ","W Lucie Mid","Mist Blue","0-21033-48856-6","          ",9.5,null,{"v":75,"d":"$75.00"},{"v":150,"d":"$150.00"},{"v":149.95,"d":"$149.95"},0,"W80020-451-M  W Lucie Mid"," ",{"$f":"--ISNUMBER(IFERROR(SEARCH(Orders!$E18,O829,1),\"\"))","v":1},{"$f":"IF(Q829=1,COUNTIF($Q$2:Q829,1),\"\")","v":828},{"$f":"IFERROR(INDEX($O2:$O986,MATCH(ROWS($Q$2:Q829),$R2:$R986,0)),\"\")","v":"W80020-451-M  W Lucie Mid"}]
[27,"W80020  ","451","M  ","W Lucie Mid","Mist Blue","0-21033-48857-3","          ",10,null,{"v":75,"d":"$75.00"},{"v":150,"d":"$150.00"},{"v":149.95,"d":"$149.95"},0,"W80020-451-M  W Lucie Mid"," ",{"$f":"--ISNUMBER(IFERROR(SEARCH(Orders!$E18,O830,1),\"\"))","v":1},{"$f":"IF(Q830=1,COUNTIF($Q$2:Q830,1),\"\")","v":829},{"$f":"IFERROR(INDEX($O2:$O986,MATCH(ROWS($Q$2:Q830),$R2:$R986,0)),\"\")","v":"W80020-451-M  W Lucie Mid"}]
[27,"W80020  ","451","M  ","W Lucie Mid","Mist Blue","0-21033-48858-0","          ",10.5,null,{"v":75,"d":"$75.00"},{"v":150,"d":"$150.00"},{"v":149.95,"d":"$149.95"},0,"W80020-451-M  W Lucie Mid"," ",{"$f":"--ISNUMBER(IFERROR(SEARCH(Orders!$E18,O831,1),\"\"))","v":1},{"$f":"IF(Q831=1,COUNTIF($Q$2:Q831,1),\"\")","v":830},{"$f":"IFERROR(INDEX($O2:$O986,MATCH(ROWS($Q$2:Q831),$R2:$R986,0)),\"\")","v":"W80020-451-M  W Lucie Mid"}]
[27,"W80020  ","451","M  ","W Lucie Mid","Mist Blue","0-21033-48859-7","          ",11,null,{"v":75,"d":"$75.00"},{"v":150,"d":"$150.00"},{"v":149.95,"d":"$149.95"},0,"W80020-451-M  W Lucie Mid"," ",{"$f":"--ISNUMBER(IFERROR(SEARCH(Orders!$E18,O832,1),\"\"))","v":1},{"$f":"IF(Q832=1,COUNTIF($Q$2:Q832,1),\"\")","v":831},{"$f":"IFERROR(INDEX($O2:$O986,MATCH(ROWS($Q$2:Q832),$R2:$R986,0)),\"\")","v":"W80020-451-M  W Lucie Mid"}]
[26,"W80021  ","305","M  ","W Lucie Chelsea","Loden","0-21033-48873-3","          ",5,null,{"v":77.5,"d":"$77.50"},{"v":155,"d":"$155.00"},{"v":154.95,"d":"$154.95"},0,"W80021-305-M  W Lucie Chelsea"," ",{"$f":"--ISNUMBER(IFERROR(SEARCH(Orders!$E18,O833,1),\"\"))","v":1},{"$f":"IF(Q833=1,COUNTIF($Q$2:Q833,1),\"\")","v":832},{"$f":"IFERROR(INDEX($O2:$O986,MATCH(ROWS($Q$2:Q833),$R2:$R986,0)),\"\")","v":"W80021-305-M  W Lucie Chelsea"}]
[26,"W80021  ","305","M  ","W Lucie Chelsea","Loden","0-21033-48874-0","          ",5.5,null,{"v":77.5,"d":"$77.50"},{"v":155,"d":"$155.00"},{"v":154.95,"d":"$154.95"},{"$f":"J834*K834","v":0},"W80021-305-M  W Lucie Chelsea"," ",{"$f":"--ISNUMBER(IFERROR(SEARCH(Orders!$E18,O834,1),\"\"))","v":1},{"$f":"IF(Q834=1,COUNTIF($Q$2:Q834,1),\"\")","v":833},{"$f":"IFERROR(INDEX($O2:$O986,MATCH(ROWS($Q$2:Q834),$R2:$R986,0)),\"\")","v":"W80021-305-M  W Lucie Chelsea"}]
[26,"W80021  ","305","M  ","W Lucie Chelsea","Loden","0-21033-48875-7","          ",6,null,{"v":77.5,"d":"$77.50"},{"v":155,"d":"$155.00"},{"v":154.95,"d":"$154.95"},0,"W80021-305-M  W Lucie Chelsea"," ",{"$f":"--ISNUMBER(IFERROR(SEARCH(Orders!$E18,O835,1),\"\"))","v":1},{"$f":"IF(Q835=1,COUNTIF($Q$2:Q835,1),\"\")","v":834},{"$f":"IFERROR(INDEX($O2:$O986,MATCH(ROWS($Q$2:Q835),$R2:$R986,0)),\"\")","v":"W80021-305-M  W Lucie Chelsea"}]
[26,"W80021  ","305","M  ","W Lucie Chelsea","Loden","0-21033-48876-4","          ",6.5,null,{"v":77.5,"d":"$77.50"},{"v":155,"d":"$155.00"},{"v":154.95,"d":"$154.95"},0,"W80021-305-M  W Lucie Chelsea"," ",{"$f":"--ISNUMBER(IFERROR(SEARCH(Orders!$E18,O836,1),\"\"))","v":1},{"$f":"IF(Q836=1,COUNTIF($Q$2:Q836,1),\"\")","v":835},{"$f":"IFERROR(INDEX($O2:$O986,MATCH(ROWS($Q$2:Q836),$R2:$R986,0)),\"\")","v":"W80021-305-M  W Lucie Chelsea"}]
[26,"W80021  ","305","M  ","W Lucie Chelsea","Loden","0-21033-48877-1","          ",7,null,{"v":77.5,"d":"$77.50"},{"v":155,"d":"$155.00"},{"v":154.95,"d":"$154.95"},0,"W80021-305-M  W Lucie Chelsea"," ",{"$f":"--ISNUMBER(IFERROR(SEARCH(Orders!$E18,O837,1),\"\"))","v":1},{"$f":"IF(Q837=1,COUNTIF($Q$2:Q837,1),\"\")","v":836},{"$f":"IFERROR(INDEX($O2:$O986,MATCH(ROWS($Q$2:Q837),$R2:$R986,0)),\"\")","v":"W80021-305-M  W Lucie Chelsea"}]
[26,"W80021  ","305","M  ","W Lucie Chelsea","Loden","0-21033-48878-8","          ",7.5,null,{"v":77.5,"d":"$77.50"},{"v":155,"d":"$155.00"},{"v":154.95,"d":"$154.95"},0,"W80021-305-M  W Lucie Chelsea"," ",{"$f":"--ISNUMBER(IFERROR(SEARCH(Orders!$E18,O838,1),\"\"))","v":1},{"$f":"IF(Q838=1,COUNTIF($Q$2:Q838,1),\"\")","v":837},{"$f":"IFERROR(INDEX($O2:$O986,MATCH(ROWS($Q$2:Q838),$R2:$R986,0)),\"\")","v":"W80021-305-M  W Lucie Chelsea"}]
[26,"W80021  ","305","M  ","W Lucie Chelsea","Loden","0-21033-48879-5","          ",8,null,{"v":77.5,"d":"$77.50"},{"v":155,"d":"$155.00"},{"v":154.95,"d":"$154.95"},0,"W80021-305-M  W Lucie Chelsea"," ",{"$f":"--ISNUMBER(IFERROR(SEARCH(Orders!$E18,O839,1),\"\"))","v":1},{"$f":"IF(Q839=1,COUNTIF($Q$2:Q839,1),\"\")","v":838},{"$f":"IFERROR(INDEX($O2:$O986,MATCH(ROWS($Q$2:Q839),$R2:$R986,0)),\"\")","v":"W80021-305-M  W Lucie Chelsea"}]
[26,"W80021  ","305","M  ","W Lucie Chelsea","Loden","0-21033-48880-1","          ",8.5,null,{"v":77.5,"d":"$77.50"},{"v":155,"d":"$155.00"},{"v":154.95,"d":"$154.95"},0,"W80021-305-M  W Lucie Chelsea"," ",{"$f":"--ISNUMBER(IFERROR(SEARCH(Orders!$E18,O840,1),\"\"))","v":1},{"$f":"IF(Q840=1,COUNTIF($Q$2:Q840,1),\"\")","v":839},{"$f":"IFERROR(INDEX($O2:$O986,MATCH(ROWS($Q$2:Q840),$R2:$R986,0)),\"\")","v":"W80021-305-M  W Lucie Chelsea"}]
[26,"W80021  ","305","M  ","W Lucie Chelsea","Loden","0-21033-48881-8","          ",9,null,{"v":77.5,"d":"$77.50"},{"v":155,"d":"$155.00"},{"v":154.95,"d":"$154.95"},0,"W80021-305-M  W Lucie Chelsea"," ",{"$f":"--ISNUMBER(IFERROR(SEARCH(Orders!$E18,O841,1),\"\"))","v":1},{"$f":"IF(Q841=1,COUNTIF($Q$2:Q841,1),\"\")","v":840},{"$f":"IFERROR(INDEX($O2:$O986,MATCH(ROWS($Q$2:Q841),$R2:$R986,0)),\"\")","v":"W80021-305-M  W Lucie Chelsea"}]
[26,"W80021  ","305","M  ","W Lucie Chelsea","Loden","0-21033-48882-5","          ",9.5,null,{"v":77.5,"d":"$77.50"},{"v":155,"d":"$155.00"},{"v":154.95,"d":"$154.95"},0,"W80021-305-M  W Lucie Chelsea"," ",{"$f":"--ISNUMBER(IFERROR(SEARCH(Orders!$E18,O842,1),\"\"))","v":1},{"$f":"IF(Q842=1,COUNTIF($Q$2:Q842,1),\"\")","v":841},{"$f":"IFERROR(INDEX($O2:$O986,MATCH(ROWS($Q$2:Q842),$R2:$R986,0)),\"\")","v":"W80021-305-M  W Lucie Chelsea"}]
[26,"W80021  ","305","M  ","W Lucie Chelsea","Loden","0-21033-48883-2","          ",10,null,{"v":77.5,"d":"$77.50"},{"v":155,"d":"$155.00"},{"v":154.95,"d":"$154.95"},0,"W80021-305-M  W Lucie Chelsea"," ",{"$f":"--ISNUMBER(IFERROR(SEARCH(Orders!$E18,O843,1),\"\"))","v":1},{"$f":"IF(Q843=1,COUNTIF($Q$2:Q843,1),\"\")","v":842},{"$f":"IFERROR(INDEX($O2:$O986,MATCH(ROWS($Q$2:Q843),$R2:$R986,0)),\"\")","v":"W80021-305-M  W Lucie Chelsea"}]
[26,"W80021  ","305","M  ","W Lucie Chelsea","Loden","0-21033-48884-9","          ",10.5,null,{"v":77.5,"d":"$77.50"},{"v":155,"d":"$155.00"},{"v":154.95,"d":"$154.95"},0,"W80021-305-M  W Lucie Chelsea"," ",{"$f":"--ISNUMBER(IFERROR(SEARCH(Orders!$E18,O844,1),\"\"))","v":1},{"$f":"IF(Q844=1,COUNTIF($Q$2:Q844,1),\"\")","v":843},{"$f":"IFERROR(INDEX($O2:$O986,MATCH(ROWS($Q$2:Q844),$R2:$R986,0)),\"\")","v":"W80021-305-M  W Lucie Chelsea"}]
[26,"W80021  ","305","M  ","W Lucie Chelsea","Loden","0-21033-48885-6","          ",11,null,{"v":77.5,"d":"$77.50"},{"v":155,"d":"$155.00"},{"v":154.95,"d":"$154.95"},0,"W80021-305-M  W Lucie Chelsea"," ",{"$f":"--ISNUMBER(IFERROR(SEARCH(Orders!$E18,O845,1),\"\"))","v":1},{"$f":"IF(Q845=1,COUNTIF($Q$2:Q845,1),\"\")","v":844},{"$f":"IFERROR(INDEX($O2:$O986,MATCH(ROWS($Q$2:Q845),$R2:$R986,0)),\"\")","v":"W80021-305-M  W Lucie Chelsea"}]
[26,"W80021  ","337","M  ","W Lucie Chelsea","Green Ash","0-21033-48886-3","          ",5,null,{"v":77.5,"d":"$77.50"},{"v":155,"d":"$155.00"},{"v":154.95,"d":"$154.95"},0,"W80021-337-M  W Lucie Chelsea"," ",{"$f":"--ISNUMBER(IFERROR(SEARCH(Orders!$E18,O846,1),\"\"))","v":1},{"$f":"IF(Q846=1,COUNTIF($Q$2:Q846,1),\"\")","v":845},{"$f":"IFERROR(INDEX($O2:$O986,MATCH(ROWS($Q$2:Q846),$R2:$R986,0)),\"\")","v":"W80021-337-M  W Lucie Chelsea"}]
[26,"W80021  ","337","M  ","W Lucie Chelsea","Green Ash","0-21033-48887-0","          ",5.5,null,{"v":77.5,"d":"$77.50"},{"v":155,"d":"$155.00"},{"v":154.95,"d":"$154.95"},0,"W80021-337-M  W Lucie Chelsea"," ",{"$f":"--ISNUMBER(IFERROR(SEARCH(Orders!$E18,O847,1),\"\"))","v":1},{"$f":"IF(Q847=1,COUNTIF($Q$2:Q847,1),\"\")","v":846},{"$f":"IFERROR(INDEX($O2:$O986,MATCH(ROWS($Q$2:Q847),$R2:$R986,0)),\"\")","v":"W80021-337-M  W Lucie Chelsea"}]
[26,"W80021  ","337","M  ","W Lucie Chelsea","Green Ash","0-21033-48888-7","          ",6,null,{"v":77.5,"d":"$77.50"},{"v":155,"d":"$155.00"},{"v":154.95,"d":"$154.95"},0,"W80021-337-M  W Lucie Chelsea"," ",{"$f":"--ISNUMBER(IFERROR(SEARCH(Orders!$E18,O848,1),\"\"))","v":1},{"$f":"IF(Q848=1,COUNTIF($Q$2:Q848,1),\"\")","v":847},{"$f":"IFERROR(INDEX($O2:$O986,MATCH(ROWS($Q$2:Q848),$R2:$R986,0)),\"\")","v":"W80021-337-M  W Lucie Chelsea"}]
[26,"W80021  ","337","M  ","W Lucie Chelsea","Green Ash","0-21033-48889-4","          ",6.5,null,{"v":77.5,"d":"$77.50"},{"v":155,"d":"$155.00"},{"v":154.95,"d":"$154.95"},0,"W80021-337-M  W Lucie Chelsea"," ",{"$f":"--ISNUMBER(IFERROR(SEARCH(Orders!$E18,O849,1),\"\"))","v":1},{"$f":"IF(Q849=1,COUNTIF($Q$2:Q849,1),\"\")","v":848},{"$f":"IFERROR(INDEX($O2:$O986,MATCH(ROWS($Q$2:Q849),$R2:$R986,0)),\"\")","v":"W80021-337-M  W Lucie Chelsea"}]
[26,"W80021  ","337","M  ","W Lucie Chelsea","Green Ash","0-21033-48890-0","          ",7,null,{"v":77.5,"d":"$77.50"},{"v":155,"d":"$155.00"},{"v":154.95,"d":"$154.95"},0,"W80021-337-M  W Lucie Chelsea"," ",{"$f":"--ISNUMBER(IFERROR(SEARCH(Orders!$E18,O850,1),\"\"))","v":1},{"$f":"IF(Q850=1,COUNTIF($Q$2:Q850,1),\"\")","v":849},{"$f":"IFERROR(INDEX($O2:$O986,MATCH(ROWS($Q$2:Q850),$R2:$R986,0)),\"\")","v":"W80021-337-M  W Lucie Chelsea"}]
[26,"W80021  ","337","M  ","W Lucie Chelsea","Green Ash","0-21033-48891-7","          ",7.5,null,{"v":77.5,"d":"$77.50"},{"v":155,"d":"$155.00"},{"v":154.95,"d":"$154.95"},0,"W80021-337-M  W Lucie Chelsea"," ",{"$f":"--ISNUMBER(IFERROR(SEARCH(Orders!$E18,O851,1),\"\"))","v":1},{"$f":"IF(Q851=1,COUNTIF($Q$2:Q851,1),\"\")","v":850},{"$f":"IFERROR(INDEX($O2:$O986,MATCH(ROWS($Q$2:Q851),$R2:$R986,0)),\"\")","v":"W80021-337-M  W Lucie Chelsea"}]
[26,"W80021  ","337","M  ","W Lucie Chelsea","Green Ash","0-21033-48892-4","          ",8,null,{"v":77.5,"d":"$77.50"},{"v":155,"d":"$155.00"},{"v":154.95,"d":"$154.95"},0,"W80021-337-M  W Lucie Chelsea"," ",{"$f":"--ISNUMBER(IFERROR(SEARCH(Orders!$E18,O852,1),\"\"))","v":1},{"$f":"IF(Q852=1,COUNTIF($Q$2:Q852,1),\"\")","v":851},{"$f":"IFERROR(INDEX($O2:$O986,MATCH(ROWS($Q$2:Q852),$R2:$R986,0)),\"\")","v":"W80021-337-M  W Lucie Chelsea"}]
[26,"W80021  ","337","M  ","W Lucie Chelsea","Green Ash","0-21033-48893-1","          ",8.5,null,{"v":77.5,"d":"$77.50"},{"v":155,"d":"$155.00"},{"v":154.95,"d":"$154.95"},0,"W80021-337-M  W Lucie Chelsea"," ",{"$f":"--ISNUMBER(IFERROR(SEARCH(Orders!$E18,O853,1),\"\"))","v":1},{"$f":"IF(Q853=1,COUNTIF($Q$2:Q853,1),\"\")","v":852},{"$f":"IFERROR(INDEX($O2:$O986,MATCH(ROWS($Q$2:Q853),$R2:$R986,0)),\"\")","v":"W80021-337-M  W Lucie Chelsea"}]
[26,"W80021  ","337","M  ","W Lucie Chelsea","Green Ash","0-21033-48894-8","          ",9,null,{"v":77.5,"d":"$77.50"},{"v":155,"d":"$155.00"},{"v":154.95,"d":"$154.95"},0,"W80021-337-M  W Lucie Chelsea"," ",{"$f":"--ISNUMBER(IFERROR(SEARCH(Orders!$E18,O854,1),\"\"))","v":1},{"$f":"IF(Q854=1,COUNTIF($Q$2:Q854,1),\"\")","v":853},{"$f":"IFERROR(INDEX($O2:$O986,MATCH(ROWS($Q$2:Q854),$R2:$R986,0)),\"\")","v":"W80021-337-M  W Lucie Chelsea"}]
[26,"W80021  ","337","M  ","W Lucie Chelsea","Green Ash","0-21033-48895-5","          ",9.5,null,{"v":77.5,"d":"$77.50"},{"v":155,"d":"$155.00"},{"v":154.95,"d":"$154.95"},0,"W80021-337-M  W Lucie Chelsea"," ",{"$f":"--ISNUMBER(IFERROR(SEARCH(Orders!$E18,O855,1),\"\"))","v":1},{"$f":"IF(Q855=1,COUNTIF($Q$2:Q855,1),\"\")","v":854},{"$f":"IFERROR(INDEX($O2:$O986,MATCH(ROWS($Q$2:Q855),$R2:$R986,0)),\"\")","v":"W80021-337-M  W Lucie Chelsea"}]
[26,"W80021  ","337","M  ","W Lucie Chelsea","Green Ash","0-21033-48896-2","          ",10,null,{"v":77.5,"d":"$77.50"},{"v":155,"d":"$155.00"},{"v":154.95,"d":"$154.95"},0,"W80021-337-M  W Lucie Chelsea"," ",{"$f":"--ISNUMBER(IFERROR(SEARCH(Orders!$E18,O856,1),\"\"))","v":1},{"$f":"IF(Q856=1,COUNTIF($Q$2:Q856,1),\"\")","v":855},{"$f":"IFERROR(INDEX($O2:$O986,MATCH(ROWS($Q$2:Q856),$R2:$R986,0)),\"\")","v":"W80021-337-M  W Lucie Chelsea"}]
[26,"W80021  ","337","M  ","W Lucie Chelsea","Green Ash","0-21033-48897-9","          ",10.5,null,{"v":77.5,"d":"$77.50"},{"v":155,"d":"$155.00"},{"v":154.95,"d":"$154.95"},0,"W80021-337-M  W Lucie Chelsea"," ",{"$f":"--ISNUMBER(IFERROR(SEARCH(Orders!$E18,O857,1),\"\"))","v":1},{"$f":"IF(Q857=1,COUNTIF($Q$2:Q857,1),\"\")","v":856},{"$f":"IFERROR(INDEX($O2:$O986,MATCH(ROWS($Q$2:Q857),$R2:$R986,0)),\"\")","v":"W80021-337-M  W Lucie Chelsea"}]
[26,"W80021  ","337","M  ","W Lucie Chelsea","Green Ash","0-21033-48898-6","          ",11,null,{"v":77.5,"d":"$77.50"},{"v":155,"d":"$155.00"},{"v":154.95,"d":"$154.95"},0,"W80021-337-M  W Lucie Chelsea"," ",{"$f":"--ISNUMBER(IFERROR(SEARCH(Orders!$E18,O858,1),\"\"))","v":1},{"$f":"IF(Q858=1,COUNTIF($Q$2:Q858,1),\"\")","v":857},{"$f":"IFERROR(INDEX($O2:$O986,MATCH(ROWS($Q$2:Q858),$R2:$R986,0)),\"\")","v":"W80021-337-M  W Lucie Chelsea"}]
[17,"W80024  ","337","M  ","W Thatcher Mid","Green Ash","0-21033-49461-1","          ",6,null,{"v":85,"d":"$85.00"},{"v":170,"d":"$170.00"},{"v":169.95,"d":"$169.95"},0,"W80024-337-M  W Thatcher Mid"," ",{"$f":"--ISNUMBER(IFERROR(SEARCH(Orders!$E18,O859,1),\"\"))","v":1},{"$f":"IF(Q859=1,COUNTIF($Q$2:Q859,1),\"\")","v":858},{"$f":"IFERROR(INDEX($O2:$O986,MATCH(ROWS($Q$2:Q859),$R2:$R986,0)),\"\")","v":"W80024-337-M  W Thatcher Mid"}]
[17,"W80024  ","337","M  ","W Thatcher Mid","Green Ash","0-21033-49462-8","          ",6.5,null,{"v":85,"d":"$85.00"},{"v":170,"d":"$170.00"},{"v":169.95,"d":"$169.95"},0,"W80024-337-M  W Thatcher Mid"," ",{"$f":"--ISNUMBER(IFERROR(SEARCH(Orders!$E18,O860,1),\"\"))","v":1},{"$f":"IF(Q860=1,COUNTIF($Q$2:Q860,1),\"\")","v":859},{"$f":"IFERROR(INDEX($O2:$O986,MATCH(ROWS($Q$2:Q860),$R2:$R986,0)),\"\")","v":"W80024-337-M  W Thatcher Mid"}]
[17,"W80024  ","337","M  ","W Thatcher Mid","Green Ash","0-21033-49463-5","          ",7,null,{"v":85,"d":"$85.00"},{"v":170,"d":"$170.00"},{"v":169.95,"d":"$169.95"},0,"W80024-337-M  W Thatcher Mid"," ",{"$f":"--ISNUMBER(IFERROR(SEARCH(Orders!$E18,O861,1),\"\"))","v":1},{"$f":"IF(Q861=1,COUNTIF($Q$2:Q861,1),\"\")","v":860},{"$f":"IFERROR(INDEX($O2:$O986,MATCH(ROWS($Q$2:Q861),$R2:$R986,0)),\"\")","v":"W80024-337-M  W Thatcher Mid"}]
[17,"W80024  ","337","M  ","W Thatcher Mid","Green Ash","0-21033-49464-2","          ",7.5,null,{"v":85,"d":"$85.00"},{"v":170,"d":"$170.00"},{"v":169.95,"d":"$169.95"},0,"W80024-337-M  W Thatcher Mid"," ",{"$f":"--ISNUMBER(IFERROR(SEARCH(Orders!$E18,O862,1),\"\"))","v":1},{"$f":"IF(Q862=1,COUNTIF($Q$2:Q862,1),\"\")","v":861},{"$f":"IFERROR(INDEX($O2:$O986,MATCH(ROWS($Q$2:Q862),$R2:$R986,0)),\"\")","v":"W80024-337-M  W Thatcher Mid"}]
[17,"W80024  ","337","M  ","W Thatcher Mid","Green Ash","0-21033-49465-9","          ",8,null,{"v":85,"d":"$85.00"},{"v":170,"d":"$170.00"},{"v":169.95,"d":"$169.95"},0,"W80024-337-M  W Thatcher Mid"," ",{"$f":"--ISNUMBER(IFERROR(SEARCH(Orders!$E18,O863,1),\"\"))","v":1},{"$f":"IF(Q863=1,COUNTIF($Q$2:Q863,1),\"\")","v":862},{"$f":"IFERROR(INDEX($O2:$O986,MATCH(ROWS($Q$2:Q863),$R2:$R986,0)),\"\")","v":"W80024-337-M  W Thatcher Mid"}]
[17,"W80024  ","337","M  ","W Thatcher Mid","Green Ash","0-21033-49466-6","          ",8.5,null,{"v":85,"d":"$85.00"},{"v":170,"d":"$170.00"},{"v":169.95,"d":"$169.95"},0,"W80024-337-M  W Thatcher Mid"," ",{"$f":"--ISNUMBER(IFERROR(SEARCH(Orders!$E18,O864,1),\"\"))","v":1},{"$f":"IF(Q864=1,COUNTIF($Q$2:Q864,1),\"\")","v":863},{"$f":"IFERROR(INDEX($O2:$O986,MATCH(ROWS($Q$2:Q864),$R2:$R986,0)),\"\")","v":"W80024-337-M  W Thatcher Mid"}]
[17,"W80024  ","337","M  ","W Thatcher Mid","Green Ash","0-21033-49467-3","          ",9,null,{"v":85,"d":"$85.00"},{"v":170,"d":"$170.00"},{"v":169.95,"d":"$169.95"},0,"W80024-337-M  W Thatcher Mid"," ",{"$f":"--ISNUMBER(IFERROR(SEARCH(Orders!$E18,O865,1),\"\"))","v":1},{"$f":"IF(Q865=1,COUNTIF($Q$2:Q865,1),\"\")","v":864},{"$f":"IFERROR(INDEX($O2:$O986,MATCH(ROWS($Q$2:Q865),$R2:$R986,0)),\"\")","v":"W80024-337-M  W Thatcher Mid"}]
[17,"W80024  ","337","M  ","W Thatcher Mid","Green Ash","0-21033-49468-0","          ",9.5,null,{"v":85,"d":"$85.00"},{"v":170,"d":"$170.00"},{"v":169.95,"d":"$169.95"},0,"W80024-337-M  W Thatcher Mid"," ",{"$f":"--ISNUMBER(IFERROR(SEARCH(Orders!$E18,O866,1),\"\"))","v":1},{"$f":"IF(Q866=1,COUNTIF($Q$2:Q866,1),\"\")","v":865},{"$f":"IFERROR(INDEX($O2:$O986,MATCH(ROWS($Q$2:Q866),$R2:$R986,0)),\"\")","v":"W80024-337-M  W Thatcher Mid"}]
[17,"W80024  ","337","M  ","W Thatcher Mid","Green Ash","0-21033-49469-7","          ",10,null,{"v":85,"d":"$85.00"},{"v":170,"d":"$170.00"},{"v":169.95,"d":"$169.95"},0,"W80024-337-M  W Thatcher Mid"," ",{"$f":"--ISNUMBER(IFERROR(SEARCH(Orders!$E18,O867,1),\"\"))","v":1},{"$f":"IF(Q867=1,COUNTIF($Q$2:Q867,1),\"\")","v":866},{"$f":"IFERROR(INDEX($O2:$O986,MATCH(ROWS($Q$2:Q867),$R2:$R986,0)),\"\")","v":"W80024-337-M  W Thatcher Mid"}]
[17,"W80024  ","337","M  ","W Thatcher Mid","Green Ash","0-21033-49470-3","          ",10.5,null,{"v":85,"d":"$85.00"},{"v":170,"d":"$170.00"},{"v":169.95,"d":"$169.95"},0,"W80024-337-M  W Thatcher Mid"," ",{"$f":"--ISNUMBER(IFERROR(SEARCH(Orders!$E18,O868,1),\"\"))","v":1},{"$f":"IF(Q868=1,COUNTIF($Q$2:Q868,1),\"\")","v":867},{"$f":"IFERROR(INDEX($O2:$O986,MATCH(ROWS($Q$2:Q868),$R2:$R986,0)),\"\")","v":"W80024-337-M  W Thatcher Mid"}]
[17,"W80024  ","337","M  ","W Thatcher Mid","Green Ash","0-21033-49471-0","          ",11,null,{"v":85,"d":"$85.00"},{"v":170,"d":"$170.00"},{"v":169.95,"d":"$169.95"},0,"W80024-337-M  W Thatcher Mid"," ",{"$f":"--ISNUMBER(IFERROR(SEARCH(Orders!$E18,O869,1),\"\"))","v":1},{"$f":"IF(Q869=1,COUNTIF($Q$2:Q869,1),\"\")","v":868},{"$f":"IFERROR(INDEX($O2:$O986,MATCH(ROWS($Q$2:Q869),$R2:$R986,0)),\"\")","v":"W80024-337-M  W Thatcher Mid"}]
[23,"W80025  ","030","M  ","W Patch Mid","Pewter","0-21033-49696-7","          ",5,null,{"v":85,"d":"$85.00"},{"v":170,"d":"$170.00"},{"v":169.95,"d":"$169.95"},0,"W80025-030-M  W Patch Mid"," ",{"$f":"--ISNUMBER(IFERROR(SEARCH(Orders!$E18,O870,1),\"\"))","v":1},{"$f":"IF(Q870=1,COUNTIF($Q$2:Q870,1),\"\")","v":869},{"$f":"IFERROR(INDEX($O2:$O986,MATCH(ROWS($Q$2:Q870),$R2:$R986,0)),\"\")","v":"W80025-030-M  W Patch Mid"}]
[23,"W80025  ","030","M  ","W Patch Mid","Pewter","0-21033-49697-4","          ",5.5,null,{"v":85,"d":"$85.00"},{"v":170,"d":"$170.00"},{"v":169.95,"d":"$169.95"},0,"W80025-030-M  W Patch Mid"," ",{"$f":"--ISNUMBER(IFERROR(SEARCH(Orders!$E18,O871,1),\"\"))","v":1},{"$f":"IF(Q871=1,COUNTIF($Q$2:Q871,1),\"\")","v":870},{"$f":"IFERROR(INDEX($O2:$O986,MATCH(ROWS($Q$2:Q871),$R2:$R986,0)),\"\")","v":"W80025-030-M  W Patch Mid"}]
[23,"W80025  ","030","M  ","W Patch Mid","Pewter","0-21033-49698-1","          ",6,null,{"v":85,"d":"$85.00"},{"v":170,"d":"$170.00"},{"v":169.95,"d":"$169.95"},0,"W80025-030-M  W Patch Mid"," ",{"$f":"--ISNUMBER(IFERROR(SEARCH(Orders!$E18,O872,1),\"\"))","v":1},{"$f":"IF(Q872=1,COUNTIF($Q$2:Q872,1),\"\")","v":871},{"$f":"IFERROR(INDEX($O2:$O986,MATCH(ROWS($Q$2:Q872),$R2:$R986,0)),\"\")","v":"W80025-030-M  W Patch Mid"}]
[23,"W80025  ","030","M  ","W Patch Mid","Pewter","0-21033-49699-8","          ",6.5,null,{"v":85,"d":"$85.00"},{"v":170,"d":"$170.00"},{"v":169.95,"d":"$169.95"},0,"W80025-030-M  W Patch Mid"," ",{"$f":"--ISNUMBER(IFERROR(SEARCH(Orders!$E18,O873,1),\"\"))","v":1},{"$f":"IF(Q873=1,COUNTIF($Q$2:Q873,1),\"\")","v":872},{"$f":"IFERROR(INDEX($O2:$O986,MATCH(ROWS($Q$2:Q873),$R2:$R986,0)),\"\")","v":"W80025-030-M  W Patch Mid"}]
[23,"W80025  ","030","M  ","W Patch Mid","Pewter","0-21033-49700-1","          ",7,null,{"v":85,"d":"$85.00"},{"v":170,"d":"$170.00"},{"v":169.95,"d":"$169.95"},0,"W80025-030-M  W Patch Mid"," ",{"$f":"--ISNUMBER(IFERROR(SEARCH(Orders!$E18,O874,1),\"\"))","v":1},{"$f":"IF(Q874=1,COUNTIF($Q$2:Q874,1),\"\")","v":873},{"$f":"IFERROR(INDEX($O2:$O986,MATCH(ROWS($Q$2:Q874),$R2:$R986,0)),\"\")","v":"W80025-030-M  W Patch Mid"}]
[23,"W80025  ","030","M  ","W Patch Mid","Pewter","0-21033-49701-8","          ",7.5,null,{"v":85,"d":"$85.00"},{"v":170,"d":"$170.00"},{"v":169.95,"d":"$169.95"},0,"W80025-030-M  W Patch Mid"," ",{"$f":"--ISNUMBER(IFERROR(SEARCH(Orders!$E18,O875,1),\"\"))","v":1},{"$f":"IF(Q875=1,COUNTIF($Q$2:Q875,1),\"\")","v":874},{"$f":"IFERROR(INDEX($O2:$O986,MATCH(ROWS($Q$2:Q875),$R2:$R986,0)),\"\")","v":"W80025-030-M  W Patch Mid"}]
[23,"W80025  ","030","M  ","W Patch Mid","Pewter","0-21033-49702-5","          ",8,null,{"v":85,"d":"$85.00"},{"v":170,"d":"$170.00"},{"v":169.95,"d":"$169.95"},0,"W80025-030-M  W Patch Mid"," ",{"$f":"--ISNUMBER(IFERROR(SEARCH(Orders!$E18,O876,1),\"\"))","v":1},{"$f":"IF(Q876=1,COUNTIF($Q$2:Q876,1),\"\")","v":875},{"$f":"IFERROR(INDEX($O2:$O986,MATCH(ROWS($Q$2:Q876),$R2:$R986,0)),\"\")","v":"W80025-030-M  W Patch Mid"}]
[23,"W80025  ","030","M  ","W Patch Mid","Pewter","0-21033-49703-2","          ",8.5,null,{"v":85,"d":"$85.00"},{"v":170,"d":"$170.00"},{"v":169.95,"d":"$169.95"},0,"W80025-030-M  W Patch Mid"," ",{"$f":"--ISNUMBER(IFERROR(SEARCH(Orders!$E18,O877,1),\"\"))","v":1},{"$f":"IF(Q877=1,COUNTIF($Q$2:Q877,1),\"\")","v":876},{"$f":"IFERROR(INDEX($O2:$O986,MATCH(ROWS($Q$2:Q877),$R2:$R986,0)),\"\")","v":"W80025-030-M  W Patch Mid"}]
[23,"W80025  ","030","M  ","W Patch Mid","Pewter","0-21033-49704-9","          ",9,null,{"v":85,"d":"$85.00"},{"v":170,"d":"$170.00"},{"v":169.95,"d":"$169.95"},0,"W80025-030-M  W Patch Mid"," ",{"$f":"--ISNUMBER(IFERROR(SEARCH(Orders!$E18,O878,1),\"\"))","v":1},{"$f":"IF(Q878=1,COUNTIF($Q$2:Q878,1),\"\")","v":877},{"$f":"IFERROR(INDEX($O2:$O986,MATCH(ROWS($Q$2:Q878),$R2:$R986,0)),\"\")","v":"W80025-030-M  W Patch Mid"}]
[23,"W80025  ","030","M  ","W Patch Mid","Pewter","0-21033-49705-6","          ",9.5,null,{"v":85,"d":"$85.00"},{"v":170,"d":"$170.00"},{"v":169.95,"d":"$169.95"},0,"W80025-030-M  W Patch Mid"," ",{"$f":"--ISNUMBER(IFERROR(SEARCH(Orders!$E18,O879,1),\"\"))","v":1},{"$f":"IF(Q879=1,COUNTIF($Q$2:Q879,1),\"\")","v":878},{"$f":"IFERROR(INDEX($O2:$O986,MATCH(ROWS($Q$2:Q879),$R2:$R986,0)),\"\")","v":"W80025-030-M  W Patch Mid"}]
[23,"W80025  ","030","M  ","W Patch Mid","Pewter","0-21033-49706-3","          ",10,null,{"v":85,"d":"$85.00"},{"v":170,"d":"$170.00"},{"v":169.95,"d":"$169.95"},0,"W80025-030-M  W Patch Mid"," ",{"$f":"--ISNUMBER(IFERROR(SEARCH(Orders!$E18,O880,1),\"\"))","v":1},{"$f":"IF(Q880=1,COUNTIF($Q$2:Q880,1),\"\")","v":879},{"$f":"IFERROR(INDEX($O2:$O986,MATCH(ROWS($Q$2:Q880),$R2:$R986,0)),\"\")","v":"W80025-030-M  W Patch Mid"}]
[23,"W80025  ","030","M  ","W Patch Mid","Pewter","0-21033-49707-0","          ",10.5,null,{"v":85,"d":"$85.00"},{"v":170,"d":"$170.00"},{"v":169.95,"d":"$169.95"},0,"W80025-030-M  W Patch Mid"," ",{"$f":"--ISNUMBER(IFERROR(SEARCH(Orders!$E18,O881,1),\"\"))","v":1},{"$f":"IF(Q881=1,COUNTIF($Q$2:Q881,1),\"\")","v":880},{"$f":"IFERROR(INDEX($O2:$O986,MATCH(ROWS($Q$2:Q881),$R2:$R986,0)),\"\")","v":"W80025-030-M  W Patch Mid"}]
[23,"W80025  ","030","M  ","W Patch Mid","Pewter","0-21033-49708-7","          ",11,null,{"v":85,"d":"$85.00"},{"v":170,"d":"$170.00"},{"v":169.95,"d":"$169.95"},0,"W80025-030-M  W Patch Mid"," ",{"$f":"--ISNUMBER(IFERROR(SEARCH(Orders!$E18,O882,1),\"\"))","v":1},{"$f":"IF(Q882=1,COUNTIF($Q$2:Q882,1),\"\")","v":881},{"$f":"IFERROR(INDEX($O2:$O986,MATCH(ROWS($Q$2:Q882),$R2:$R986,0)),\"\")","v":"W80025-030-M  W Patch Mid"}]
[21,"W80027  ","009","M  ","W Cascade Peak Low W","Blk Multi","0-21033-49709-4","          ",6,null,{"v":72.5,"d":"$72.50"},{"v":145,"d":"$145.00"},{"v":144.95,"d":"$144.95"},0,"W80027-009-M  W Cascade Peak Low W"," ",{"$f":"--ISNUMBER(IFERROR(SEARCH(Orders!$E18,O883,1),\"\"))","v":1},{"$f":"IF(Q883=1,COUNTIF($Q$2:Q883,1),\"\")","v":882},{"$f":"IFERROR(INDEX($O2:$O986,MATCH(ROWS($Q$2:Q883),$R2:$R986,0)),\"\")","v":"W80027-009-M  W Cascade Peak Low W"}]
[21,"W80027  ","009","M  ","W Cascade Peak Low W","Blk Multi","0-21033-49710-0","          ",6.5,null,{"v":72.5,"d":"$72.50"},{"v":145,"d":"$145.00"},{"v":144.95,"d":"$144.95"},0,"W80027-009-M  W Cascade Peak Low W"," ",{"$f":"--ISNUMBER(IFERROR(SEARCH(Orders!$E18,O884,1),\"\"))","v":1},{"$f":"IF(Q884=1,COUNTIF($Q$2:Q884,1),\"\")","v":883},{"$f":"IFERROR(INDEX($O2:$O986,MATCH(ROWS($Q$2:Q884),$R2:$R986,0)),\"\")","v":"W80027-009-M  W Cascade Peak Low W"}]
[21,"W80027  ","009","M  ","W Cascade Peak Low W","Blk Multi","0-21033-49711-7","          ",7,null,{"v":72.5,"d":"$72.50"},{"v":145,"d":"$145.00"},{"v":144.95,"d":"$144.95"},0,"W80027-009-M  W Cascade Peak Low W"," ",{"$f":"--ISNUMBER(IFERROR(SEARCH(Orders!$E18,O885,1),\"\"))","v":1},{"$f":"IF(Q885=1,COUNTIF($Q$2:Q885,1),\"\")","v":884},{"$f":"IFERROR(INDEX($O2:$O986,MATCH(ROWS($Q$2:Q885),$R2:$R986,0)),\"\")","v":"W80027-009-M  W Cascade Peak Low W"}]
[21,"W80027  ","009","M  ","W Cascade Peak Low W","Blk Multi","0-21033-49712-4","          ",7.5,null,{"v":72.5,"d":"$72.50"},{"v":145,"d":"$145.00"},{"v":144.95,"d":"$144.95"},0,"W80027-009-M  W Cascade Peak Low W"," ",{"$f":"--ISNUMBER(IFERROR(SEARCH(Orders!$E18,O886,1),\"\"))","v":1},{"$f":"IF(Q886=1,COUNTIF($Q$2:Q886,1),\"\")","v":885},{"$f":"IFERROR(INDEX($O2:$O986,MATCH(ROWS($Q$2:Q886),$R2:$R986,0)),\"\")","v":"W80027-009-M  W Cascade Peak Low W"}]
[21,"W80027  ","009","M  ","W Cascade Peak Low W","Blk Multi","0-21033-49713-1","          ",8,null,{"v":72.5,"d":"$72.50"},{"v":145,"d":"$145.00"},{"v":144.95,"d":"$144.95"},0,"W80027-009-M  W Cascade Peak Low W"," ",{"$f":"--ISNUMBER(IFERROR(SEARCH(Orders!$E18,O887,1),\"\"))","v":1},{"$f":"IF(Q887=1,COUNTIF($Q$2:Q887,1),\"\")","v":886},{"$f":"IFERROR(INDEX($O2:$O986,MATCH(ROWS($Q$2:Q887),$R2:$R986,0)),\"\")","v":"W80027-009-M  W Cascade Peak Low W"}]
[21,"W80027  ","009","M  ","W Cascade Peak Low W","Blk Multi","0-21033-49714-8","          ",8.5,null,{"v":72.5,"d":"$72.50"},{"v":145,"d":"$145.00"},{"v":144.95,"d":"$144.95"},0,"W80027-009-M  W Cascade Peak Low W"," ",{"$f":"--ISNUMBER(IFERROR(SEARCH(Orders!$E18,O888,1),\"\"))","v":1},{"$f":"IF(Q888=1,COUNTIF($Q$2:Q888,1),\"\")","v":887},{"$f":"IFERROR(INDEX($O2:$O986,MATCH(ROWS($Q$2:Q888),$R2:$R986,0)),\"\")","v":"W80027-009-M  W Cascade Peak Low W"}]
[21,"W80027  ","009","M  ","W Cascade Peak Low W","Blk Multi","0-21033-49715-5","          ",9,null,{"v":72.5,"d":"$72.50"},{"v":145,"d":"$145.00"},{"v":144.95,"d":"$144.95"},0,"W80027-009-M  W Cascade Peak Low W"," ",{"$f":"--ISNUMBER(IFERROR(SEARCH(Orders!$E18,O889,1),\"\"))","v":1},{"$f":"IF(Q889=1,COUNTIF($Q$2:Q889,1),\"\")","v":888},{"$f":"IFERROR(INDEX($O2:$O986,MATCH(ROWS($Q$2:Q889),$R2:$R986,0)),\"\")","v":"W80027-009-M  W Cascade Peak Low W"}]
[21,"W80027  ","009","M  ","W Cascade Peak Low W","Blk Multi","0-21033-49716-2","          ",9.5,null,{"v":72.5,"d":"$72.50"},{"v":145,"d":"$145.00"},{"v":144.95,"d":"$144.95"},0,"W80027-009-M  W Cascade Peak Low W"," ",{"$f":"--ISNUMBER(IFERROR(SEARCH(Orders!$E18,O890,1),\"\"))","v":1},{"$f":"IF(Q890=1,COUNTIF($Q$2:Q890,1),\"\")","v":889},{"$f":"IFERROR(INDEX($O2:$O986,MATCH(ROWS($Q$2:Q890),$R2:$R986,0)),\"\")","v":"W80027-009-M  W Cascade Peak Low W"}]
[21,"W80027  ","009","M  ","W Cascade Peak Low W","Blk Multi","0-21033-49717-9","          ",10,null,{"v":72.5,"d":"$72.50"},{"v":145,"d":"$145.00"},{"v":144.95,"d":"$144.95"},0,"W80027-009-M  W Cascade Peak Low W"," ",{"$f":"--ISNUMBER(IFERROR(SEARCH(Orders!$E18,O891,1),\"\"))","v":1},{"$f":"IF(Q891=1,COUNTIF($Q$2:Q891,1),\"\")","v":890},{"$f":"IFERROR(INDEX($O2:$O986,MATCH(ROWS($Q$2:Q891),$R2:$R986,0)),\"\")","v":"W80027-009-M  W Cascade Peak Low W"}]
[21,"W80027  ","009","M  ","W Cascade Peak Low W","Blk Multi","0-21033-49718-6","          ",10.5,null,{"v":72.5,"d":"$72.50"},{"v":145,"d":"$145.00"},{"v":144.95,"d":"$144.95"},0,"W80027-009-M  W Cascade Peak Low W"," ",{"$f":"--ISNUMBER(IFERROR(SEARCH(Orders!$E18,O892,1),\"\"))","v":1},{"$f":"IF(Q892=1,COUNTIF($Q$2:Q892,1),\"\")","v":891},{"$f":"IFERROR(INDEX($O2:$O986,MATCH(ROWS($Q$2:Q892),$R2:$R986,0)),\"\")","v":"W80027-009-M  W Cascade Peak Low W"}]
[21,"W80027  ","009","M  ","W Cascade Peak Low W","Blk Multi","0-21033-49719-3","          ",11,null,{"v":72.5,"d":"$72.50"},{"v":145,"d":"$145.00"},{"v":144.95,"d":"$144.95"},0,"W80027-009-M  W Cascade Peak Low W"," ",{"$f":"--ISNUMBER(IFERROR(SEARCH(Orders!$E18,O893,1),\"\"))","v":1},{"$f":"IF(Q893=1,COUNTIF($Q$2:Q893,1),\"\")","v":892},{"$f":"IFERROR(INDEX($O2:$O986,MATCH(ROWS($Q$2:Q893),$R2:$R986,0)),\"\")","v":"W80027-009-M  W Cascade Peak Low W"}]
[21,"W80027  ","275","M  ","W Cascade Peak Low W","Stone","0-21033-49720-9","          ",6,null,{"v":72.5,"d":"$72.50"},{"v":145,"d":"$145.00"},{"v":144.95,"d":"$144.95"},0,"W80027-275-M  W Cascade Peak Low W"," ",{"$f":"--ISNUMBER(IFERROR(SEARCH(Orders!$E18,O894,1),\"\"))","v":1},{"$f":"IF(Q894=1,COUNTIF($Q$2:Q894,1),\"\")","v":893},{"$f":"IFERROR(INDEX($O2:$O986,MATCH(ROWS($Q$2:Q894),$R2:$R986,0)),\"\")","v":"W80027-275-M  W Cascade Peak Low W"}]
[21,"W80027  ","275","M  ","W Cascade Peak Low W","Stone","0-21033-49721-6","          ",6.5,null,{"v":72.5,"d":"$72.50"},{"v":145,"d":"$145.00"},{"v":144.95,"d":"$144.95"},0,"W80027-275-M  W Cascade Peak Low W"," ",{"$f":"--ISNUMBER(IFERROR(SEARCH(Orders!$E18,O895,1),\"\"))","v":1},{"$f":"IF(Q895=1,COUNTIF($Q$2:Q895,1),\"\")","v":894},{"$f":"IFERROR(INDEX($O2:$O986,MATCH(ROWS($Q$2:Q895),$R2:$R986,0)),\"\")","v":"W80027-275-M  W Cascade Peak Low W"}]
[21,"W80027  ","275","M  ","W Cascade Peak Low W","Stone","0-21033-49722-3","          ",7,null,{"v":72.5,"d":"$72.50"},{"v":145,"d":"$145.00"},{"v":144.95,"d":"$144.95"},0,"W80027-275-M  W Cascade Peak Low W"," ",{"$f":"--ISNUMBER(IFERROR(SEARCH(Orders!$E18,O896,1),\"\"))","v":1},{"$f":"IF(Q896=1,COUNTIF($Q$2:Q896,1),\"\")","v":895},{"$f":"IFERROR(INDEX($O2:$O986,MATCH(ROWS($Q$2:Q896),$R2:$R986,0)),\"\")","v":"W80027-275-M  W Cascade Peak Low W"}]
[21,"W80027  ","275","M  ","W Cascade Peak Low W","Stone","0-21033-49723-0","          ",7.5,null,{"v":72.5,"d":"$72.50"},{"v":145,"d":"$145.00"},{"v":144.95,"d":"$144.95"},0,"W80027-275-M  W Cascade Peak Low W"," ",{"$f":"--ISNUMBER(IFERROR(SEARCH(Orders!$E18,O897,1),\"\"))","v":1},{"$f":"IF(Q897=1,COUNTIF($Q$2:Q897,1),\"\")","v":896},{"$f":"IFERROR(INDEX($O2:$O986,MATCH(ROWS($Q$2:Q897),$R2:$R986,0)),\"\")","v":"W80027-275-M  W Cascade Peak Low W"}]
[21,"W80027  ","275","M  ","W Cascade Peak Low W","Stone","0-21033-49724-7","          ",8,null,{"v":72.5,"d":"$72.50"},{"v":145,"d":"$145.00"},{"v":144.95,"d":"$144.95"},{"$f":"J898*K898","v":0},"W80027-275-M  W Cascade Peak Low W"," ",{"$f":"--ISNUMBER(IFERROR(SEARCH(Orders!$E18,O898,1),\"\"))","v":1},{"$f":"IF(Q898=1,COUNTIF($Q$2:Q898,1),\"\")","v":897},{"$f":"IFERROR(INDEX($O2:$O986,MATCH(ROWS($Q$2:Q898),$R2:$R986,0)),\"\")","v":"W80027-275-M  W Cascade Peak Low W"}]
[21,"W80027  ","275","M  ","W Cascade Peak Low W","Stone","0-21033-49725-4","          ",8.5,null,{"v":72.5,"d":"$72.50"},{"v":145,"d":"$145.00"},{"v":144.95,"d":"$144.95"},0,"W80027-275-M  W Cascade Peak Low W"," ",{"$f":"--ISNUMBER(IFERROR(SEARCH(Orders!$E18,O899,1),\"\"))","v":1},{"$f":"IF(Q899=1,COUNTIF($Q$2:Q899,1),\"\")","v":898},{"$f":"IFERROR(INDEX($O2:$O986,MATCH(ROWS($Q$2:Q899),$R2:$R986,0)),\"\")","v":"W80027-275-M  W Cascade Peak Low W"}]
[21,"W80027  ","275","M  ","W Cascade Peak Low W","Stone","0-21033-49726-1","          ",9,null,{"v":72.5,"d":"$72.50"},{"v":145,"d":"$145.00"},{"v":144.95,"d":"$144.95"},0,"W80027-275-M  W Cascade Peak Low W"," ",{"$f":"--ISNUMBER(IFERROR(SEARCH(Orders!$E18,O900,1),\"\"))","v":1},{"$f":"IF(Q900=1,COUNTIF($Q$2:Q900,1),\"\")","v":899},{"$f":"IFERROR(INDEX($O2:$O986,MATCH(ROWS($Q$2:Q900),$R2:$R986,0)),\"\")","v":"W80027-275-M  W Cascade Peak Low W"}]
[21,"W80027  ","275","M  ","W Cascade Peak Low W","Stone","0-21033-49727-8","          ",9.5,null,{"v":72.5,"d":"$72.50"},{"v":145,"d":"$145.00"},{"v":144.95,"d":"$144.95"},0,"W80027-275-M  W Cascade Peak Low W"," ",{"$f":"--ISNUMBER(IFERROR(SEARCH(Orders!$E18,O901,1),\"\"))","v":1},{"$f":"IF(Q901=1,COUNTIF($Q$2:Q901,1),\"\")","v":900},{"$f":"IFERROR(INDEX($O2:$O986,MATCH(ROWS($Q$2:Q901),$R2:$R986,0)),\"\")","v":"W80027-275-M  W Cascade Peak Low W"}]
[21,"W80027  ","275","M  ","W Cascade Peak Low W","Stone","0-21033-49728-5","          ",10,null,{"v":72.5,"d":"$72.50"},{"v":145,"d":"$145.00"},{"v":144.95,"d":"$144.95"},0,"W80027-275-M  W Cascade Peak Low W"," ",{"$f":"--ISNUMBER(IFERROR(SEARCH(Orders!$E18,O902,1),\"\"))","v":1},{"$f":"IF(Q902=1,COUNTIF($Q$2:Q902,1),\"\")","v":901},{"$f":"IFERROR(INDEX($O2:$O986,MATCH(ROWS($Q$2:Q902),$R2:$R986,0)),\"\")","v":"W80027-275-M  W Cascade Peak Low W"}]
[21,"W80027  ","275","M  ","W Cascade Peak Low W","Stone","0-21033-49729-2","          ",10.5,null,{"v":72.5,"d":"$72.50"},{"v":145,"d":"$145.00"},{"v":144.95,"d":"$144.95"},0,"W80027-275-M  W Cascade Peak Low W"," ",{"$f":"--ISNUMBER(IFERROR(SEARCH(Orders!$E18,O903,1),\"\"))","v":1},{"$f":"IF(Q903=1,COUNTIF($Q$2:Q903,1),\"\")","v":902},{"$f":"IFERROR(INDEX($O2:$O986,MATCH(ROWS($Q$2:Q903),$R2:$R986,0)),\"\")","v":"W80027-275-M  W Cascade Peak Low W"}]
[21,"W80027  ","275","M  ","W Cascade Peak Low W","Stone","0-21033-49730-8","          ",11,null,{"v":72.5,"d":"$72.50"},{"v":145,"d":"$145.00"},{"v":144.95,"d":"$144.95"},0,"W80027-275-M  W Cascade Peak Low W"," ",{"$f":"--ISNUMBER(IFERROR(SEARCH(Orders!$E18,O904,1),\"\"))","v":1},{"$f":"IF(Q904=1,COUNTIF($Q$2:Q904,1),\"\")","v":903},{"$f":"IFERROR(INDEX($O2:$O986,MATCH(ROWS($Q$2:Q904),$R2:$R986,0)),\"\")","v":"W80027-275-M  W Cascade Peak Low W"}]
[21,"W80027  ","410","M  ","W Cascade Peak Low W","Navy","0-21033-49731-5","          ",6,null,{"v":72.5,"d":"$72.50"},{"v":145,"d":"$145.00"},{"v":144.95,"d":"$144.95"},0,"W80027-410-M  W Cascade Peak Low W"," ",{"$f":"--ISNUMBER(IFERROR(SEARCH(Orders!$E18,O905,1),\"\"))","v":1},{"$f":"IF(Q905=1,COUNTIF($Q$2:Q905,1),\"\")","v":904},{"$f":"IFERROR(INDEX($O2:$O986,MATCH(ROWS($Q$2:Q905),$R2:$R986,0)),\"\")","v":"W80027-410-M  W Cascade Peak Low W"}]
[21,"W80027  ","410","M  ","W Cascade Peak Low W","Navy","0-21033-49732-2","          ",6.5,null,{"v":72.5,"d":"$72.50"},{"v":145,"d":"$145.00"},{"v":144.95,"d":"$144.95"},0,"W80027-410-M  W Cascade Peak Low W"," ",{"$f":"--ISNUMBER(IFERROR(SEARCH(Orders!$E18,O906,1),\"\"))","v":1},{"$f":"IF(Q906=1,COUNTIF($Q$2:Q906,1),\"\")","v":905},{"$f":"IFERROR(INDEX($O2:$O986,MATCH(ROWS($Q$2:Q906),$R2:$R986,0)),\"\")","v":"W80027-410-M  W Cascade Peak Low W"}]
[21,"W80027  ","410","M  ","W Cascade Peak Low W","Navy","0-21033-49733-9","          ",7,null,{"v":72.5,"d":"$72.50"},{"v":145,"d":"$145.00"},{"v":144.95,"d":"$144.95"},0,"W80027-410-M  W Cascade Peak Low W"," ",{"$f":"--ISNUMBER(IFERROR(SEARCH(Orders!$E18,O907,1),\"\"))","v":1},{"$f":"IF(Q907=1,COUNTIF($Q$2:Q907,1),\"\")","v":906},{"$f":"IFERROR(INDEX($O2:$O986,MATCH(ROWS($Q$2:Q907),$R2:$R986,0)),\"\")","v":"W80027-410-M  W Cascade Peak Low W"}]
[21,"W80027  ","410","M  ","W Cascade Peak Low W","Navy","0-21033-49734-6","          ",7.5,null,{"v":72.5,"d":"$72.50"},{"v":145,"d":"$145.00"},{"v":144.95,"d":"$144.95"},0,"W80027-410-M  W Cascade Peak Low W"," ",{"$f":"--ISNUMBER(IFERROR(SEARCH(Orders!$E18,O908,1),\"\"))","v":1},{"$f":"IF(Q908=1,COUNTIF($Q$2:Q908,1),\"\")","v":907},{"$f":"IFERROR(INDEX($O2:$O986,MATCH(ROWS($Q$2:Q908),$R2:$R986,0)),\"\")","v":"W80027-410-M  W Cascade Peak Low W"}]
[21,"W80027  ","410","M  ","W Cascade Peak Low W","Navy","0-21033-49735-3","          ",8,null,{"v":72.5,"d":"$72.50"},{"v":145,"d":"$145.00"},{"v":144.95,"d":"$144.95"},0,"W80027-410-M  W Cascade Peak Low W"," ",{"$f":"--ISNUMBER(IFERROR(SEARCH(Orders!$E18,O909,1),\"\"))","v":1},{"$f":"IF(Q909=1,COUNTIF($Q$2:Q909,1),\"\")","v":908},{"$f":"IFERROR(INDEX($O2:$O986,MATCH(ROWS($Q$2:Q909),$R2:$R986,0)),\"\")","v":"W80027-410-M  W Cascade Peak Low W"}]
[21,"W80027  ","410","M  ","W Cascade Peak Low W","Navy","0-21033-49736-0","          ",8.5,null,{"v":72.5,"d":"$72.50"},{"v":145,"d":"$145.00"},{"v":144.95,"d":"$144.95"},0,"W80027-410-M  W Cascade Peak Low W"," ",{"$f":"--ISNUMBER(IFERROR(SEARCH(Orders!$E18,O910,1),\"\"))","v":1},{"$f":"IF(Q910=1,COUNTIF($Q$2:Q910,1),\"\")","v":909},{"$f":"IFERROR(INDEX($O2:$O986,MATCH(ROWS($Q$2:Q910),$R2:$R986,0)),\"\")","v":"W80027-410-M  W Cascade Peak Low W"}]
[21,"W80027  ","410","M  ","W Cascade Peak Low W","Navy","0-21033-49737-7","          ",9,null,{"v":72.5,"d":"$72.50"},{"v":145,"d":"$145.00"},{"v":144.95,"d":"$144.95"},0,"W80027-410-M  W Cascade Peak Low W"," ",{"$f":"--ISNUMBER(IFERROR(SEARCH(Orders!$E18,O911,1),\"\"))","v":1},{"$f":"IF(Q911=1,COUNTIF($Q$2:Q911,1),\"\")","v":910},{"$f":"IFERROR(INDEX($O2:$O986,MATCH(ROWS($Q$2:Q911),$R2:$R986,0)),\"\")","v":"W80027-410-M  W Cascade Peak Low W"}]
[21,"W80027  ","410","M  ","W Cascade Peak Low W","Navy","0-21033-49738-4","          ",9.5,null,{"v":72.5,"d":"$72.50"},{"v":145,"d":"$145.00"},{"v":144.95,"d":"$144.95"},0,"W80027-410-M  W Cascade Peak Low W"," ",{"$f":"--ISNUMBER(IFERROR(SEARCH(Orders!$E18,O912,1),\"\"))","v":1},{"$f":"IF(Q912=1,COUNTIF($Q$2:Q912,1),\"\")","v":911},{"$f":"IFERROR(INDEX($O2:$O986,MATCH(ROWS($Q$2:Q912),$R2:$R986,0)),\"\")","v":"W80027-410-M  W Cascade Peak Low W"}]
[21,"W80027  ","410","M  ","W Cascade Peak Low W","Navy","0-21033-49739-1","          ",10,null,{"v":72.5,"d":"$72.50"},{"v":145,"d":"$145.00"},{"v":144.95,"d":"$144.95"},0,"W80027-410-M  W Cascade Peak Low W"," ",{"$f":"--ISNUMBER(IFERROR(SEARCH(Orders!$E18,O913,1),\"\"))","v":1},{"$f":"IF(Q913=1,COUNTIF($Q$2:Q913,1),\"\")","v":912},{"$f":"IFERROR(INDEX($O2:$O986,MATCH(ROWS($Q$2:Q913),$R2:$R986,0)),\"\")","v":"W80027-410-M  W Cascade Peak Low W"}]
[21,"W80027  ","410","M  ","W Cascade Peak Low W","Navy","0-21033-49740-7","          ",10.5,null,{"v":72.5,"d":"$72.50"},{"v":145,"d":"$145.00"},{"v":144.95,"d":"$144.95"},0,"W80027-410-M  W Cascade Peak Low W"," ",{"$f":"--ISNUMBER(IFERROR(SEARCH(Orders!$E18,O914,1),\"\"))","v":1},{"$f":"IF(Q914=1,COUNTIF($Q$2:Q914,1),\"\")","v":913},{"$f":"IFERROR(INDEX($O2:$O986,MATCH(ROWS($Q$2:Q914),$R2:$R986,0)),\"\")","v":"W80027-410-M  W Cascade Peak Low W"}]
[21,"W80027  ","410","M  ","W Cascade Peak Low W","Navy","0-21033-49741-4","          ",11,null,{"v":72.5,"d":"$72.50"},{"v":145,"d":"$145.00"},{"v":144.95,"d":"$144.95"},0,"W80027-410-M  W Cascade Peak Low W"," ",{"$f":"--ISNUMBER(IFERROR(SEARCH(Orders!$E18,O915,1),\"\"))","v":1},{"$f":"IF(Q915=1,COUNTIF($Q$2:Q915,1),\"\")","v":914},{"$f":"IFERROR(INDEX($O2:$O986,MATCH(ROWS($Q$2:Q915),$R2:$R986,0)),\"\")","v":"W80027-410-M  W Cascade Peak Low W"}]
[25,"W80029  ","013","M  ","W Rosie Mid","Charcoal","0-21033-49775-9","          ",6,null,{"v":80,"d":"$80.00"},{"v":160,"d":"$160.00"},{"v":159.95,"d":"$159.95"},0,"W80029-013-M  W Rosie Mid"," ",{"$f":"--ISNUMBER(IFERROR(SEARCH(Orders!$E18,O916,1),\"\"))","v":1},{"$f":"IF(Q916=1,COUNTIF($Q$2:Q916,1),\"\")","v":915},{"$f":"IFERROR(INDEX($O2:$O986,MATCH(ROWS($Q$2:Q916),$R2:$R986,0)),\"\")","v":"W80029-013-M  W Rosie Mid"}]
[25,"W80029  ","013","M  ","W Rosie Mid","Charcoal","0-21033-49776-6","          ",6.5,null,{"v":80,"d":"$80.00"},{"v":160,"d":"$160.00"},{"v":159.95,"d":"$159.95"},0,"W80029-013-M  W Rosie Mid"," ",{"$f":"--ISNUMBER(IFERROR(SEARCH(Orders!$E18,O917,1),\"\"))","v":1},{"$f":"IF(Q917=1,COUNTIF($Q$2:Q917,1),\"\")","v":916},{"$f":"IFERROR(INDEX($O2:$O986,MATCH(ROWS($Q$2:Q917),$R2:$R986,0)),\"\")","v":"W80029-013-M  W Rosie Mid"}]
[25,"W80029  ","013","M  ","W Rosie Mid","Charcoal","0-21033-49777-3","          ",7,null,{"v":80,"d":"$80.00"},{"v":160,"d":"$160.00"},{"v":159.95,"d":"$159.95"},0,"W80029-013-M  W Rosie Mid"," ",{"$f":"--ISNUMBER(IFERROR(SEARCH(Orders!$E18,O918,1),\"\"))","v":1},{"$f":"IF(Q918=1,COUNTIF($Q$2:Q918,1),\"\")","v":917},{"$f":"IFERROR(INDEX($O2:$O986,MATCH(ROWS($Q$2:Q918),$R2:$R986,0)),\"\")","v":"W80029-013-M  W Rosie Mid"}]
[25,"W80029  ","013","M  ","W Rosie Mid","Charcoal","0-21033-49778-0","          ",7.5,null,{"v":80,"d":"$80.00"},{"v":160,"d":"$160.00"},{"v":159.95,"d":"$159.95"},0,"W80029-013-M  W Rosie Mid"," ",{"$f":"--ISNUMBER(IFERROR(SEARCH(Orders!$E18,O919,1),\"\"))","v":1},{"$f":"IF(Q919=1,COUNTIF($Q$2:Q919,1),\"\")","v":918},{"$f":"IFERROR(INDEX($O2:$O986,MATCH(ROWS($Q$2:Q919),$R2:$R986,0)),\"\")","v":"W80029-013-M  W Rosie Mid"}]
[25,"W80029  ","013","M  ","W Rosie Mid","Charcoal","0-21033-49779-7","          ",8,null,{"v":80,"d":"$80.00"},{"v":160,"d":"$160.00"},{"v":159.95,"d":"$159.95"},0,"W80029-013-M  W Rosie Mid"," ",{"$f":"--ISNUMBER(IFERROR(SEARCH(Orders!$E18,O920,1),\"\"))","v":1},{"$f":"IF(Q920=1,COUNTIF($Q$2:Q920,1),\"\")","v":919},{"$f":"IFERROR(INDEX($O2:$O986,MATCH(ROWS($Q$2:Q920),$R2:$R986,0)),\"\")","v":"W80029-013-M  W Rosie Mid"}]
[25,"W80029  ","013","M  ","W Rosie Mid","Charcoal","0-21033-49780-3","          ",8.5,null,{"v":80,"d":"$80.00"},{"v":160,"d":"$160.00"},{"v":159.95,"d":"$159.95"},0,"W80029-013-M  W Rosie Mid"," ",{"$f":"--ISNUMBER(IFERROR(SEARCH(Orders!$E18,O921,1),\"\"))","v":1},{"$f":"IF(Q921=1,COUNTIF($Q$2:Q921,1),\"\")","v":920},{"$f":"IFERROR(INDEX($O2:$O986,MATCH(ROWS($Q$2:Q921),$R2:$R986,0)),\"\")","v":"W80029-013-M  W Rosie Mid"}]
[25,"W80029  ","013","M  ","W Rosie Mid","Charcoal","0-21033-49781-0","          ",9,null,{"v":80,"d":"$80.00"},{"v":160,"d":"$160.00"},{"v":159.95,"d":"$159.95"},0,"W80029-013-M  W Rosie Mid"," ",{"$f":"--ISNUMBER(IFERROR(SEARCH(Orders!$E18,O922,1),\"\"))","v":1},{"$f":"IF(Q922=1,COUNTIF($Q$2:Q922,1),\"\")","v":921},{"$f":"IFERROR(INDEX($O2:$O986,MATCH(ROWS($Q$2:Q922),$R2:$R986,0)),\"\")","v":"W80029-013-M  W Rosie Mid"}]
[25,"W80029  ","013","M  ","W Rosie Mid","Charcoal","0-21033-49782-7","          ",9.5,null,{"v":80,"d":"$80.00"},{"v":160,"d":"$160.00"},{"v":159.95,"d":"$159.95"},0,"W80029-013-M  W Rosie Mid"," ",{"$f":"--ISNUMBER(IFERROR(SEARCH(Orders!$E18,O923,1),\"\"))","v":1},{"$f":"IF(Q923=1,COUNTIF($Q$2:Q923,1),\"\")","v":922},{"$f":"IFERROR(INDEX($O2:$O986,MATCH(ROWS($Q$2:Q923),$R2:$R986,0)),\"\")","v":"W80029-013-M  W Rosie Mid"}]
[25,"W80029  ","013","M  ","W Rosie Mid","Charcoal","0-21033-49783-4","          ",10,null,{"v":80,"d":"$80.00"},{"v":160,"d":"$160.00"},{"v":159.95,"d":"$159.95"},0,"W80029-013-M  W Rosie Mid"," ",{"$f":"--ISNUMBER(IFERROR(SEARCH(Orders!$E18,O924,1),\"\"))","v":1},{"$f":"IF(Q924=1,COUNTIF($Q$2:Q924,1),\"\")","v":923},{"$f":"IFERROR(INDEX($O2:$O986,MATCH(ROWS($Q$2:Q924),$R2:$R986,0)),\"\")","v":"W80029-013-M  W Rosie Mid"}]
[25,"W80029  ","013","M  ","W Rosie Mid","Charcoal","0-21033-49784-1","          ",10.5,null,{"v":80,"d":"$80.00"},{"v":160,"d":"$160.00"},{"v":159.95,"d":"$159.95"},0,"W80029-013-M  W Rosie Mid"," ",{"$f":"--ISNUMBER(IFERROR(SEARCH(Orders!$E18,O925,1),\"\"))","v":1},{"$f":"IF(Q925=1,COUNTIF($Q$2:Q925,1),\"\")","v":924},{"$f":"IFERROR(INDEX($O2:$O986,MATCH(ROWS($Q$2:Q925),$R2:$R986,0)),\"\")","v":"W80029-013-M  W Rosie Mid"}]
[25,"W80029  ","013","M  ","W Rosie Mid","Charcoal","0-21033-49785-8","          ",11,null,{"v":80,"d":"$80.00"},{"v":160,"d":"$160.00"},{"v":159.95,"d":"$159.95"},0,"W80029-013-M  W Rosie Mid"," ",{"$f":"--ISNUMBER(IFERROR(SEARCH(Orders!$E18,O926,1),\"\"))","v":1},{"$f":"IF(Q926=1,COUNTIF($Q$2:Q926,1),\"\")","v":925},{"$f":"IFERROR(INDEX($O2:$O986,MATCH(ROWS($Q$2:Q926),$R2:$R986,0)),\"\")","v":"W80029-013-M  W Rosie Mid"}]
[25,"W80029  ","235","M  ","W Rosie Mid","Toffee","0-21033-49786-5","          ",6,null,{"v":80,"d":"$80.00"},{"v":160,"d":"$160.00"},{"v":159.95,"d":"$159.95"},0,"W80029-235-M  W Rosie Mid"," ",{"$f":"--ISNUMBER(IFERROR(SEARCH(Orders!$E18,O927,1),\"\"))","v":1},{"$f":"IF(Q927=1,COUNTIF($Q$2:Q927,1),\"\")","v":926},{"$f":"IFERROR(INDEX($O2:$O986,MATCH(ROWS($Q$2:Q927),$R2:$R986,0)),\"\")","v":"W80029-235-M  W Rosie Mid"}]
[25,"W80029  ","235","M  ","W Rosie Mid","Toffee","0-21033-49787-2","          ",6.5,null,{"v":80,"d":"$80.00"},{"v":160,"d":"$160.00"},{"v":159.95,"d":"$159.95"},0,"W80029-235-M  W Rosie Mid"," ",{"$f":"--ISNUMBER(IFERROR(SEARCH(Orders!$E18,O928,1),\"\"))","v":1},{"$f":"IF(Q928=1,COUNTIF($Q$2:Q928,1),\"\")","v":927},{"$f":"IFERROR(INDEX($O2:$O986,MATCH(ROWS($Q$2:Q928),$R2:$R986,0)),\"\")","v":"W80029-235-M  W Rosie Mid"}]
[25,"W80029  ","235","M  ","W Rosie Mid","Toffee","0-21033-49788-9","          ",7,null,{"v":80,"d":"$80.00"},{"v":160,"d":"$160.00"},{"v":159.95,"d":"$159.95"},0,"W80029-235-M  W Rosie Mid"," ",{"$f":"--ISNUMBER(IFERROR(SEARCH(Orders!$E18,O929,1),\"\"))","v":1},{"$f":"IF(Q929=1,COUNTIF($Q$2:Q929,1),\"\")","v":928},{"$f":"IFERROR(INDEX($O2:$O986,MATCH(ROWS($Q$2:Q929),$R2:$R986,0)),\"\")","v":"W80029-235-M  W Rosie Mid"}]
[25,"W80029  ","235","M  ","W Rosie Mid","Toffee","0-21033-49789-6","          ",7.5,null,{"v":80,"d":"$80.00"},{"v":160,"d":"$160.00"},{"v":159.95,"d":"$159.95"},0,"W80029-235-M  W Rosie Mid"," ",{"$f":"--ISNUMBER(IFERROR(SEARCH(Orders!$E18,O930,1),\"\"))","v":1},{"$f":"IF(Q930=1,COUNTIF($Q$2:Q930,1),\"\")","v":929},{"$f":"IFERROR(INDEX($O2:$O986,MATCH(ROWS($Q$2:Q930),$R2:$R986,0)),\"\")","v":"W80029-235-M  W Rosie Mid"}]
[25,"W80029  ","235","M  ","W Rosie Mid","Toffee","0-21033-49790-2","          ",8,null,{"v":80,"d":"$80.00"},{"v":160,"d":"$160.00"},{"v":159.95,"d":"$159.95"},0,"W80029-235-M  W Rosie Mid"," ",{"$f":"--ISNUMBER(IFERROR(SEARCH(Orders!$E18,O931,1),\"\"))","v":1},{"$f":"IF(Q931=1,COUNTIF($Q$2:Q931,1),\"\")","v":930},{"$f":"IFERROR(INDEX($O2:$O986,MATCH(ROWS($Q$2:Q931),$R2:$R986,0)),\"\")","v":"W80029-235-M  W Rosie Mid"}]
[25,"W80029  ","235","M  ","W Rosie Mid","Toffee","0-21033-49791-9","          ",8.5,null,{"v":80,"d":"$80.00"},{"v":160,"d":"$160.00"},{"v":159.95,"d":"$159.95"},0,"W80029-235-M  W Rosie Mid"," ",{"$f":"--ISNUMBER(IFERROR(SEARCH(Orders!$E18,O932,1),\"\"))","v":1},{"$f":"IF(Q932=1,COUNTIF($Q$2:Q932,1),\"\")","v":931},{"$f":"IFERROR(INDEX($O2:$O986,MATCH(ROWS($Q$2:Q932),$R2:$R986,0)),\"\")","v":"W80029-235-M  W Rosie Mid"}]
[25,"W80029  ","235","M  ","W Rosie Mid","Toffee","0-21033-49792-6","          ",9,null,{"v":80,"d":"$80.00"},{"v":160,"d":"$160.00"},{"v":159.95,"d":"$159.95"},0,"W80029-235-M  W Rosie Mid"," ",{"$f":"--ISNUMBER(IFERROR(SEARCH(Orders!$E18,O933,1),\"\"))","v":1},{"$f":"IF(Q933=1,COUNTIF($Q$2:Q933,1),\"\")","v":932},{"$f":"IFERROR(INDEX($O2:$O986,MATCH(ROWS($Q$2:Q933),$R2:$R986,0)),\"\")","v":"W80029-235-M  W Rosie Mid"}]
[25,"W80029  ","235","M  ","W Rosie Mid","Toffee","0-21033-49793-3","          ",9.5,null,{"v":80,"d":"$80.00"},{"v":160,"d":"$160.00"},{"v":159.95,"d":"$159.95"},0,"W80029-235-M  W Rosie Mid"," ",{"$f":"--ISNUMBER(IFERROR(SEARCH(Orders!$E18,O934,1),\"\"))","v":1},{"$f":"IF(Q934=1,COUNTIF($Q$2:Q934,1),\"\")","v":933},{"$f":"IFERROR(INDEX($O2:$O986,MATCH(ROWS($Q$2:Q934),$R2:$R986,0)),\"\")","v":"W80029-235-M  W Rosie Mid"}]
[25,"W80029  ","235","M  ","W Rosie Mid","Toffee","0-21033-49794-0","          ",10,null,{"v":80,"d":"$80.00"},{"v":160,"d":"$160.00"},{"v":159.95,"d":"$159.95"},0,"W80029-235-M  W Rosie Mid"," ",{"$f":"--ISNUMBER(IFERROR(SEARCH(Orders!$E18,O935,1),\"\"))","v":1},{"$f":"IF(Q935=1,COUNTIF($Q$2:Q935,1),\"\")","v":934},{"$f":"IFERROR(INDEX($O2:$O986,MATCH(ROWS($Q$2:Q935),$R2:$R986,0)),\"\")","v":"W80029-235-M  W Rosie Mid"}]
[25,"W80029  ","235","M  ","W Rosie Mid","Toffee","0-21033-49795-7","          ",10.5,null,{"v":80,"d":"$80.00"},{"v":160,"d":"$160.00"},{"v":159.95,"d":"$159.95"},0,"W80029-235-M  W Rosie Mid"," ",{"$f":"--ISNUMBER(IFERROR(SEARCH(Orders!$E18,O936,1),\"\"))","v":1},{"$f":"IF(Q936=1,COUNTIF($Q$2:Q936,1),\"\")","v":935},{"$f":"IFERROR(INDEX($O2:$O986,MATCH(ROWS($Q$2:Q936),$R2:$R986,0)),\"\")","v":"W80029-235-M  W Rosie Mid"}]
[25,"W80029  ","235","M  ","W Rosie Mid","Toffee","0-21033-49796-4","          ",11,null,{"v":80,"d":"$80.00"},{"v":160,"d":"$160.00"},{"v":159.95,"d":"$159.95"},0,"W80029-235-M  W Rosie Mid"," ",{"$f":"--ISNUMBER(IFERROR(SEARCH(Orders!$E18,O937,1),\"\"))","v":1},{"$f":"IF(Q937=1,COUNTIF($Q$2:Q937,1),\"\")","v":936},{"$f":"IFERROR(INDEX($O2:$O986,MATCH(ROWS($Q$2:Q937),$R2:$R986,0)),\"\")","v":"W80029-235-M  W Rosie Mid"}]
[25,"W80029  ","275","M  ","W Rosie Mid","Stone","0-21033-49797-1","          ",6,null,{"v":80,"d":"$80.00"},{"v":160,"d":"$160.00"},{"v":159.95,"d":"$159.95"},0,"W80029-275-M  W Rosie Mid"," ",{"$f":"--ISNUMBER(IFERROR(SEARCH(Orders!$E18,O938,1),\"\"))","v":1},{"$f":"IF(Q938=1,COUNTIF($Q$2:Q938,1),\"\")","v":937},{"$f":"IFERROR(INDEX($O2:$O986,MATCH(ROWS($Q$2:Q938),$R2:$R986,0)),\"\")","v":"W80029-275-M  W Rosie Mid"}]
[25,"W80029  ","275","M  ","W Rosie Mid","Stone","0-21033-49798-8","          ",6.5,null,{"v":80,"d":"$80.00"},{"v":160,"d":"$160.00"},{"v":159.95,"d":"$159.95"},0,"W80029-275-M  W Rosie Mid"," ",{"$f":"--ISNUMBER(IFERROR(SEARCH(Orders!$E18,O939,1),\"\"))","v":1},{"$f":"IF(Q939=1,COUNTIF($Q$2:Q939,1),\"\")","v":938},{"$f":"IFERROR(INDEX($O2:$O986,MATCH(ROWS($Q$2:Q939),$R2:$R986,0)),\"\")","v":"W80029-275-M  W Rosie Mid"}]
[25,"W80029  ","275","M  ","W Rosie Mid","Stone","0-21033-49799-5","          ",7,null,{"v":80,"d":"$80.00"},{"v":160,"d":"$160.00"},{"v":159.95,"d":"$159.95"},0,"W80029-275-M  W Rosie Mid"," ",{"$f":"--ISNUMBER(IFERROR(SEARCH(Orders!$E18,O940,1),\"\"))","v":1},{"$f":"IF(Q940=1,COUNTIF($Q$2:Q940,1),\"\")","v":939},{"$f":"IFERROR(INDEX($O2:$O986,MATCH(ROWS($Q$2:Q940),$R2:$R986,0)),\"\")","v":"W80029-275-M  W Rosie Mid"}]
[25,"W80029  ","275","M  ","W Rosie Mid","Stone","0-21033-49800-8","          ",7.5,null,{"v":80,"d":"$80.00"},{"v":160,"d":"$160.00"},{"v":159.95,"d":"$159.95"},0,"W80029-275-M  W Rosie Mid"," ",{"$f":"--ISNUMBER(IFERROR(SEARCH(Orders!$E18,O941,1),\"\"))","v":1},{"$f":"IF(Q941=1,COUNTIF($Q$2:Q941,1),\"\")","v":940},{"$f":"IFERROR(INDEX($O2:$O986,MATCH(ROWS($Q$2:Q941),$R2:$R986,0)),\"\")","v":"W80029-275-M  W Rosie Mid"}]
[25,"W80029  ","275","M  ","W Rosie Mid","Stone","0-21033-49801-5","          ",8,null,{"v":80,"d":"$80.00"},{"v":160,"d":"$160.00"},{"v":159.95,"d":"$159.95"},0,"W80029-275-M  W Rosie Mid"," ",{"$f":"--ISNUMBER(IFERROR(SEARCH(Orders!$E18,O942,1),\"\"))","v":1},{"$f":"IF(Q942=1,COUNTIF($Q$2:Q942,1),\"\")","v":941},{"$f":"IFERROR(INDEX($O2:$O986,MATCH(ROWS($Q$2:Q942),$R2:$R986,0)),\"\")","v":"W80029-275-M  W Rosie Mid"}]
[25,"W80029  ","275","M  ","W Rosie Mid","Stone","0-21033-49802-2","          ",8.5,null,{"v":80,"d":"$80.00"},{"v":160,"d":"$160.00"},{"v":159.95,"d":"$159.95"},0,"W80029-275-M  W Rosie Mid"," ",{"$f":"--ISNUMBER(IFERROR(SEARCH(Orders!$E18,O943,1),\"\"))","v":1},{"$f":"IF(Q943=1,COUNTIF($Q$2:Q943,1),\"\")","v":942},{"$f":"IFERROR(INDEX($O2:$O986,MATCH(ROWS($Q$2:Q943),$R2:$R986,0)),\"\")","v":"W80029-275-M  W Rosie Mid"}]
[25,"W80029  ","275","M  ","W Rosie Mid","Stone","0-21033-49803-9","          ",9,null,{"v":80,"d":"$80.00"},{"v":160,"d":"$160.00"},{"v":159.95,"d":"$159.95"},0,"W80029-275-M  W Rosie Mid"," ",{"$f":"--ISNUMBER(IFERROR(SEARCH(Orders!$E18,O944,1),\"\"))","v":1},{"$f":"IF(Q944=1,COUNTIF($Q$2:Q944,1),\"\")","v":943},{"$f":"IFERROR(INDEX($O2:$O986,MATCH(ROWS($Q$2:Q944),$R2:$R986,0)),\"\")","v":"W80029-275-M  W Rosie Mid"}]
[25,"W80029  ","275","M  ","W Rosie Mid","Stone","0-21033-49804-6","          ",9.5,null,{"v":80,"d":"$80.00"},{"v":160,"d":"$160.00"},{"v":159.95,"d":"$159.95"},0,"W80029-275-M  W Rosie Mid"," ",{"$f":"--ISNUMBER(IFERROR(SEARCH(Orders!$E18,O945,1),\"\"))","v":1},{"$f":"IF(Q945=1,COUNTIF($Q$2:Q945,1),\"\")","v":944},{"$f":"IFERROR(INDEX($O2:$O986,MATCH(ROWS($Q$2:Q945),$R2:$R986,0)),\"\")","v":"W80029-275-M  W Rosie Mid"}]
[25,"W80029  ","275","M  ","W Rosie Mid","Stone","0-21033-49805-3","          ",10,null,{"v":80,"d":"$80.00"},{"v":160,"d":"$160.00"},{"v":159.95,"d":"$159.95"},0,"W80029-275-M  W Rosie Mid"," ",{"$f":"--ISNUMBER(IFERROR(SEARCH(Orders!$E18,O946,1),\"\"))","v":1},{"$f":"IF(Q946=1,COUNTIF($Q$2:Q946,1),\"\")","v":945},{"$f":"IFERROR(INDEX($O2:$O986,MATCH(ROWS($Q$2:Q946),$R2:$R986,0)),\"\")","v":"W80029-275-M  W Rosie Mid"}]
[25,"W80029  ","275","M  ","W Rosie Mid","Stone","0-21033-49806-0","          ",10.5,null,{"v":80,"d":"$80.00"},{"v":160,"d":"$160.00"},{"v":159.95,"d":"$159.95"},0,"W80029-275-M  W Rosie Mid"," ",{"$f":"--ISNUMBER(IFERROR(SEARCH(Orders!$E18,O947,1),\"\"))","v":1},{"$f":"IF(Q947=1,COUNTIF($Q$2:Q947,1),\"\")","v":946},{"$f":"IFERROR(INDEX($O2:$O986,MATCH(ROWS($Q$2:Q947),$R2:$R986,0)),\"\")","v":"W80029-275-M  W Rosie Mid"}]
[25,"W80029  ","275","M  ","W Rosie Mid","Stone","0-21033-49807-7","          ",11,null,{"v":80,"d":"$80.00"},{"v":160,"d":"$160.00"},{"v":159.95,"d":"$159.95"},0,"W80029-275-M  W Rosie Mid"," ",{"$f":"--ISNUMBER(IFERROR(SEARCH(Orders!$E18,O948,1),\"\"))","v":1},{"$f":"IF(Q948=1,COUNTIF($Q$2:Q948,1),\"\")","v":947},{"$f":"IFERROR(INDEX($O2:$O986,MATCH(ROWS($Q$2:Q948),$R2:$R986,0)),\"\")","v":"W80029-275-M  W Rosie Mid"}]
[16,"W80036  ","014","M  ","W Wild Sky Mid","Blk Olive","0-21033-50005-3","          ",5,null,{"v":77.5,"d":"$77.50"},{"v":155,"d":"$155.00"},{"v":154.95,"d":"$154.95"},0,"W80036-014-M  W Wild Sky Mid"," ",{"$f":"--ISNUMBER(IFERROR(SEARCH(Orders!$E18,O949,1),\"\"))","v":1},{"$f":"IF(Q949=1,COUNTIF($Q$2:Q949,1),\"\")","v":948},{"$f":"IFERROR(INDEX($O2:$O986,MATCH(ROWS($Q$2:Q949),$R2:$R986,0)),\"\")","v":"W80036-014-M  W Wild Sky Mid"}]
[16,"W80036  ","014","M  ","W Wild Sky Mid","Blk Olive","0-21033-50006-0","          ",5.5,null,{"v":77.5,"d":"$77.50"},{"v":155,"d":"$155.00"},{"v":154.95,"d":"$154.95"},0,"W80036-014-M  W Wild Sky Mid"," ",{"$f":"--ISNUMBER(IFERROR(SEARCH(Orders!$E18,O950,1),\"\"))","v":1},{"$f":"IF(Q950=1,COUNTIF($Q$2:Q950,1),\"\")","v":949},{"$f":"IFERROR(INDEX($O2:$O986,MATCH(ROWS($Q$2:Q950),$R2:$R986,0)),\"\")","v":"W80036-014-M  W Wild Sky Mid"}]
[16,"W80036  ","014","M  ","W Wild Sky Mid","Blk Olive","0-21033-50007-7","          ",6,null,{"v":77.5,"d":"$77.50"},{"v":155,"d":"$155.00"},{"v":154.95,"d":"$154.95"},0,"W80036-014-M  W Wild Sky Mid"," ",{"$f":"--ISNUMBER(IFERROR(SEARCH(Orders!$E18,O951,1),\"\"))","v":1},{"$f":"IF(Q951=1,COUNTIF($Q$2:Q951,1),\"\")","v":950},{"$f":"IFERROR(INDEX($O2:$O986,MATCH(ROWS($Q$2:Q951),$R2:$R986,0)),\"\")","v":"W80036-014-M  W Wild Sky Mid"}]
[16,"W80036  ","014","M  ","W Wild Sky Mid","Blk Olive","0-21033-50008-4","          ",6.5,null,{"v":77.5,"d":"$77.50"},{"v":155,"d":"$155.00"},{"v":154.95,"d":"$154.95"},0,"W80036-014-M  W Wild Sky Mid"," ",{"$f":"--ISNUMBER(IFERROR(SEARCH(Orders!$E18,O952,1),\"\"))","v":1},{"$f":"IF(Q952=1,COUNTIF($Q$2:Q952,1),\"\")","v":951},{"$f":"IFERROR(INDEX($O2:$O986,MATCH(ROWS($Q$2:Q952),$R2:$R986,0)),\"\")","v":"W80036-014-M  W Wild Sky Mid"}]
[16,"W80036  ","014","M  ","W Wild Sky Mid","Blk Olive","0-21033-50009-1","          ",7,null,{"v":77.5,"d":"$77.50"},{"v":155,"d":"$155.00"},{"v":154.95,"d":"$154.95"},0,"W80036-014-M  W Wild Sky Mid"," ",{"$f":"--ISNUMBER(IFERROR(SEARCH(Orders!$E18,O953,1),\"\"))","v":1},{"$f":"IF(Q953=1,COUNTIF($Q$2:Q953,1),\"\")","v":952},{"$f":"IFERROR(INDEX($O2:$O986,MATCH(ROWS($Q$2:Q953),$R2:$R986,0)),\"\")","v":"W80036-014-M  W Wild Sky Mid"}]
[16,"W80036  ","014","M  ","W Wild Sky Mid","Blk Olive","0-21033-50010-7","          ",7.5,null,{"v":77.5,"d":"$77.50"},{"v":155,"d":"$155.00"},{"v":154.95,"d":"$154.95"},0,"W80036-014-M  W Wild Sky Mid"," ",{"$f":"--ISNUMBER(IFERROR(SEARCH(Orders!$E18,O954,1),\"\"))","v":1},{"$f":"IF(Q954=1,COUNTIF($Q$2:Q954,1),\"\")","v":953},{"$f":"IFERROR(INDEX($O2:$O986,MATCH(ROWS($Q$2:Q954),$R2:$R986,0)),\"\")","v":"W80036-014-M  W Wild Sky Mid"}]
[16,"W80036  ","014","M  ","W Wild Sky Mid","Blk Olive","0-21033-50011-4","          ",8,null,{"v":77.5,"d":"$77.50"},{"v":155,"d":"$155.00"},{"v":154.95,"d":"$154.95"},0,"W80036-014-M  W Wild Sky Mid"," ",{"$f":"--ISNUMBER(IFERROR(SEARCH(Orders!$E18,O955,1),\"\"))","v":1},{"$f":"IF(Q955=1,COUNTIF($Q$2:Q955,1),\"\")","v":954},{"$f":"IFERROR(INDEX($O2:$O986,MATCH(ROWS($Q$2:Q955),$R2:$R986,0)),\"\")","v":"W80036-014-M  W Wild Sky Mid"}]
[16,"W80036  ","014","M  ","W Wild Sky Mid","Blk Olive","0-21033-50012-1","          ",8.5,null,{"v":77.5,"d":"$77.50"},{"v":155,"d":"$155.00"},{"v":154.95,"d":"$154.95"},0,"W80036-014-M  W Wild Sky Mid"," ",{"$f":"--ISNUMBER(IFERROR(SEARCH(Orders!$E18,O956,1),\"\"))","v":1},{"$f":"IF(Q956=1,COUNTIF($Q$2:Q956,1),\"\")","v":955},{"$f":"IFERROR(INDEX($O2:$O986,MATCH(ROWS($Q$2:Q956),$R2:$R986,0)),\"\")","v":"W80036-014-M  W Wild Sky Mid"}]
[16,"W80036  ","014","M  ","W Wild Sky Mid","Blk Olive","0-21033-50013-8","          ",9,null,{"v":77.5,"d":"$77.50"},{"v":155,"d":"$155.00"},{"v":154.95,"d":"$154.95"},0,"W80036-014-M  W Wild Sky Mid"," ",{"$f":"--ISNUMBER(IFERROR(SEARCH(Orders!$E18,O957,1),\"\"))","v":1},{"$f":"IF(Q957=1,COUNTIF($Q$2:Q957,1),\"\")","v":956},{"$f":"IFERROR(INDEX($O2:$O986,MATCH(ROWS($Q$2:Q957),$R2:$R986,0)),\"\")","v":"W80036-014-M  W Wild Sky Mid"}]
[16,"W80036  ","014","M  ","W Wild Sky Mid","Blk Olive","0-21033-50014-5","          ",9.5,null,{"v":77.5,"d":"$77.50"},{"v":155,"d":"$155.00"},{"v":154.95,"d":"$154.95"},0,"W80036-014-M  W Wild Sky Mid"," ",{"$f":"--ISNUMBER(IFERROR(SEARCH(Orders!$E18,O958,1),\"\"))","v":1},{"$f":"IF(Q958=1,COUNTIF($Q$2:Q958,1),\"\")","v":957},{"$f":"IFERROR(INDEX($O2:$O986,MATCH(ROWS($Q$2:Q958),$R2:$R986,0)),\"\")","v":"W80036-014-M  W Wild Sky Mid"}]
[16,"W80036  ","014","M  ","W Wild Sky Mid","Blk Olive","0-21033-50015-2","          ",10,null,{"v":77.5,"d":"$77.50"},{"v":155,"d":"$155.00"},{"v":154.95,"d":"$154.95"},0,"W80036-014-M  W Wild Sky Mid"," ",{"$f":"--ISNUMBER(IFERROR(SEARCH(Orders!$E18,O959,1),\"\"))","v":1},{"$f":"IF(Q959=1,COUNTIF($Q$2:Q959,1),\"\")","v":958},{"$f":"IFERROR(INDEX($O2:$O986,MATCH(ROWS($Q$2:Q959),$R2:$R986,0)),\"\")","v":"W80036-014-M  W Wild Sky Mid"}]
[16,"W80036  ","014","M  ","W Wild Sky Mid","Blk Olive","0-21033-50016-9","          ",10.5,null,{"v":77.5,"d":"$77.50"},{"v":155,"d":"$155.00"},{"v":154.95,"d":"$154.95"},0,"W80036-014-M  W Wild Sky Mid"," ",{"$f":"--ISNUMBER(IFERROR(SEARCH(Orders!$E18,O960,1),\"\"))","v":1},{"$f":"IF(Q960=1,COUNTIF($Q$2:Q960,1),\"\")","v":959},{"$f":"IFERROR(INDEX($O2:$O986,MATCH(ROWS($Q$2:Q960),$R2:$R986,0)),\"\")","v":"W80036-014-M  W Wild Sky Mid"}]
[16,"W80036  ","014","M  ","W Wild Sky Mid","Blk Olive","0-21033-50019-0","          ",11,null,{"v":77.5,"d":"$77.50"},{"v":155,"d":"$155.00"},{"v":154.95,"d":"$154.95"},0,"W80036-014-M  W Wild Sky Mid"," ",{"$f":"--ISNUMBER(IFERROR(SEARCH(Orders!$E18,O961,1),\"\"))","v":1},{"$f":"IF(Q961=1,COUNTIF($Q$2:Q961,1),\"\")","v":960},{"$f":"IFERROR(INDEX($O2:$O986,MATCH(ROWS($Q$2:Q961),$R2:$R986,0)),\"\")","v":"W80036-014-M  W Wild Sky Mid"}]
[16,"W80036  ","240","M  ","W Wild Sky Mid","Tan","0-21033-50020-6","          ",5,null,{"v":77.5,"d":"$77.50"},{"v":155,"d":"$155.00"},{"v":154.95,"d":"$154.95"},{"$f":"J962*K962","v":0},"W80036-240-M  W Wild Sky Mid"," ",{"$f":"--ISNUMBER(IFERROR(SEARCH(Orders!$E18,O962,1),\"\"))","v":1},{"$f":"IF(Q962=1,COUNTIF($Q$2:Q962,1),\"\")","v":961},{"$f":"IFERROR(INDEX($O2:$O986,MATCH(ROWS($Q$2:Q962),$R2:$R986,0)),\"\")","v":"W80036-240-M  W Wild Sky Mid"}]
[16,"W80036  ","240","M  ","W Wild Sky Mid","Tan","0-21033-50021-3","          ",5.5,null,{"v":77.5,"d":"$77.50"},{"v":155,"d":"$155.00"},{"v":154.95,"d":"$154.95"},0,"W80036-240-M  W Wild Sky Mid"," ",{"$f":"--ISNUMBER(IFERROR(SEARCH(Orders!$E18,O963,1),\"\"))","v":1},{"$f":"IF(Q963=1,COUNTIF($Q$2:Q963,1),\"\")","v":962},{"$f":"IFERROR(INDEX($O2:$O986,MATCH(ROWS($Q$2:Q963),$R2:$R986,0)),\"\")","v":"W80036-240-M  W Wild Sky Mid"}]
[16,"W80036  ","240","M  ","W Wild Sky Mid","Tan","0-21033-50022-0","          ",6,null,{"v":77.5,"d":"$77.50"},{"v":155,"d":"$155.00"},{"v":154.95,"d":"$154.95"},0,"W80036-240-M  W Wild Sky Mid"," ",{"$f":"--ISNUMBER(IFERROR(SEARCH(Orders!$E18,O964,1),\"\"))","v":1},{"$f":"IF(Q964=1,COUNTIF($Q$2:Q964,1),\"\")","v":963},{"$f":"IFERROR(INDEX($O2:$O986,MATCH(ROWS($Q$2:Q964),$R2:$R986,0)),\"\")","v":"W80036-240-M  W Wild Sky Mid"}]
[16,"W80036  ","240","M  ","W Wild Sky Mid","Tan","0-21033-50023-7","          ",6.5,null,{"v":77.5,"d":"$77.50"},{"v":155,"d":"$155.00"},{"v":154.95,"d":"$154.95"},0,"W80036-240-M  W Wild Sky Mid"," ",{"$f":"--ISNUMBER(IFERROR(SEARCH(Orders!$E18,O965,1),\"\"))","v":1},{"$f":"IF(Q965=1,COUNTIF($Q$2:Q965,1),\"\")","v":964},{"$f":"IFERROR(INDEX($O2:$O986,MATCH(ROWS($Q$2:Q965),$R2:$R986,0)),\"\")","v":"W80036-240-M  W Wild Sky Mid"}]
[16,"W80036  ","240","M  ","W Wild Sky Mid","Tan","0-21033-50024-4","          ",7,null,{"v":77.5,"d":"$77.50"},{"v":155,"d":"$155.00"},{"v":154.95,"d":"$154.95"},0,"W80036-240-M  W Wild Sky Mid"," ",{"$f":"--ISNUMBER(IFERROR(SEARCH(Orders!$E18,O966,1),\"\"))","v":1},{"$f":"IF(Q966=1,COUNTIF($Q$2:Q966,1),\"\")","v":965},{"$f":"IFERROR(INDEX($O2:$O986,MATCH(ROWS($Q$2:Q966),$R2:$R986,0)),\"\")","v":"W80036-240-M  W Wild Sky Mid"}]
[16,"W80036  ","240","M  ","W Wild Sky Mid","Tan","0-21033-50025-1","          ",7.5,null,{"v":77.5,"d":"$77.50"},{"v":155,"d":"$155.00"},{"v":154.95,"d":"$154.95"},0,"W80036-240-M  W Wild Sky Mid"," ",{"$f":"--ISNUMBER(IFERROR(SEARCH(Orders!$E18,O967,1),\"\"))","v":1},{"$f":"IF(Q967=1,COUNTIF($Q$2:Q967,1),\"\")","v":966},{"$f":"IFERROR(INDEX($O2:$O986,MATCH(ROWS($Q$2:Q967),$R2:$R986,0)),\"\")","v":"W80036-240-M  W Wild Sky Mid"}]
[16,"W80036  ","240","M  ","W Wild Sky Mid","Tan","0-21033-50026-8","          ",8,null,{"v":77.5,"d":"$77.50"},{"v":155,"d":"$155.00"},{"v":154.95,"d":"$154.95"},0,"W80036-240-M  W Wild Sky Mid"," ",{"$f":"--ISNUMBER(IFERROR(SEARCH(Orders!$E18,O968,1),\"\"))","v":1},{"$f":"IF(Q968=1,COUNTIF($Q$2:Q968,1),\"\")","v":967},{"$f":"IFERROR(INDEX($O2:$O986,MATCH(ROWS($Q$2:Q968),$R2:$R986,0)),\"\")","v":"W80036-240-M  W Wild Sky Mid"}]
[16,"W80036  ","240","M  ","W Wild Sky Mid","Tan","0-21033-50027-5","          ",8.5,null,{"v":77.5,"d":"$77.50"},{"v":155,"d":"$155.00"},{"v":154.95,"d":"$154.95"},0,"W80036-240-M  W Wild Sky Mid"," ",{"$f":"--ISNUMBER(IFERROR(SEARCH(Orders!$E18,O969,1),\"\"))","v":1},{"$f":"IF(Q969=1,COUNTIF($Q$2:Q969,1),\"\")","v":968},{"$f":"IFERROR(INDEX($O2:$O986,MATCH(ROWS($Q$2:Q969),$R2:$R986,0)),\"\")","v":"W80036-240-M  W Wild Sky Mid"}]
[16,"W80036  ","240","M  ","W Wild Sky Mid","Tan","0-21033-50028-2","          ",9,null,{"v":77.5,"d":"$77.50"},{"v":155,"d":"$155.00"},{"v":154.95,"d":"$154.95"},0,"W80036-240-M  W Wild Sky Mid"," ",{"$f":"--ISNUMBER(IFERROR(SEARCH(Orders!$E18,O970,1),\"\"))","v":1},{"$f":"IF(Q970=1,COUNTIF($Q$2:Q970,1),\"\")","v":969},{"$f":"IFERROR(INDEX($O2:$O986,MATCH(ROWS($Q$2:Q970),$R2:$R986,0)),\"\")","v":"W80036-240-M  W Wild Sky Mid"}]
[16,"W80036  ","240","M  ","W Wild Sky Mid","Tan","0-21033-50029-9","          ",9.5,null,{"v":77.5,"d":"$77.50"},{"v":155,"d":"$155.00"},{"v":154.95,"d":"$154.95"},0,"W80036-240-M  W Wild Sky Mid"," ",{"$f":"--ISNUMBER(IFERROR(SEARCH(Orders!$E18,O971,1),\"\"))","v":1},{"$f":"IF(Q971=1,COUNTIF($Q$2:Q971,1),\"\")","v":970},{"$f":"IFERROR(INDEX($O2:$O986,MATCH(ROWS($Q$2:Q971),$R2:$R986,0)),\"\")","v":"W80036-240-M  W Wild Sky Mid"}]
[16,"W80036  ","240","M  ","W Wild Sky Mid","Tan","0-21033-50030-5","          ",10,null,{"v":77.5,"d":"$77.50"},{"v":155,"d":"$155.00"},{"v":154.95,"d":"$154.95"},0,"W80036-240-M  W Wild Sky Mid"," ",{"$f":"--ISNUMBER(IFERROR(SEARCH(Orders!$E18,O972,1),\"\"))","v":1},{"$f":"IF(Q972=1,COUNTIF($Q$2:Q972,1),\"\")","v":971},{"$f":"IFERROR(INDEX($O2:$O986,MATCH(ROWS($Q$2:Q972),$R2:$R986,0)),\"\")","v":"W80036-240-M  W Wild Sky Mid"}]
[16,"W80036  ","240","M  ","W Wild Sky Mid","Tan","0-21033-50031-2","          ",10.5,null,{"v":77.5,"d":"$77.50"},{"v":155,"d":"$155.00"},{"v":154.95,"d":"$154.95"},0,"W80036-240-M  W Wild Sky Mid"," ",{"$f":"--ISNUMBER(IFERROR(SEARCH(Orders!$E18,O973,1),\"\"))","v":1},{"$f":"IF(Q973=1,COUNTIF($Q$2:Q973,1),\"\")","v":972},{"$f":"IFERROR(INDEX($O2:$O986,MATCH(ROWS($Q$2:Q973),$R2:$R986,0)),\"\")","v":"W80036-240-M  W Wild Sky Mid"}]
[16,"W80036  ","240","M  ","W Wild Sky Mid","Tan","0-21033-50032-9","          ",11,null,{"v":77.5,"d":"$77.50"},{"v":155,"d":"$155.00"},{"v":154.95,"d":"$154.95"},0,"W80036-240-M  W Wild Sky Mid"," ",{"$f":"--ISNUMBER(IFERROR(SEARCH(Orders!$E18,O974,1),\"\"))","v":1},{"$f":"IF(Q974=1,COUNTIF($Q$2:Q974,1),\"\")","v":973},{"$f":"IFERROR(INDEX($O2:$O986,MATCH(ROWS($Q$2:Q974),$R2:$R986,0)),\"\")","v":"W80036-240-M  W Wild Sky Mid"}]
[16,"W80036  ","305","M  ","W Wild Sky Mid","Loden","0-21033-50033-6","          ",5,null,{"v":77.5,"d":"$77.50"},{"v":155,"d":"$155.00"},{"v":154.95,"d":"$154.95"},0,"W80036-305-M  W Wild Sky Mid"," ",{"$f":"--ISNUMBER(IFERROR(SEARCH(Orders!$E18,O975,1),\"\"))","v":1},{"$f":"IF(Q975=1,COUNTIF($Q$2:Q975,1),\"\")","v":974},{"$f":"IFERROR(INDEX($O2:$O986,MATCH(ROWS($Q$2:Q975),$R2:$R986,0)),\"\")","v":"W80036-305-M  W Wild Sky Mid"}]
[16,"W80036  ","305","M  ","W Wild Sky Mid","Loden","0-21033-50034-3","          ",5.5,null,{"v":77.5,"d":"$77.50"},{"v":155,"d":"$155.00"},{"v":154.95,"d":"$154.95"},0,"W80036-305-M  W Wild Sky Mid"," ",{"$f":"--ISNUMBER(IFERROR(SEARCH(Orders!$E18,O976,1),\"\"))","v":1},{"$f":"IF(Q976=1,COUNTIF($Q$2:Q976,1),\"\")","v":975},{"$f":"IFERROR(INDEX($O2:$O986,MATCH(ROWS($Q$2:Q976),$R2:$R986,0)),\"\")","v":"W80036-305-M  W Wild Sky Mid"}]
[16,"W80036  ","305","M  ","W Wild Sky Mid","Loden","0-21033-50035-0","          ",6,null,{"v":77.5,"d":"$77.50"},{"v":155,"d":"$155.00"},{"v":154.95,"d":"$154.95"},0,"W80036-305-M  W Wild Sky Mid"," ",{"$f":"--ISNUMBER(IFERROR(SEARCH(Orders!$E18,O977,1),\"\"))","v":1},{"$f":"IF(Q977=1,COUNTIF($Q$2:Q977,1),\"\")","v":976},{"$f":"IFERROR(INDEX($O2:$O986,MATCH(ROWS($Q$2:Q977),$R2:$R986,0)),\"\")","v":"W80036-305-M  W Wild Sky Mid"}]
[16,"W80036  ","305","M  ","W Wild Sky Mid","Loden","0-21033-50036-7","          ",6.5,null,{"v":77.5,"d":"$77.50"},{"v":155,"d":"$155.00"},{"v":154.95,"d":"$154.95"},0,"W80036-305-M  W Wild Sky Mid"," ",{"$f":"--ISNUMBER(IFERROR(SEARCH(Orders!$E18,O978,1),\"\"))","v":1},{"$f":"IF(Q978=1,COUNTIF($Q$2:Q978,1),\"\")","v":977},{"$f":"IFERROR(INDEX($O2:$O986,MATCH(ROWS($Q$2:Q978),$R2:$R986,0)),\"\")","v":"W80036-305-M  W Wild Sky Mid"}]
[16,"W80036  ","305","M  ","W Wild Sky Mid","Loden","0-21033-50037-4","          ",7,null,{"v":77.5,"d":"$77.50"},{"v":155,"d":"$155.00"},{"v":154.95,"d":"$154.95"},0,"W80036-305-M  W Wild Sky Mid"," ",{"$f":"--ISNUMBER(IFERROR(SEARCH(Orders!$E18,O979,1),\"\"))","v":1},{"$f":"IF(Q979=1,COUNTIF($Q$2:Q979,1),\"\")","v":978},{"$f":"IFERROR(INDEX($O2:$O986,MATCH(ROWS($Q$2:Q979),$R2:$R986,0)),\"\")","v":"W80036-305-M  W Wild Sky Mid"}]
[16,"W80036  ","305","M  ","W Wild Sky Mid","Loden","0-21033-50038-1","          ",7.5,null,{"v":77.5,"d":"$77.50"},{"v":155,"d":"$155.00"},{"v":154.95,"d":"$154.95"},0,"W80036-305-M  W Wild Sky Mid"," ",{"$f":"--ISNUMBER(IFERROR(SEARCH(Orders!$E18,O980,1),\"\"))","v":1},{"$f":"IF(Q980=1,COUNTIF($Q$2:Q980,1),\"\")","v":979},{"$f":"IFERROR(INDEX($O2:$O986,MATCH(ROWS($Q$2:Q980),$R2:$R986,0)),\"\")","v":"W80036-305-M  W Wild Sky Mid"}]
[16,"W80036  ","305","M  ","W Wild Sky Mid","Loden","0-21033-50039-8","          ",8,null,{"v":77.5,"d":"$77.50"},{"v":155,"d":"$155.00"},{"v":154.95,"d":"$154.95"},0,"W80036-305-M  W Wild Sky Mid"," ",{"$f":"--ISNUMBER(IFERROR(SEARCH(Orders!$E18,O981,1),\"\"))","v":1},{"$f":"IF(Q981=1,COUNTIF($Q$2:Q981,1),\"\")","v":980},{"$f":"IFERROR(INDEX($O2:$O986,MATCH(ROWS($Q$2:Q981),$R2:$R986,0)),\"\")","v":"W80036-305-M  W Wild Sky Mid"}]
[16,"W80036  ","305","M  ","W Wild Sky Mid","Loden","0-21033-50040-4","          ",8.5,null,{"v":77.5,"d":"$77.50"},{"v":155,"d":"$155.00"},{"v":154.95,"d":"$154.95"},0,"W80036-305-M  W Wild Sky Mid"," ",{"$f":"--ISNUMBER(IFERROR(SEARCH(Orders!$E18,O982,1),\"\"))","v":1},{"$f":"IF(Q982=1,COUNTIF($Q$2:Q982,1),\"\")","v":981},{"$f":"IFERROR(INDEX($O2:$O986,MATCH(ROWS($Q$2:Q982),$R2:$R986,0)),\"\")","v":"W80036-305-M  W Wild Sky Mid"}]
[16,"W80036  ","305","M  ","W Wild Sky Mid","Loden","0-21033-50041-1","          ",9,null,{"v":77.5,"d":"$77.50"},{"v":155,"d":"$155.00"},{"v":154.95,"d":"$154.95"},0,"W80036-305-M  W Wild Sky Mid"," ",{"$f":"--ISNUMBER(IFERROR(SEARCH(Orders!$E18,O983,1),\"\"))","v":1},{"$f":"IF(Q983=1,COUNTIF($Q$2:Q983,1),\"\")","v":982},{"$f":"IFERROR(INDEX($O2:$O986,MATCH(ROWS($Q$2:Q983),$R2:$R986,0)),\"\")","v":"W80036-305-M  W Wild Sky Mid"}]
[16,"W80036  ","305","M  ","W Wild Sky Mid","Loden","0-21033-50042-8","          ",9.5,null,{"v":77.5,"d":"$77.50"},{"v":155,"d":"$155.00"},{"v":154.95,"d":"$154.95"},0,"W80036-305-M  W Wild Sky Mid"," ",{"$f":"--ISNUMBER(IFERROR(SEARCH(Orders!$E18,O984,1),\"\"))","v":1},{"$f":"IF(Q984=1,COUNTIF($Q$2:Q984,1),\"\")","v":983},{"$f":"IFERROR(INDEX($O2:$O986,MATCH(ROWS($Q$2:Q984),$R2:$R986,0)),\"\")","v":"W80036-305-M  W Wild Sky Mid"}]
[16,"W80036  ","305","M  ","W Wild Sky Mid","Loden","0-21033-50043-5","          ",10,null,{"v":77.5,"d":"$77.50"},{"v":155,"d":"$155.00"},{"v":154.95,"d":"$154.95"},0,"W80036-305-M  W Wild Sky Mid"," ",{"$f":"--ISNUMBER(IFERROR(SEARCH(Orders!$E18,O985,1),\"\"))","v":1},{"$f":"IF(Q985=1,COUNTIF($Q$2:Q985,1),\"\")","v":984},{"$f":"IFERROR(INDEX($O2:$O986,MATCH(ROWS($Q$2:Q985),$R2:$R986,0)),\"\")","v":"W80036-305-M  W Wild Sky Mid"}]
[16,"W80036  ","305","M  ","W Wild Sky Mid","Loden","0-21033-50044-2","          ",10.5,null,{"v":77.5,"d":"$77.50"},{"v":155,"d":"$155.00"},{"v":154.95,"d":"$154.95"},0,"W80036-305-M  W Wild Sky Mid"," ",{"$f":"--ISNUMBER(IFERROR(SEARCH(Orders!$E18,O986,1),\"\"))","v":1},{"$f":"IF(Q986=1,COUNTIF($Q$2:Q986,1),\"\")","v":985},{"$f":"IFERROR(INDEX($O2:$O986,MATCH(ROWS($Q$2:Q986),$R2:$R986,0)),\"\")","v":"W80036-305-M  W Wild Sky Mid"}]
[16,"W80036  ","305","M  ","W Wild Sky Mid","Loden","0-21033-50045-9","          ",11,null,{"v":77.5,"d":"$77.50"},{"v":155,"d":"$155.00"},{"v":154.95,"d":"$154.95"},0,"W80036-305-M  W Wild Sky Mid"," ",{"$f":"--ISNUMBER(IFERROR(SEARCH(Orders!$E18,O987,1),\"\"))","v":1},{"$f":"IF(Q987=1,COUNTIF($Q$2:Q987,1),\"\")","v":986},{"$f":"IFERROR(INDEX($O2:$O986,MATCH(ROWS($Q$2:Q987),$R2:$R986,0)),\"\")","v":""}]

{"sheet":"SKU_Unique","index":4,"n_rows":84,"n_cols":23,"rows_kept":84,"hidden":true}
["Catalog Page","Stock","Color","Width","Style Desc","Color Desc","UPC","Carry Over","Size","Quantity","Cost","MSRP","MAP","Extended Cost","SKU","Filler","Helper1","Helper2",null,{"$f":"OFFSET(SKU_Unique!$S1,Orders!P18,0)","v":0},null,null,{"$f":"OFFSET(SKU_Unique!$V1,Orders!P20,0)","v":0}]
[15,"MFW18PM4","201","M  ","M Phil Mid Top","Dark Brown","7-18598-83058-8","C/O       ","8",null,{"v":77.5,"d":"$77.50"},{"v":155,"d":"$155.00"},{"v":154.95,"d":"$154.95"},{"$f":"J2*K2","v":0},"Mfw18pm4-201-M  M Phil Mid Top"," ",{"$f":"--ISNUMBER(IFERROR(SEARCH(Orders!$E$18,O2,1),\"\"))","v":1},{"$f":"IF(Q2=1,COUNTIF($Q$2:Q2,1),\"\")","v":1},{"$f":"IFERROR(INDEX($O2:$O986,MATCH(ROWS($Q$2:Q2),$R2:$R986,0)),\"\")","v":"Mfw18pm4-201-M  M Phil Mid Top"},{"$f":"IF(Orders!$B$20=$A$2, 1, \"\")","v":""},{"$f":"IF(T2=1,COUNTIF($T$2:T2,1),\"\")","v":""},{"$f":"IFERROR(INDEX($O2:$O986,MATCH(ROWS($T$2:T2),$U2:$U986,0)),\"\")","v":"M80002-009-M  M Cascade Trail Low"}]
[15,"MFW18PM5","020","M  ","M Phil Mid Top","Gray","7-52505-95186-7","C/O       ",8,null,{"v":77.5,"d":"$77.50"},{"v":155,"d":"$155.00"},{"v":154.95,"d":"$154.95"},0,"Mfw18pm5-020-M  M Phil Mid Top"," ",{"$f":"--ISNUMBER(IFERROR(SEARCH(Orders!$E$18,O3,1),\"\"))","v":1},{"$f":"IF(Q3=1,COUNTIF($Q$2:Q3,1),\"\")","v":2},{"$f":"IFERROR(INDEX($O2:$O986,MATCH(ROWS($Q$2:Q3),$R2:$R986,0)),\"\")","v":"Mfw18pm5-020-M  M Phil Mid Top"},{"$f":"IF(Orders!$B$20=$A$3, 1, \"\")","v":""},{"$f":"IF(T3=1,COUNTIF($T$2:T3,1),\"\")","v":""},{"$f":"IFERROR(INDEX($O2:$O986,MATCH(ROWS($T$2:T3),$U2:$U986,0)),\"\")","v":"M80002-419-M  M Cascade Trail Low"}]
[9,"MFW19W1 ","988","M  ","M Halden Mid","Tan/Black","7-18598-82980-3","C/O       ",8,null,{"v":87.5,"d":"$87.50"},{"v":175,"d":"$175.00"},{"v":174.95,"d":"$174.95"},0,"Mfw19w1-988-M  M Halden Mid"," ",{"$f":"--ISNUMBER(IFERROR(SEARCH(Orders!$E$18,O4,1),\"\"))","v":1},{"$f":"IF(Q4=1,COUNTIF($Q$2:Q4,1),\"\")","v":3},{"$f":"IFERROR(INDEX($O2:$O986,MATCH(ROWS($Q$2:Q4),$R2:$R986,0)),\"\")","v":"Mfw19w1-988-M  M Halden Mid"},{"$f":"IF(Orders!$B$20=$A$4, 1, \"\")","v":""},{"$f":"IF(T4=1,COUNTIF($T$2:T4,1),\"\")","v":""},{"$f":"IFERROR(INDEX($O2:$O986,MATCH(ROWS($T$2:T4),$U2:$U986,0)),\"\")","v":"W80005-062-M  W Cascade Trail Low"}]
[9,"MFW19W4 ","219","M  ","M Halden","Mocha Mlti","8-40221-90095-2","C/O       ",8,null,{"v":87.5,"d":"$87.50"},{"v":175,"d":"$175.00"},{"v":174.95,"d":"$174.95"},0,"Mfw19w4-219-M  M Halden"," ",{"$f":"--ISNUMBER(IFERROR(SEARCH(Orders!$E$18,O5,1),\"\"))","v":1},{"$f":"IF(Q5=1,COUNTIF($Q$2:Q5,1),\"\")","v":4},{"$f":"IFERROR(INDEX($O2:$O986,MATCH(ROWS($Q$2:Q5),$R2:$R986,0)),\"\")","v":"Mfw19w4-219-M  M Halden"},{"$f":"IF(Orders!$B$20=$A$5, 1, \"\")","v":""},{"$f":"IF(T5=1,COUNTIF($T$2:T5,1),\"\")","v":""},{"$f":"IFERROR(INDEX($O2:$O986,MATCH(ROWS($T$2:T5),$U2:$U986,0)),\"\")","v":"W80005-450-M  W Cascade Trail Low"}]
[11,"MFW20DH2","216","M  ","M Davos High","Mocha","7-52505-95228-4","C/O       ",8,null,{"v":95,"d":"$95.00"},{"v":190,"d":"$190.00"},{"v":189.95,"d":"$189.95"},0,"Mfw20dh2-216-M  M Davos High"," ",{"$f":"--ISNUMBER(IFERROR(SEARCH(Orders!$E$18,O6,1),\"\"))","v":1},{"$f":"IF(Q6=1,COUNTIF($Q$2:Q6,1),\"\")","v":5},{"$f":"IFERROR(INDEX($O2:$O986,MATCH(ROWS($Q$2:Q6),$R2:$R986,0)),\"\")","v":"Mfw20dh2-216-M  M Davos High"},{"$f":"IF(Orders!$B$20=$A$6, 1, \"\")","v":""},{"$f":"IF(T6=1,COUNTIF($T$2:T6,1),\"\")","v":""},{"$f":"IFERROR(INDEX($O2:$O986,MATCH(ROWS($T$2:T6),$U2:$U986,0)),\"\")","v":""}]
[11,"MFW20DH3","235","M  ","M Davos High","Toffee","7-52505-95242-0","C/O       ",8,null,{"v":95,"d":"$95.00"},{"v":190,"d":"$190.00"},{"v":189.95,"d":"$189.95"},0,"Mfw20dh3-235-M  M Davos High"," ",{"$f":"--ISNUMBER(IFERROR(SEARCH(Orders!$E$18,O7,1),\"\"))","v":1},{"$f":"IF(Q7=1,COUNTIF($Q$2:Q7,1),\"\")","v":6},{"$f":"IFERROR(INDEX($O2:$O986,MATCH(ROWS($Q$2:Q7),$R2:$R986,0)),\"\")","v":"Mfw20dh3-235-M  M Davos High"},{"$f":"IF(Orders!$B$20=$A$7, 1, \"\")","v":""},{"$f":"IF(T7=1,COUNTIF($T$2:T7,1),\"\")","v":""},{"$f":"IFERROR(INDEX($O2:$O986,MATCH(ROWS($T$2:T7),$U2:$U986,0)),\"\")","v":""}]
[11,"MFW20DH4","025","M  ","M Davos High","Gunmetal","8-40221-90081-5","C/O       ",8,null,{"v":95,"d":"$95.00"},{"v":190,"d":"$190.00"},{"v":189.95,"d":"$189.95"},0,"Mfw20dh4-025-M  M Davos High"," ",{"$f":"--ISNUMBER(IFERROR(SEARCH(Orders!$E$18,O8,1),\"\"))","v":1},{"$f":"IF(Q8=1,COUNTIF($Q$2:Q8,1),\"\")","v":7},{"$f":"IFERROR(INDEX($O2:$O986,MATCH(ROWS($Q$2:Q8),$R2:$R986,0)),\"\")","v":"Mfw20dh4-025-M  M Davos High"},{"$f":"IF(Orders!$B$20=$A$8, 1, \"\")","v":""},{"$f":"IF(T8=1,COUNTIF($T$2:T8,1),\"\")","v":""},{"$f":"IFERROR(INDEX($O2:$O986,MATCH(ROWS($T$2:T8),$U2:$U986,0)),\"\")","v":""}]
[12,"MFW21DM1","235","M  ","M Davos Mid Top","Toffee","8-40221-90387-8","C/O       ",8,null,{"v":85,"d":"$85.00"},{"v":170,"d":"$170.00"},{"v":169.95,"d":"$169.95"},0,"Mfw21dm1-235-M  M Davos Mid Top"," ",{"$f":"--ISNUMBER(IFERROR(SEARCH(Orders!$E$18,O9,1),\"\"))","v":1},{"$f":"IF(Q9=1,COUNTIF($Q$2:Q9,1),\"\")","v":8},{"$f":"IFERROR(INDEX($O2:$O986,MATCH(ROWS($Q$2:Q9),$R2:$R986,0)),\"\")","v":"Mfw21dm1-235-M  M Davos Mid Top"},{"$f":"IF(Orders!$B$20=$A$9, 1, \"\")","v":""},{"$f":"IF(T9=1,COUNTIF($T$2:T9,1),\"\")","v":""},{"$f":"IFERROR(INDEX($O2:$O986,MATCH(ROWS($T$2:T9),$U2:$U986,0)),\"\")","v":""}]
[2,"MFW21D1 ","235","M  ","M Dispatch","Toffee","8-40221-90109-6","C/O       ",8,null,{"v":85,"d":"$85.00"},{"v":170,"d":"$170.00"},{"v":169.95,"d":"$169.95"},0,"Mfw21d1-235-M  M Dispatch"," ",{"$f":"--ISNUMBER(IFERROR(SEARCH(Orders!$E$18,O10,1),\"\"))","v":1},{"$f":"IF(Q10=1,COUNTIF($Q$2:Q10,1),\"\")","v":9},{"$f":"IFERROR(INDEX($O2:$O986,MATCH(ROWS($Q$2:Q10),$R2:$R986,0)),\"\")","v":"Mfw21d1-235-M  M Dispatch"},{"$f":"IF(Orders!$B$20=$A$10, 1, \"\")","v":""},{"$f":"IF(T10=1,COUNTIF($T$2:T10,1),\"\")","v":""},{"$f":"IFERROR(INDEX($O2:$O986,MATCH(ROWS($T$2:T10),$U2:$U986,0)),\"\")","v":""}]
[2,"MFW21D3 ","410","M  ","M Dispatch","Navy","8-40221-90137-9","C/O       ",8,null,{"v":85,"d":"$85.00"},{"v":170,"d":"$170.00"},{"v":169.95,"d":"$169.95"},0,"Mfw21d3-410-M  M Dispatch"," ",{"$f":"--ISNUMBER(IFERROR(SEARCH(Orders!$E$18,O11,1),\"\"))","v":1},{"$f":"IF(Q11=1,COUNTIF($Q$2:Q11,1),\"\")","v":10},{"$f":"IFERROR(INDEX($O2:$O986,MATCH(ROWS($Q$2:Q11),$R2:$R986,0)),\"\")","v":"Mfw21d3-410-M  M Dispatch"},{"$f":"IF(Orders!$B$20=$A$11, 1, \"\")","v":""},{"$f":"IF(T11=1,COUNTIF($T$2:T11,1),\"\")","v":""},{"$f":"IFERROR(INDEX($O2:$O986,MATCH(ROWS($T$2:T11),$U2:$U986,0)),\"\")","v":""}]
[14,"MFW21MC1","001","M  ","M Mason Chukka","Black","8-40221-90193-5","C/O       ",8,null,{"v":65,"d":"$65.00"},{"v":130,"d":"$130.00"},{"v":129.95,"d":"$129.95"},0,"Mfw21mc1-001-M  M Mason Chukka"," ",{"$f":"--ISNUMBER(IFERROR(SEARCH(Orders!$E$18,O12,1),\"\"))","v":1},{"$f":"IF(Q12=1,COUNTIF($Q$2:Q12,1),\"\")","v":11},{"$f":"IFERROR(INDEX($O2:$O986,MATCH(ROWS($Q$2:Q12),$R2:$R986,0)),\"\")","v":"Mfw21mc1-001-M  M Mason Chukka"},{"$f":"IF(Orders!$B$20=$A$12, 1, \"\")","v":""},{"$f":"IF(T12=1,COUNTIF($T$2:T12,1),\"\")","v":""},{"$f":"IFERROR(INDEX($O2:$O986,MATCH(ROWS($T$2:T12),$U2:$U986,0)),\"\")","v":""}]
[14,"MFW21MC2","201","M  ","M Mason Chukka","Dark Brown","8-40221-90207-9","C/O       ",8,null,{"v":65,"d":"$65.00"},{"v":130,"d":"$130.00"},{"v":129.95,"d":"$129.95"},0,"Mfw21mc2-201-M  M Mason Chukka"," ",{"$f":"--ISNUMBER(IFERROR(SEARCH(Orders!$E$18,O13,1),\"\"))","v":1},{"$f":"IF(Q13=1,COUNTIF($Q$2:Q13,1),\"\")","v":12},{"$f":"IFERROR(INDEX($O2:$O986,MATCH(ROWS($Q$2:Q13),$R2:$R986,0)),\"\")","v":"Mfw21mc2-201-M  M Mason Chukka"},{"$f":"IF(Orders!$B$20=$A$13, 1, \"\")","v":""},{"$f":"IF(T13=1,COUNTIF($T$2:T13,1),\"\")","v":""},{"$f":"IFERROR(INDEX($O2:$O986,MATCH(ROWS($T$2:T13),$U2:$U986,0)),\"\")","v":""}]
[13,"MFW21MM1","001","M  ","M Mason Mid","Black","8-40221-90151-5","C/O       ",8,null,{"v":82.5,"d":"$82.50"},{"v":165,"d":"$165.00"},{"v":164.95,"d":"$164.95"},0,"Mfw21mm1-001-M  M Mason Mid"," ",{"$f":"--ISNUMBER(IFERROR(SEARCH(Orders!$E$18,O14,1),\"\"))","v":1},{"$f":"IF(Q14=1,COUNTIF($Q$2:Q14,1),\"\")","v":13},{"$f":"IFERROR(INDEX($O2:$O986,MATCH(ROWS($Q$2:Q14),$R2:$R986,0)),\"\")","v":"Mfw21mm1-001-M  M Mason Mid"},{"$f":"IF(Orders!$B$20=$A$14, 1, \"\")","v":""},{"$f":"IF(T14=1,COUNTIF($T$2:T14,1),\"\")","v":""},{"$f":"IFERROR(INDEX($O2:$O986,MATCH(ROWS($T$2:T14),$U2:$U986,0)),\"\")","v":""}]
[10,"MSS18RL2","302","M  ","M Range Low","Olive Mlti","7-54697-65732-9","C/O       ",8,null,{"v":77.5,"d":"$77.50"},{"v":155,"d":"$155.00"},{"v":154.95,"d":"$154.95"},0,"Mss18rl2-302-M  M Range Low"," ",{"$f":"--ISNUMBER(IFERROR(SEARCH(Orders!$E$18,O15,1),\"\"))","v":1},{"$f":"IF(Q15=1,COUNTIF($Q$2:Q15,1),\"\")","v":14},{"$f":"IFERROR(INDEX($O2:$O986,MATCH(ROWS($Q$2:Q15),$R2:$R986,0)),\"\")","v":"Mss18rl2-302-M  M Range Low"},{"$f":"IF(Orders!$B$20=$A$15, 1, \"\")","v":""},{"$f":"IF(T15=1,COUNTIF($T$2:T15,1),\"\")","v":""},{"$f":"IFERROR(INDEX($O2:$O986,MATCH(ROWS($T$2:T15),$U2:$U986,0)),\"\")","v":""}]
[8,"MSS21B1 ","492","M  ","M Banks Low Top","Navy Multi","8-40221-90000-6","C/O       ",8,null,{"v":65,"d":"$65.00"},{"v":130,"d":"$130.00"},{"v":129.95,"d":"$129.95"},0,"Mss21b1-492-M  M Banks Low Top"," ",{"$f":"--ISNUMBER(IFERROR(SEARCH(Orders!$E$18,O16,1),\"\"))","v":1},{"$f":"IF(Q16=1,COUNTIF($Q$2:Q16,1),\"\")","v":15},{"$f":"IFERROR(INDEX($O2:$O986,MATCH(ROWS($Q$2:Q16),$R2:$R986,0)),\"\")","v":"Mss21b1-492-M  M Banks Low Top"},{"$f":"IF(Orders!$B$20=$A$16, 1, \"\")","v":""},{"$f":"IF(T16=1,COUNTIF($T$2:T16,1),\"\")","v":""},{"$f":"IFERROR(INDEX($O2:$O986,MATCH(ROWS($T$2:T16),$U2:$U986,0)),\"\")","v":""}]
[8,"MSS21B3 ","978","M  ","M Banks Low","Blk/Green","8-40221-90012-9","C/O       ",8,null,{"v":65,"d":"$65.00"},{"v":130,"d":"$130.00"},{"v":129.95,"d":"$129.95"},0,"Mss21b3-978-M  M Banks Low"," ",{"$f":"--ISNUMBER(IFERROR(SEARCH(Orders!$E$18,O17,1),\"\"))","v":1},{"$f":"IF(Q17=1,COUNTIF($Q$2:Q17,1),\"\")","v":16},{"$f":"IFERROR(INDEX($O2:$O986,MATCH(ROWS($Q$2:Q17),$R2:$R986,0)),\"\")","v":"Mss21b3-978-M  M Banks Low"},{"$f":"IF(Orders!$B$20=$A$17, 1, \"\")","v":""},{"$f":"IF(T17=1,COUNTIF($T$2:T17,1),\"\")","v":""},{"$f":"IFERROR(INDEX($O2:$O986,MATCH(ROWS($T$2:T17),$U2:$U986,0)),\"\")","v":""}]
[3,"M80001  ","020","M  ","M Dispatch Low Top","Gray","0-21033-49473-4","          ",8,null,{"v":77.5,"d":"$77.50"},{"v":155,"d":"$155.00"},{"v":154.95,"d":"$154.95"},0,"M80001-020-M  M Dispatch Low Top"," ",{"$f":"--ISNUMBER(IFERROR(SEARCH(Orders!$E$18,O18,1),\"\"))","v":1},{"$f":"IF(Q18=1,COUNTIF($Q$2:Q18,1),\"\")","v":17},{"$f":"IFERROR(INDEX($O2:$O986,MATCH(ROWS($Q$2:Q18),$R2:$R986,0)),\"\")","v":"M80001-020-M  M Dispatch Low Top"},{"$f":"IF(Orders!$B$20=$A$18, 1, \"\")","v":""},{"$f":"IF(T18=1,COUNTIF($T$2:T18,1),\"\")","v":""},{"$f":"IFERROR(INDEX($O2:$O986,MATCH(ROWS($T$2:T18),$U2:$U986,0)),\"\")","v":""}]
[3,"M80001  ","025","M  ","M Dispatch Low Top","Gunmetal","0-21033-48674-6","          ",8,null,{"v":77.5,"d":"$77.50"},{"v":155,"d":"$155.00"},{"v":154.95,"d":"$154.95"},0,"M80001-025-M  M Dispatch Low Top"," ",{"$f":"--ISNUMBER(IFERROR(SEARCH(Orders!$E$18,O19,1),\"\"))","v":1},{"$f":"IF(Q19=1,COUNTIF($Q$2:Q19,1),\"\")","v":18},{"$f":"IFERROR(INDEX($O2:$O986,MATCH(ROWS($Q$2:Q19),$R2:$R986,0)),\"\")","v":"M80001-025-M  M Dispatch Low Top"},{"$f":"IF(Orders!$B$20=$A$19, 1, \"\")","v":""},{"$f":"IF(T19=1,COUNTIF($T$2:T19,1),\"\")","v":""},{"$f":"IFERROR(INDEX($O2:$O986,MATCH(ROWS($T$2:T19),$U2:$U986,0)),\"\")","v":""}]
[3,"M80001  ","240","M  ","M Dispatch Low Top","Tan","0-21033-48686-9","          ",8,null,{"v":77.5,"d":"$77.50"},{"v":155,"d":"$155.00"},{"v":154.95,"d":"$154.95"},0,"M80001-240-M  M Dispatch Low Top"," ",{"$f":"--ISNUMBER(IFERROR(SEARCH(Orders!$E$18,O20,1),\"\"))","v":1},{"$f":"IF(Q20=1,COUNTIF($Q$2:Q20,1),\"\")","v":19},{"$f":"IFERROR(INDEX($O2:$O986,MATCH(ROWS($Q$2:Q20),$R2:$R986,0)),\"\")","v":"M80001-240-M  M Dispatch Low Top"},{"$f":"IF(Orders!$B$20=$A$20, 1, \"\")","v":""},{"$f":"IF(T20=1,COUNTIF($T$2:T20,1),\"\")","v":""},{"$f":"IFERROR(INDEX($O2:$O986,MATCH(ROWS($T$2:T20),$U2:$U986,0)),\"\")","v":""}]
[3,"M80001  ","305","M  ","M Dispatch Low Top","Loden","0-21033-48698-2","          ",8,null,{"v":77.5,"d":"$77.50"},{"v":155,"d":"$155.00"},{"v":154.95,"d":"$154.95"},0,"M80001-305-M  M Dispatch Low Top"," ",{"$f":"--ISNUMBER(IFERROR(SEARCH(Orders!$E$18,O21,1),\"\"))","v":1},{"$f":"IF(Q21=1,COUNTIF($Q$2:Q21,1),\"\")","v":20},{"$f":"IFERROR(INDEX($O2:$O986,MATCH(ROWS($Q$2:Q21),$R2:$R986,0)),\"\")","v":"M80001-305-M  M Dispatch Low Top"},{"$f":"IF(Orders!$B$20=$A$21, 1, \"\")","v":""},{"$f":"IF(T21=1,COUNTIF($T$2:T21,1),\"\")","v":""},{"$f":"IFERROR(INDEX($O2:$O986,MATCH(ROWS($T$2:T21),$U2:$U986,0)),\"\")","v":""}]
[0,"M80002  ","009","M  ","M Cascade Trail Low","Blk Multi","0-21033-48710-1","          ",8,null,{"v":65,"d":"$65.00"},{"v":130,"d":"$130.00"},{"v":129.95,"d":"$129.95"},0,"M80002-009-M  M Cascade Trail Low"," ",{"$f":"--ISNUMBER(IFERROR(SEARCH(Orders!$E$18,O22,1),\"\"))","v":1},{"$f":"IF(Q22=1,COUNTIF($Q$2:Q22,1),\"\")","v":21},{"$f":"IFERROR(INDEX($O2:$O986,MATCH(ROWS($Q$2:Q22),$R2:$R986,0)),\"\")","v":"M80002-009-M  M Cascade Trail Low"},{"$f":"IF(Orders!$B$20=$A$22, 1, \"\")","v":1},{"$f":"IF(T22=1,COUNTIF($T$2:T22,1),\"\")","v":1},{"$f":"IFERROR(INDEX($O2:$O986,MATCH(ROWS($T$2:T22),$U2:$U986,0)),\"\")","v":""}]
[0,"M80002  ","419","M  ","M Cascade Trail Low","Navy/Gray","0-21033-48746-0","          ",8,null,{"v":65,"d":"$65.00"},{"v":130,"d":"$130.00"},{"v":129.95,"d":"$129.95"},0,"M80002-419-M  M Cascade Trail Low"," ",{"$f":"--ISNUMBER(IFERROR(SEARCH(Orders!$E$18,O23,1),\"\"))","v":1},{"$f":"IF(Q23=1,COUNTIF($Q$2:Q23,1),\"\")","v":22},{"$f":"IFERROR(INDEX($O2:$O986,MATCH(ROWS($Q$2:Q23),$R2:$R986,0)),\"\")","v":"M80002-419-M  M Cascade Trail Low"},{"$f":"IF(Orders!$B$20=$A$23, 1, \"\")","v":1},{"$f":"IF(T23=1,COUNTIF($T$2:T23,1),\"\")","v":2},{"$f":"IFERROR(INDEX($O2:$O986,MATCH(ROWS($T$2:T23),$U2:$U986,0)),\"\")","v":""}]
[4,"M80007  ","001","M  ","M Cascade Trail Mid","Black","0-21033-48934-1","          ",8,null,{"v":75,"d":"$75.00"},{"v":150,"d":"$150.00"},{"v":149.95,"d":"$149.95"},0,"M80007-001-M  M Cascade Trail Mid"," ",{"$f":"--ISNUMBER(IFERROR(SEARCH(Orders!$E$18,O24,1),\"\"))","v":1},{"$f":"IF(Q24=1,COUNTIF($Q$2:Q24,1),\"\")","v":23},{"$f":"IFERROR(INDEX($O2:$O986,MATCH(ROWS($Q$2:Q24),$R2:$R986,0)),\"\")","v":"M80007-001-M  M Cascade Trail Mid"},{"$f":"IF(Orders!$B$20=$A$24, 1, \"\")","v":""},{"$f":"IF(T24=1,COUNTIF($T$2:T24,1),\"\")","v":""},{"$f":"IFERROR(INDEX($O2:$O986,MATCH(ROWS($T$2:T24),$U2:$U986,0)),\"\")","v":""}]
[4,"M80007  ","052","M  ","M Cascade Trail Mid","Misty Gray","0-21033-48946-4","          ",8,null,{"v":75,"d":"$75.00"},{"v":150,"d":"$150.00"},{"v":149.95,"d":"$149.95"},0,"M80007-052-M  M Cascade Trail Mid"," ",{"$f":"--ISNUMBER(IFERROR(SEARCH(Orders!$E$18,O25,1),\"\"))","v":1},{"$f":"IF(Q25=1,COUNTIF($Q$2:Q25,1),\"\")","v":24},{"$f":"IFERROR(INDEX($O2:$O986,MATCH(ROWS($Q$2:Q25),$R2:$R986,0)),\"\")","v":"M80007-052-M  M Cascade Trail Mid"},{"$f":"IF(Orders!$B$20=$A$25, 1, \"\")","v":""},{"$f":"IF(T25=1,COUNTIF($T$2:T25,1),\"\")","v":""},{"$f":"IFERROR(INDEX($O2:$O986,MATCH(ROWS($T$2:T25),$U2:$U986,0)),\"\")","v":""}]
[4,"M80007  ","349","M  ","M Cascade Trail Mid","Lodenmulti","0-21033-48970-9","          ",8,null,{"v":75,"d":"$75.00"},{"v":150,"d":"$150.00"},{"v":149.95,"d":"$149.95"},0,"M80007-349-M  M Cascade Trail Mid"," ",{"$f":"--ISNUMBER(IFERROR(SEARCH(Orders!$E$18,O26,1),\"\"))","v":1},{"$f":"IF(Q26=1,COUNTIF($Q$2:Q26,1),\"\")","v":25},{"$f":"IFERROR(INDEX($O2:$O986,MATCH(ROWS($Q$2:Q26),$R2:$R986,0)),\"\")","v":"M80007-349-M  M Cascade Trail Mid"},{"$f":"IF(Orders!$B$20=$A$26, 1, \"\")","v":""},{"$f":"IF(T26=1,COUNTIF($T$2:T26,1),\"\")","v":""},{"$f":"IFERROR(INDEX($O2:$O986,MATCH(ROWS($T$2:T26),$U2:$U986,0)),\"\")","v":""}]
[7,"M80008  ","001","M  ","M Banks Mid","Black","0-21033-48982-2","          ",8,null,{"v":77.5,"d":"$77.50"},{"v":155,"d":"$155.00"},{"v":154.95,"d":"$154.95"},0,"M80008-001-M  M Banks Mid"," ",{"$f":"--ISNUMBER(IFERROR(SEARCH(Orders!$E$18,O27,1),\"\"))","v":1},{"$f":"IF(Q27=1,COUNTIF($Q$2:Q27,1),\"\")","v":26},{"$f":"IFERROR(INDEX($O2:$O986,MATCH(ROWS($Q$2:Q27),$R2:$R986,0)),\"\")","v":"M80008-001-M  M Banks Mid"},{"$f":"IF(Orders!$B$20=$A$27, 1, \"\")","v":""},{"$f":"IF(T27=1,COUNTIF($T$2:T27,1),\"\")","v":""},{"$f":"IFERROR(INDEX($O2:$O986,MATCH(ROWS($T$2:T27),$U2:$U986,0)),\"\")","v":""}]
[7,"M80008  ","349","M  ","M Banks Mid","Lodenmulti","0-21033-49006-4","          ",8,null,{"v":77.5,"d":"$77.50"},{"v":155,"d":"$155.00"},{"v":154.95,"d":"$154.95"},0,"M80008-349-M  M Banks Mid"," ",{"$f":"--ISNUMBER(IFERROR(SEARCH(Orders!$E$18,O28,1),\"\"))","v":1},{"$f":"IF(Q28=1,COUNTIF($Q$2:Q28,1),\"\")","v":27},{"$f":"IFERROR(INDEX($O2:$O986,MATCH(ROWS($Q$2:Q28),$R2:$R986,0)),\"\")","v":"M80008-349-M  M Banks Mid"},{"$f":"IF(Orders!$B$20=$A$28, 1, \"\")","v":""},{"$f":"IF(T28=1,COUNTIF($T$2:T28,1),\"\")","v":""},{"$f":"IFERROR(INDEX($O2:$O986,MATCH(ROWS($T$2:T28),$U2:$U986,0)),\"\")","v":""}]
[7,"M80008  ","492","M  ","M Banks Mid","Navy Multi","0-21033-49449-9","          ",8,null,{"v":77.5,"d":"$77.50"},{"v":155,"d":"$155.00"},{"v":154.95,"d":"$154.95"},0,"M80008-492-M  M Banks Mid"," ",{"$f":"--ISNUMBER(IFERROR(SEARCH(Orders!$E$18,O29,1),\"\"))","v":1},{"$f":"IF(Q29=1,COUNTIF($Q$2:Q29,1),\"\")","v":28},{"$f":"IFERROR(INDEX($O2:$O986,MATCH(ROWS($Q$2:Q29),$R2:$R986,0)),\"\")","v":"M80008-492-M  M Banks Mid"},{"$f":"IF(Orders!$B$20=$A$29, 1, \"\")","v":""},{"$f":"IF(T29=1,COUNTIF($T$2:T29,1),\"\")","v":""},{"$f":"IFERROR(INDEX($O2:$O986,MATCH(ROWS($T$2:T29),$U2:$U986,0)),\"\")","v":""}]
[13,"M80010  ","020","M  ","M Mason Mid","Gray","0-21033-49042-2","          ",8,null,{"v":82.5,"d":"$82.50"},{"v":165,"d":"$165.00"},{"v":164.95,"d":"$164.95"},0,"M80010-020-M  M Mason Mid"," ",{"$f":"--ISNUMBER(IFERROR(SEARCH(Orders!$E$18,O30,1),\"\"))","v":1},{"$f":"IF(Q30=1,COUNTIF($Q$2:Q30,1),\"\")","v":29},{"$f":"IFERROR(INDEX($O2:$O986,MATCH(ROWS($Q$2:Q30),$R2:$R986,0)),\"\")","v":"M80010-020-M  M Mason Mid"},{"$f":"IF(Orders!$B$20=$A$30, 1, \"\")","v":""},{"$f":"IF(T30=1,COUNTIF($T$2:T30,1),\"\")","v":""},{"$f":"IFERROR(INDEX($O2:$O986,MATCH(ROWS($T$2:T30),$U2:$U986,0)),\"\")","v":""}]
[13,"M80010  ","240","M  ","M Mason Mid","Tan","0-21033-49054-5","          ",8,null,{"v":82.5,"d":"$82.50"},{"v":165,"d":"$165.00"},{"v":164.95,"d":"$164.95"},0,"M80010-240-M  M Mason Mid"," ",{"$f":"--ISNUMBER(IFERROR(SEARCH(Orders!$E$18,O31,1),\"\"))","v":1},{"$f":"IF(Q31=1,COUNTIF($Q$2:Q31,1),\"\")","v":30},{"$f":"IFERROR(INDEX($O2:$O986,MATCH(ROWS($Q$2:Q31),$R2:$R986,0)),\"\")","v":"M80010-240-M  M Mason Mid"},{"$f":"IF(Orders!$B$20=$A$31, 1, \"\")","v":""},{"$f":"IF(T31=1,COUNTIF($T$2:T31,1),\"\")","v":""},{"$f":"IFERROR(INDEX($O2:$O986,MATCH(ROWS($T$2:T31),$U2:$U986,0)),\"\")","v":""}]
[13,"M80010  ","303","M  ","M Mason Mid","Olive","0-21033-49066-8","          ",8,null,{"v":82.5,"d":"$82.50"},{"v":165,"d":"$165.00"},{"v":164.95,"d":"$164.95"},0,"M80010-303-M  M Mason Mid"," ",{"$f":"--ISNUMBER(IFERROR(SEARCH(Orders!$E$18,O32,1),\"\"))","v":1},{"$f":"IF(Q32=1,COUNTIF($Q$2:Q32,1),\"\")","v":31},{"$f":"IFERROR(INDEX($O2:$O986,MATCH(ROWS($Q$2:Q32),$R2:$R986,0)),\"\")","v":"M80010-303-M  M Mason Mid"},{"$f":"IF(Orders!$B$20=$A$32, 1, \"\")","v":""},{"$f":"IF(T32=1,COUNTIF($T$2:T32,1),\"\")","v":""},{"$f":"IFERROR(INDEX($O2:$O986,MATCH(ROWS($T$2:T32),$U2:$U986,0)),\"\")","v":""}]
[9,"M80012  ","305","M  ","M Halden","Loden","0-21033-49126-9","          ",8,null,{"v":87.5,"d":"$87.50"},{"v":175,"d":"$175.00"},{"v":174.95,"d":"$174.95"},0,"M80012-305-M  M Halden"," ",{"$f":"--ISNUMBER(IFERROR(SEARCH(Orders!$E$18,O33,1),\"\"))","v":1},{"$f":"IF(Q33=1,COUNTIF($Q$2:Q33,1),\"\")","v":32},{"$f":"IFERROR(INDEX($O2:$O986,MATCH(ROWS($Q$2:Q33),$R2:$R986,0)),\"\")","v":"M80012-305-M  M Halden"},{"$f":"IF(Orders!$B$20=$A$33, 1, \"\")","v":""},{"$f":"IF(T33=1,COUNTIF($T$2:T33,1),\"\")","v":""},{"$f":"IFERROR(INDEX($O2:$O986,MATCH(ROWS($T$2:T33),$U2:$U986,0)),\"\")","v":""}]
[2,"M80013  ","349","M  ","M Dispatch","Lodenmulti","0-21033-49162-7","          ",8,null,{"v":85,"d":"$85.00"},{"v":170,"d":"$170.00"},{"v":169.95,"d":"$169.95"},{"$f":"J34*K34","v":0},"M80013-349-M  M Dispatch"," ",{"$f":"--ISNUMBER(IFERROR(SEARCH(Orders!$E$18,O34,1),\"\"))","v":1},{"$f":"IF(Q34=1,COUNTIF($Q$2:Q34,1),\"\")","v":33},{"$f":"IFERROR(INDEX($O2:$O986,MATCH(ROWS($Q$2:Q34),$R2:$R986,0)),\"\")","v":"M80013-349-M  M Dispatch"},{"$f":"IF(Orders!$B$20=$A$34, 1, \"\")","v":""},{"$f":"IF(T34=1,COUNTIF($T$2:T34,1),\"\")","v":""},{"$f":"IFERROR(INDEX($O2:$O986,MATCH(ROWS($T$2:T34),$U2:$U986,0)),\"\")","v":""}]
[12,"M80015  ","001","M  ","M Davos Mid","Black","0-21033-49186-3","          ",8,null,{"v":85,"d":"$85.00"},{"v":170,"d":"$170.00"},{"v":169.95,"d":"$169.95"},0,"M80015-001-M  M Davos Mid"," ",{"$f":"--ISNUMBER(IFERROR(SEARCH(Orders!$E$18,O35,1),\"\"))","v":1},{"$f":"IF(Q35=1,COUNTIF($Q$2:Q35,1),\"\")","v":34},{"$f":"IFERROR(INDEX($O2:$O986,MATCH(ROWS($Q$2:Q35),$R2:$R986,0)),\"\")","v":"M80015-001-M  M Davos Mid"},{"$f":"IF(Orders!$B$20=$A$35, 1, \"\")","v":""},{"$f":"IF(T35=1,COUNTIF($T$2:T35,1),\"\")","v":""},{"$f":"IFERROR(INDEX($O2:$O986,MATCH(ROWS($T$2:T35),$U2:$U986,0)),\"\")","v":""}]
[12,"M80015  ","305","M  ","M Davos Mid","Loden","0-21033-49509-0","          ",8,null,{"v":85,"d":"$85.00"},{"v":170,"d":"$170.00"},{"v":169.95,"d":"$169.95"},0,"M80015-305-M  M Davos Mid"," ",{"$f":"--ISNUMBER(IFERROR(SEARCH(Orders!$E$18,O36,1),\"\"))","v":1},{"$f":"IF(Q36=1,COUNTIF($Q$2:Q36,1),\"\")","v":35},{"$f":"IFERROR(INDEX($O2:$O986,MATCH(ROWS($Q$2:Q36),$R2:$R986,0)),\"\")","v":"M80015-305-M  M Davos Mid"},{"$f":"IF(Orders!$B$20=$A$36, 1, \"\")","v":""},{"$f":"IF(T36=1,COUNTIF($T$2:T36,1),\"\")","v":""},{"$f":"IFERROR(INDEX($O2:$O986,MATCH(ROWS($T$2:T36),$U2:$U986,0)),\"\")","v":""}]
[10,"M80016  ","025","M  ","M Range Low","Gunmetal","0-21033-49198-6","          ",8,null,{"v":77.5,"d":"$77.50"},{"v":155,"d":"$155.00"},{"v":154.95,"d":"$154.95"},0,"M80016-025-M  M Range Low"," ",{"$f":"--ISNUMBER(IFERROR(SEARCH(Orders!$E$18,O37,1),\"\"))","v":1},{"$f":"IF(Q37=1,COUNTIF($Q$2:Q37,1),\"\")","v":36},{"$f":"IFERROR(INDEX($O2:$O986,MATCH(ROWS($Q$2:Q37),$R2:$R986,0)),\"\")","v":"M80016-025-M  M Range Low"},{"$f":"IF(Orders!$B$20=$A$37, 1, \"\")","v":""},{"$f":"IF(T37=1,COUNTIF($T$2:T37,1),\"\")","v":""},{"$f":"IFERROR(INDEX($O2:$O986,MATCH(ROWS($T$2:T37),$U2:$U986,0)),\"\")","v":""}]
[10,"M80016  ","261","M  ","M Range Low","Taupe Mult","0-21033-49521-2","          ",8,null,{"v":77.5,"d":"$77.50"},{"v":155,"d":"$155.00"},{"v":154.95,"d":"$154.95"},0,"M80016-261-M  M Range Low"," ",{"$f":"--ISNUMBER(IFERROR(SEARCH(Orders!$E$18,O38,1),\"\"))","v":1},{"$f":"IF(Q38=1,COUNTIF($Q$2:Q38,1),\"\")","v":37},{"$f":"IFERROR(INDEX($O2:$O986,MATCH(ROWS($Q$2:Q38),$R2:$R986,0)),\"\")","v":"M80016-261-M  M Range Low"},{"$f":"IF(Orders!$B$20=$A$38, 1, \"\")","v":""},{"$f":"IF(T38=1,COUNTIF($T$2:T38,1),\"\")","v":""},{"$f":"IFERROR(INDEX($O2:$O986,MATCH(ROWS($T$2:T38),$U2:$U986,0)),\"\")","v":""}]
[5,"M80032  ","025","M  ","M Cascade Peak Low W","Gunmetal","0-21033-49533-5","          ",8,null,{"v":72.5,"d":"$72.50"},{"v":145,"d":"$145.00"},{"v":144.95,"d":"$144.95"},0,"M80032-025-M  M Cascade Peak Low W"," ",{"$f":"--ISNUMBER(IFERROR(SEARCH(Orders!$E$18,O39,1),\"\"))","v":1},{"$f":"IF(Q39=1,COUNTIF($Q$2:Q39,1),\"\")","v":38},{"$f":"IFERROR(INDEX($O2:$O986,MATCH(ROWS($Q$2:Q39),$R2:$R986,0)),\"\")","v":"M80032-025-M  M Cascade Peak Low W"},{"$f":"IF(Orders!$B$20=$A$39, 1, \"\")","v":""},{"$f":"IF(T39=1,COUNTIF($T$2:T39,1),\"\")","v":""},{"$f":"IFERROR(INDEX($O2:$O986,MATCH(ROWS($T$2:T39),$U2:$U986,0)),\"\")","v":""}]
[5,"M80032  ","233","M  ","M Cascade Peak Low W","Cocoa","0-21033-49545-8","          ",8,null,{"v":72.5,"d":"$72.50"},{"v":145,"d":"$145.00"},{"v":144.95,"d":"$144.95"},0,"M80032-233-M  M Cascade Peak Low W"," ",{"$f":"--ISNUMBER(IFERROR(SEARCH(Orders!$E$18,O40,1),\"\"))","v":1},{"$f":"IF(Q40=1,COUNTIF($Q$2:Q40,1),\"\")","v":39},{"$f":"IFERROR(INDEX($O2:$O986,MATCH(ROWS($Q$2:Q40),$R2:$R986,0)),\"\")","v":"M80032-233-M  M Cascade Peak Low W"},{"$f":"IF(Orders!$B$20=$A$40, 1, \"\")","v":""},{"$f":"IF(T40=1,COUNTIF($T$2:T40,1),\"\")","v":""},{"$f":"IFERROR(INDEX($O2:$O986,MATCH(ROWS($T$2:T40),$U2:$U986,0)),\"\")","v":""}]
[5,"M80032  ","410","M  ","M Cascade Peak Low W","Navy","0-21033-49557-1","          ",8,null,{"v":72.5,"d":"$72.50"},{"v":145,"d":"$145.00"},{"v":144.95,"d":"$144.95"},0,"M80032-410-M  M Cascade Peak Low W"," ",{"$f":"--ISNUMBER(IFERROR(SEARCH(Orders!$E$18,O41,1),\"\"))","v":1},{"$f":"IF(Q41=1,COUNTIF($Q$2:Q41,1),\"\")","v":40},{"$f":"IFERROR(INDEX($O2:$O986,MATCH(ROWS($Q$2:Q41),$R2:$R986,0)),\"\")","v":"M80032-410-M  M Cascade Peak Low W"},{"$f":"IF(Orders!$B$20=$A$41, 1, \"\")","v":""},{"$f":"IF(T41=1,COUNTIF($T$2:T41,1),\"\")","v":""},{"$f":"IFERROR(INDEX($O2:$O986,MATCH(ROWS($T$2:T41),$U2:$U986,0)),\"\")","v":""}]
[1,"M80037  ","001","M  ","M Wild Sky Mid","Black","0-21033-49963-0","          ",7,null,{"v":77.5,"d":"$77.50"},{"v":155,"d":"$155.00"},{"v":154.95,"d":"$154.95"},0,"M80037-001-M  M Wild Sky Mid"," ",{"$f":"--ISNUMBER(IFERROR(SEARCH(Orders!$E$18,O42,1),\"\"))","v":1},{"$f":"IF(Q42=1,COUNTIF($Q$2:Q42,1),\"\")","v":41},{"$f":"IFERROR(INDEX($O2:$O986,MATCH(ROWS($Q$2:Q42),$R2:$R986,0)),\"\")","v":"M80037-001-M  M Wild Sky Mid"},{"$f":"IF(Orders!$B$20=$A$42, 1, \"\")","v":""},{"$f":"IF(T42=1,COUNTIF($T$2:T42,1),\"\")","v":""},{"$f":"IFERROR(INDEX($O2:$O986,MATCH(ROWS($T$2:T42),$U2:$U986,0)),\"\")","v":""}]
[1,"M80037  ","072","M  ","M Wild Sky Mid","Dkgry/Gold","0-21033-49977-7","          ",7,null,{"v":77.5,"d":"$77.50"},{"v":155,"d":"$155.00"},{"v":154.95,"d":"$154.95"},0,"M80037-072-M  M Wild Sky Mid"," ",{"$f":"--ISNUMBER(IFERROR(SEARCH(Orders!$E$18,O43,1),\"\"))","v":1},{"$f":"IF(Q43=1,COUNTIF($Q$2:Q43,1),\"\")","v":42},{"$f":"IFERROR(INDEX($O2:$O986,MATCH(ROWS($Q$2:Q43),$R2:$R986,0)),\"\")","v":"M80037-072-M  M Wild Sky Mid"},{"$f":"IF(Orders!$B$20=$A$43, 1, \"\")","v":""},{"$f":"IF(T43=1,COUNTIF($T$2:T43,1),\"\")","v":""},{"$f":"IFERROR(INDEX($O2:$O986,MATCH(ROWS($T$2:T43),$U2:$U986,0)),\"\")","v":""}]
[1,"M80037  ","249","M  ","M Wild Sky Mid","Brn Multi","0-21033-49991-3","          ",7,null,{"v":77.5,"d":"$77.50"},{"v":155,"d":"$155.00"},{"v":154.95,"d":"$154.95"},0,"M80037-249-M  M Wild Sky Mid"," ",{"$f":"--ISNUMBER(IFERROR(SEARCH(Orders!$E$18,O44,1),\"\"))","v":1},{"$f":"IF(Q44=1,COUNTIF($Q$2:Q44,1),\"\")","v":43},{"$f":"IFERROR(INDEX($O2:$O986,MATCH(ROWS($Q$2:Q44),$R2:$R986,0)),\"\")","v":"M80037-249-M  M Wild Sky Mid"},{"$f":"IF(Orders!$B$20=$A$44, 1, \"\")","v":""},{"$f":"IF(T44=1,COUNTIF($T$2:T44,1),\"\")","v":""},{"$f":"IFERROR(INDEX($O2:$O986,MATCH(ROWS($T$2:T44),$U2:$U986,0)),\"\")","v":""}]
[28,"U80035  ","001","M  ","Rogue","Black","0-21033-49915-9","          ",4,null,{"v":42.5,"d":"$42.50"},{"v":85,"d":"$85.00"},{"v":84.95,"d":"$84.95"},0,"U80035-001-M  Rogue"," ",{"$f":"--ISNUMBER(IFERROR(SEARCH(Orders!$E$18,O45,1),\"\"))","v":1},{"$f":"IF(Q45=1,COUNTIF($Q$2:Q45,1),\"\")","v":44},{"$f":"IFERROR(INDEX($O2:$O986,MATCH(ROWS($Q$2:Q45),$R2:$R986,0)),\"\")","v":"U80035-001-M  Rogue"},{"$f":"IF(Orders!$B$20=$A$45, 1, \"\")","v":""},{"$f":"IF(T45=1,COUNTIF($T$2:T45,1),\"\")","v":""},{"$f":"IFERROR(INDEX($O2:$O986,MATCH(ROWS($T$2:T45),$U2:$U986,0)),\"\")","v":""}]
[28,"U80035  ","009","M  ","Rogue","Blk Multi","0-21033-49927-2","          ",4,null,{"v":42.5,"d":"$42.50"},{"v":85,"d":"$85.00"},{"v":84.95,"d":"$84.95"},0,"U80035-009-M  Rogue"," ",{"$f":"--ISNUMBER(IFERROR(SEARCH(Orders!$E$18,O46,1),\"\"))","v":1},{"$f":"IF(Q46=1,COUNTIF($Q$2:Q46,1),\"\")","v":45},{"$f":"IFERROR(INDEX($O2:$O986,MATCH(ROWS($Q$2:Q46),$R2:$R986,0)),\"\")","v":"U80035-009-M  Rogue"},{"$f":"IF(Orders!$B$20=$A$46, 1, \"\")","v":""},{"$f":"IF(T46=1,COUNTIF($T$2:T46,1),\"\")","v":""},{"$f":"IFERROR(INDEX($O2:$O986,MATCH(ROWS($T$2:T46),$U2:$U986,0)),\"\")","v":""}]
[28,"U80035  ","305","M  ","Rogue","Loden","0-21033-49939-5","          ",4,null,{"v":42.5,"d":"$42.50"},{"v":85,"d":"$85.00"},{"v":84.95,"d":"$84.95"},0,"U80035-305-M  Rogue"," ",{"$f":"--ISNUMBER(IFERROR(SEARCH(Orders!$E$18,O47,1),\"\"))","v":1},{"$f":"IF(Q47=1,COUNTIF($Q$2:Q47,1),\"\")","v":46},{"$f":"IFERROR(INDEX($O2:$O986,MATCH(ROWS($Q$2:Q47),$R2:$R986,0)),\"\")","v":"U80035-305-M  Rogue"},{"$f":"IF(Orders!$B$20=$A$47, 1, \"\")","v":""},{"$f":"IF(T47=1,COUNTIF($T$2:T47,1),\"\")","v":""},{"$f":"IFERROR(INDEX($O2:$O986,MATCH(ROWS($T$2:T47),$U2:$U986,0)),\"\")","v":""}]
[28,"U80035  ","540","M  ","Rogue","Prpl Multi","0-21033-49951-7","          ",4,null,{"v":42.5,"d":"$42.50"},{"v":85,"d":"$85.00"},{"v":84.95,"d":"$84.95"},0,"U80035-540-M  Rogue"," ",{"$f":"--ISNUMBER(IFERROR(SEARCH(Orders!$E$18,O48,1),\"\"))","v":1},{"$f":"IF(Q48=1,COUNTIF($Q$2:Q48,1),\"\")","v":47},{"$f":"IFERROR(INDEX($O2:$O986,MATCH(ROWS($Q$2:Q48),$R2:$R986,0)),\"\")","v":"U80035-540-M  Rogue"},{"$f":"IF(Orders!$B$20=$A$48, 1, \"\")","v":""},{"$f":"IF(T48=1,COUNTIF($T$2:T48,1),\"\")","v":""},{"$f":"IFERROR(INDEX($O2:$O986,MATCH(ROWS($T$2:T48),$U2:$U986,0)),\"\")","v":""}]
[23,"WFW16P1 ","988","M  ","W Patch Mid","Tan/Black","7-18598-83080-9","C/O       ",5,null,{"v":85,"d":"$85.00"},{"v":170,"d":"$170.00"},{"v":169.95,"d":"$169.95"},0,"Wfw16p1-988-M  W Patch Mid"," ",{"$f":"--ISNUMBER(IFERROR(SEARCH(Orders!$E$18,O49,1),\"\"))","v":1},{"$f":"IF(Q49=1,COUNTIF($Q$2:Q49,1),\"\")","v":48},{"$f":"IFERROR(INDEX($O2:$O986,MATCH(ROWS($Q$2:Q49),$R2:$R986,0)),\"\")","v":"Wfw16p1-988-M  W Patch Mid"},{"$f":"IF(Orders!$B$20=$A$49, 1, \"\")","v":""},{"$f":"IF(T49=1,COUNTIF($T$2:T49,1),\"\")","v":""},{"$f":"IFERROR(INDEX($O2:$O986,MATCH(ROWS($T$2:T49),$U2:$U986,0)),\"\")","v":""}]
[23,"WFW16P12","303","M  ","W Patch Mid","Olive","8-40221-90399-1","C/O       ",5,null,{"v":85,"d":"$85.00"},{"v":170,"d":"$170.00"},{"v":169.95,"d":"$169.95"},0,"Wfw16p12-303-M  W Patch Mid"," ",{"$f":"--ISNUMBER(IFERROR(SEARCH(Orders!$E$18,O50,1),\"\"))","v":1},{"$f":"IF(Q50=1,COUNTIF($Q$2:Q50,1),\"\")","v":49},{"$f":"IFERROR(INDEX($O2:$O986,MATCH(ROWS($Q$2:Q50),$R2:$R986,0)),\"\")","v":"Wfw16p12-303-M  W Patch Mid"},{"$f":"IF(Orders!$B$20=$A$50, 1, \"\")","v":""},{"$f":"IF(T50=1,COUNTIF($T$2:T50,1),\"\")","v":""},{"$f":"IFERROR(INDEX($O2:$O986,MATCH(ROWS($T$2:T50),$U2:$U986,0)),\"\")","v":""}]
[23,"WFW16P7 ","989","M  ","W Patch Mid","Brwn/Navy","7-18598-83084-7","C/O       ",5,null,{"v":85,"d":"$85.00"},{"v":170,"d":"$170.00"},{"v":169.95,"d":"$169.95"},0,"Wfw16p7-989-M  W Patch Mid"," ",{"$f":"--ISNUMBER(IFERROR(SEARCH(Orders!$E$18,O51,1),\"\"))","v":1},{"$f":"IF(Q51=1,COUNTIF($Q$2:Q51,1),\"\")","v":50},{"$f":"IFERROR(INDEX($O2:$O986,MATCH(ROWS($Q$2:Q51),$R2:$R986,0)),\"\")","v":"Wfw16p7-989-M  W Patch Mid"},{"$f":"IF(Orders!$B$20=$A$51, 1, \"\")","v":""},{"$f":"IF(T51=1,COUNTIF($T$2:T51,1),\"\")","v":""},{"$f":"IFERROR(INDEX($O2:$O986,MATCH(ROWS($T$2:T51),$U2:$U986,0)),\"\")","v":""}]
[27,"WFW19LM1","303","M  ","W Lucie Mid","Olive","7-18598-83193-6","C/O       ",5,null,{"v":75,"d":"$75.00"},{"v":150,"d":"$150.00"},{"v":149.95,"d":"$149.95"},0,"Wfw19lm1-303-M  W Lucie Mid"," ",{"$f":"--ISNUMBER(IFERROR(SEARCH(Orders!$E$18,O52,1),\"\"))","v":1},{"$f":"IF(Q52=1,COUNTIF($Q$2:Q52,1),\"\")","v":51},{"$f":"IFERROR(INDEX($O2:$O986,MATCH(ROWS($Q$2:Q52),$R2:$R986,0)),\"\")","v":"Wfw19lm1-303-M  W Lucie Mid"},{"$f":"IF(Orders!$B$20=$A$52, 1, \"\")","v":""},{"$f":"IF(T52=1,COUNTIF($T$2:T52,1),\"\")","v":""},{"$f":"IFERROR(INDEX($O2:$O986,MATCH(ROWS($T$2:T52),$U2:$U986,0)),\"\")","v":""}]
[27,"WFW19LM9","009","M  ","W Lucie Mid","Blk Multi","8-40221-90362-5","C/O       ",5,null,{"v":75,"d":"$75.00"},{"v":150,"d":"$150.00"},{"v":149.95,"d":"$149.95"},0,"Wfw19lm9-009-M  W Lucie Mid"," ",{"$f":"--ISNUMBER(IFERROR(SEARCH(Orders!$E$18,O53,1),\"\"))","v":1},{"$f":"IF(Q53=1,COUNTIF($Q$2:Q53,1),\"\")","v":52},{"$f":"IFERROR(INDEX($O2:$O986,MATCH(ROWS($Q$2:Q53),$R2:$R986,0)),\"\")","v":"Wfw19lm9-009-M  W Lucie Mid"},{"$f":"IF(Orders!$B$20=$A$53, 1, \"\")","v":""},{"$f":"IF(T53=1,COUNTIF($T$2:T53,1),\"\")","v":""},{"$f":"IFERROR(INDEX($O2:$O986,MATCH(ROWS($T$2:T53),$U2:$U986,0)),\"\")","v":""}]
[17,"WFW20T1 ","001","M  ","W Thatcher Mid","Black","7-52505-95533-9","C/O       ",6,null,{"v":85,"d":"$85.00"},{"v":170,"d":"$170.00"},{"v":169.95,"d":"$169.95"},0,"Wfw20t1-001-M  W Thatcher Mid"," ",{"$f":"--ISNUMBER(IFERROR(SEARCH(Orders!$E$18,O54,1),\"\"))","v":1},{"$f":"IF(Q54=1,COUNTIF($Q$2:Q54,1),\"\")","v":53},{"$f":"IFERROR(INDEX($O2:$O986,MATCH(ROWS($Q$2:Q54),$R2:$R986,0)),\"\")","v":"Wfw20t1-001-M  W Thatcher Mid"},{"$f":"IF(Orders!$B$20=$A$54, 1, \"\")","v":""},{"$f":"IF(T54=1,COUNTIF($T$2:T54,1),\"\")","v":""},{"$f":"IFERROR(INDEX($O2:$O986,MATCH(ROWS($T$2:T54),$U2:$U986,0)),\"\")","v":""}]
[17,"WFW20T2 ","235","M  ","W Thatcher Mid","Toffee","7-52505-95546-9","C/O       ",6,null,{"v":85,"d":"$85.00"},{"v":170,"d":"$170.00"},{"v":169.95,"d":"$169.95"},0,"Wfw20t2-235-M  W Thatcher Mid"," ",{"$f":"--ISNUMBER(IFERROR(SEARCH(Orders!$E$18,O55,1),\"\"))","v":1},{"$f":"IF(Q55=1,COUNTIF($Q$2:Q55,1),\"\")","v":54},{"$f":"IFERROR(INDEX($O2:$O986,MATCH(ROWS($Q$2:Q55),$R2:$R986,0)),\"\")","v":"Wfw20t2-235-M  W Thatcher Mid"},{"$f":"IF(Orders!$B$20=$A$55, 1, \"\")","v":""},{"$f":"IF(T55=1,COUNTIF($T$2:T55,1),\"\")","v":""},{"$f":"IFERROR(INDEX($O2:$O986,MATCH(ROWS($T$2:T55),$U2:$U986,0)),\"\")","v":""}]
[26,"WFW21LC1","001","M  ","W Lucie Chelsea","Black","8-40221-90284-0","C/O       ",5,null,{"v":77.5,"d":"$77.50"},{"v":155,"d":"$155.00"},{"v":154.95,"d":"$154.95"},0,"Wfw21lc1-001-M  W Lucie Chelsea"," ",{"$f":"--ISNUMBER(IFERROR(SEARCH(Orders!$E$18,O56,1),\"\"))","v":1},{"$f":"IF(Q56=1,COUNTIF($Q$2:Q56,1),\"\")","v":55},{"$f":"IFERROR(INDEX($O2:$O986,MATCH(ROWS($Q$2:Q56),$R2:$R986,0)),\"\")","v":"Wfw21lc1-001-M  W Lucie Chelsea"},{"$f":"IF(Orders!$B$20=$A$56, 1, \"\")","v":""},{"$f":"IF(T56=1,COUNTIF($T$2:T56,1),\"\")","v":""},{"$f":"IFERROR(INDEX($O2:$O986,MATCH(ROWS($T$2:T56),$U2:$U986,0)),\"\")","v":""}]
[26,"WFW21LC2","240","M  ","W Lucie Chelsea","Tan","8-40221-90297-0","C/O       ",5,null,{"v":77.5,"d":"$77.50"},{"v":155,"d":"$155.00"},{"v":154.95,"d":"$154.95"},0,"Wfw21lc2-240-M  W Lucie Chelsea"," ",{"$f":"--ISNUMBER(IFERROR(SEARCH(Orders!$E$18,O57,1),\"\"))","v":1},{"$f":"IF(Q57=1,COUNTIF($Q$2:Q57,1),\"\")","v":56},{"$f":"IFERROR(INDEX($O2:$O986,MATCH(ROWS($Q$2:Q57),$R2:$R986,0)),\"\")","v":"Wfw21lc2-240-M  W Lucie Chelsea"},{"$f":"IF(Orders!$B$20=$A$57, 1, \"\")","v":""},{"$f":"IF(T57=1,COUNTIF($T$2:T57,1),\"\")","v":""},{"$f":"IFERROR(INDEX($O2:$O986,MATCH(ROWS($T$2:T57),$U2:$U986,0)),\"\")","v":""}]
[18,"WSS21TW1","988","M  ","W Thatcher Low Wp","Tan/Black","8-40221-90035-8","C/O       ",6,null,{"v":75,"d":"$75.00"},{"v":150,"d":"$150.00"},{"v":149.95,"d":"$149.95"},0,"Wss21tw1-988-M  W Thatcher Low Wp"," ",{"$f":"--ISNUMBER(IFERROR(SEARCH(Orders!$E$18,O58,1),\"\"))","v":1},{"$f":"IF(Q58=1,COUNTIF($Q$2:Q58,1),\"\")","v":57},{"$f":"IFERROR(INDEX($O2:$O986,MATCH(ROWS($Q$2:Q58),$R2:$R986,0)),\"\")","v":"Wss21tw1-988-M  W Thatcher Low Wp"},{"$f":"IF(Orders!$B$20=$A$58, 1, \"\")","v":""},{"$f":"IF(T58=1,COUNTIF($T$2:T58,1),\"\")","v":""},{"$f":"IFERROR(INDEX($O2:$O986,MATCH(ROWS($T$2:T58),$U2:$U986,0)),\"\")","v":""}]
[18,"W80004  ","235","M  ","W Thatcher Low Wp","Toffee","0-21033-49641-7","          ",6,null,{"v":75,"d":"$75.00"},{"v":150,"d":"$150.00"},{"v":149.95,"d":"$149.95"},0,"W80004-235-M  W Thatcher Low Wp"," ",{"$f":"--ISNUMBER(IFERROR(SEARCH(Orders!$E$18,O59,1),\"\"))","v":1},{"$f":"IF(Q59=1,COUNTIF($Q$2:Q59,1),\"\")","v":58},{"$f":"IFERROR(INDEX($O2:$O986,MATCH(ROWS($Q$2:Q59),$R2:$R986,0)),\"\")","v":"W80004-235-M  W Thatcher Low Wp"},{"$f":"IF(Orders!$B$20=$A$59, 1, \"\")","v":""},{"$f":"IF(T59=1,COUNTIF($T$2:T59,1),\"\")","v":""},{"$f":"IFERROR(INDEX($O2:$O986,MATCH(ROWS($T$2:T59),$U2:$U986,0)),\"\")","v":""}]
[18,"W80004  ","260","M  ","W Thatcher Low Wp","Taupe","0-21033-49652-3","          ",6,null,{"v":75,"d":"$75.00"},{"v":150,"d":"$150.00"},{"v":149.95,"d":"$149.95"},0,"W80004-260-M  W Thatcher Low Wp"," ",{"$f":"--ISNUMBER(IFERROR(SEARCH(Orders!$E$18,O60,1),\"\"))","v":1},{"$f":"IF(Q60=1,COUNTIF($Q$2:Q60,1),\"\")","v":59},{"$f":"IFERROR(INDEX($O2:$O986,MATCH(ROWS($Q$2:Q60),$R2:$R986,0)),\"\")","v":"W80004-260-M  W Thatcher Low Wp"},{"$f":"IF(Orders!$B$20=$A$60, 1, \"\")","v":""},{"$f":"IF(T60=1,COUNTIF($T$2:T60,1),\"\")","v":""},{"$f":"IFERROR(INDEX($O2:$O986,MATCH(ROWS($T$2:T60),$U2:$U986,0)),\"\")","v":""}]
[0,"W80005  ","062","M  ","W Cascade Trail Low","Gray Multi","0-21033-48792-7","          ",6,null,{"v":65,"d":"$65.00"},{"v":130,"d":"$130.00"},{"v":129.95,"d":"$129.95"},0,"W80005-062-M  W Cascade Trail Low"," ",{"$f":"--ISNUMBER(IFERROR(SEARCH(Orders!$E$18,O61,1),\"\"))","v":1},{"$f":"IF(Q61=1,COUNTIF($Q$2:Q61,1),\"\")","v":60},{"$f":"IFERROR(INDEX($O2:$O986,MATCH(ROWS($Q$2:Q61),$R2:$R986,0)),\"\")","v":"W80005-062-M  W Cascade Trail Low"},{"$f":"IF(Orders!$B$20=$A$61, 1, \"\")","v":1},{"$f":"IF(T61=1,COUNTIF($T$2:T61,1),\"\")","v":3},{"$f":"IFERROR(INDEX($O2:$O986,MATCH(ROWS($T$2:T61),$U2:$U986,0)),\"\")","v":""}]
[0,"W80005  ","450","M  ","W Cascade Trail Low","Sky Blue","0-21033-48825-2","          ",6,null,{"v":65,"d":"$65.00"},{"v":130,"d":"$130.00"},{"v":129.95,"d":"$129.95"},0,"W80005-450-M  W Cascade Trail Low"," ",{"$f":"--ISNUMBER(IFERROR(SEARCH(Orders!$E$18,O62,1),\"\"))","v":1},{"$f":"IF(Q62=1,COUNTIF($Q$2:Q62,1),\"\")","v":61},{"$f":"IFERROR(INDEX($O2:$O986,MATCH(ROWS($Q$2:Q62),$R2:$R986,0)),\"\")","v":"W80005-450-M  W Cascade Trail Low"},{"$f":"IF(Orders!$B$20=$A$62, 1, \"\")","v":1},{"$f":"IF(T62=1,COUNTIF($T$2:T62,1),\"\")","v":4},{"$f":"IFERROR(INDEX($O2:$O986,MATCH(ROWS($T$2:T62),$U2:$U986,0)),\"\")","v":""}]
[19,"W80006  ","240","M  ","W Thatcher Low","Tan","0-21033-48836-8","          ",6,null,{"v":60,"d":"$60.00"},{"v":120,"d":"$120.00"},{"v":119.95,"d":"$119.95"},0,"W80006-240-M  W Thatcher Low"," ",{"$f":"--ISNUMBER(IFERROR(SEARCH(Orders!$E$18,O63,1),\"\"))","v":1},{"$f":"IF(Q63=1,COUNTIF($Q$2:Q63,1),\"\")","v":62},{"$f":"IFERROR(INDEX($O2:$O986,MATCH(ROWS($Q$2:Q63),$R2:$R986,0)),\"\")","v":"W80006-240-M  W Thatcher Low"},{"$f":"IF(Orders!$B$20=$A$63, 1, \"\")","v":""},{"$f":"IF(T63=1,COUNTIF($T$2:T63,1),\"\")","v":""},{"$f":"IFERROR(INDEX($O2:$O986,MATCH(ROWS($T$2:T63),$U2:$U986,0)),\"\")","v":""}]
[19,"W80006  ","261","M  ","W Thatcher Low","Taupe Mult","0-21033-49674-5","          ",6,null,{"v":60,"d":"$60.00"},{"v":120,"d":"$120.00"},{"v":119.95,"d":"$119.95"},0,"W80006-261-M  W Thatcher Low"," ",{"$f":"--ISNUMBER(IFERROR(SEARCH(Orders!$E$18,O64,1),\"\"))","v":1},{"$f":"IF(Q64=1,COUNTIF($Q$2:Q64,1),\"\")","v":63},{"$f":"IFERROR(INDEX($O2:$O986,MATCH(ROWS($Q$2:Q64),$R2:$R986,0)),\"\")","v":"W80006-261-M  W Thatcher Low"},{"$f":"IF(Orders!$B$20=$A$64, 1, \"\")","v":""},{"$f":"IF(T64=1,COUNTIF($T$2:T64,1),\"\")","v":""},{"$f":"IFERROR(INDEX($O2:$O986,MATCH(ROWS($T$2:T64),$U2:$U986,0)),\"\")","v":""}]
[24,"W80017  ","001","M  ","W Sofia Lace","Black","0-21033-49360-7","          ",6,null,{"v":87.5,"d":"$87.50"},{"v":175,"d":"$175.00"},{"v":174.95,"d":"$174.95"},0,"W80017-001-M  W Sofia Lace"," ",{"$f":"--ISNUMBER(IFERROR(SEARCH(Orders!$E$18,O65,1),\"\"))","v":1},{"$f":"IF(Q65=1,COUNTIF($Q$2:Q65,1),\"\")","v":64},{"$f":"IFERROR(INDEX($O2:$O986,MATCH(ROWS($Q$2:Q65),$R2:$R986,0)),\"\")","v":"W80017-001-M  W Sofia Lace"},{"$f":"IF(Orders!$B$20=$A$65, 1, \"\")","v":""},{"$f":"IF(T65=1,COUNTIF($T$2:T65,1),\"\")","v":""},{"$f":"IFERROR(INDEX($O2:$O986,MATCH(ROWS($T$2:T65),$U2:$U986,0)),\"\")","v":""}]
[24,"W80017  ","235","M  ","W Sofia Lace","Toffee","0-21033-49371-3","          ",6,null,{"v":87.5,"d":"$87.50"},{"v":175,"d":"$175.00"},{"v":174.95,"d":"$174.95"},{"$f":"J66*K66","v":0},"W80017-235-M  W Sofia Lace"," ",{"$f":"--ISNUMBER(IFERROR(SEARCH(Orders!$E$18,O66,1),\"\"))","v":1},{"$f":"IF(Q66=1,COUNTIF($Q$2:Q66,1),\"\")","v":65},{"$f":"IFERROR(INDEX($O2:$O986,MATCH(ROWS($Q$2:Q66),$R2:$R986,0)),\"\")","v":"W80017-235-M  W Sofia Lace"},{"$f":"IF(Orders!$B$20=$A$66, 1, \"\")","v":""},{"$f":"IF(T66=1,COUNTIF($T$2:T66,1),\"\")","v":""},{"$f":"IFERROR(INDEX($O2:$O986,MATCH(ROWS($T$2:T66),$U2:$U986,0)),\"\")","v":""}]
[24,"W80017  ","305","M  ","W Sofia Lace","Loden","0-21033-49382-9","          ",6,null,{"v":87.5,"d":"$87.50"},{"v":175,"d":"$175.00"},{"v":174.95,"d":"$174.95"},0,"W80017-305-M  W Sofia Lace"," ",{"$f":"--ISNUMBER(IFERROR(SEARCH(Orders!$E$18,O67,1),\"\"))","v":1},{"$f":"IF(Q67=1,COUNTIF($Q$2:Q67,1),\"\")","v":66},{"$f":"IFERROR(INDEX($O2:$O986,MATCH(ROWS($Q$2:Q67),$R2:$R986,0)),\"\")","v":"W80017-305-M  W Sofia Lace"},{"$f":"IF(Orders!$B$20=$A$67, 1, \"\")","v":""},{"$f":"IF(T67=1,COUNTIF($T$2:T67,1),\"\")","v":""},{"$f":"IFERROR(INDEX($O2:$O986,MATCH(ROWS($T$2:T67),$U2:$U986,0)),\"\")","v":""}]
[20,"W80019  ","001","M  ","W Cascade Trail Mid","Black","0-21033-49210-5","          ",6,null,{"v":75,"d":"$75.00"},{"v":150,"d":"$150.00"},{"v":149.95,"d":"$149.95"},0,"W80019-001-M  W Cascade Trail Mid"," ",{"$f":"--ISNUMBER(IFERROR(SEARCH(Orders!$E$18,O68,1),\"\"))","v":1},{"$f":"IF(Q68=1,COUNTIF($Q$2:Q68,1),\"\")","v":67},{"$f":"IFERROR(INDEX($O2:$O986,MATCH(ROWS($Q$2:Q68),$R2:$R986,0)),\"\")","v":"W80019-001-M  W Cascade Trail Mid"},{"$f":"IF(Orders!$B$20=$A$68, 1, \"\")","v":""},{"$f":"IF(T68=1,COUNTIF($T$2:T68,1),\"\")","v":""},{"$f":"IFERROR(INDEX($O2:$O986,MATCH(ROWS($T$2:T68),$U2:$U986,0)),\"\")","v":""}]
[20,"W80019  ","305","M  ","W Cascade Trail Mid","Loden","0-21033-49232-7","          ",6,null,{"v":75,"d":"$75.00"},{"v":150,"d":"$150.00"},{"v":149.95,"d":"$149.95"},0,"W80019-305-M  W Cascade Trail Mid"," ",{"$f":"--ISNUMBER(IFERROR(SEARCH(Orders!$E$18,O69,1),\"\"))","v":1},{"$f":"IF(Q69=1,COUNTIF($Q$2:Q69,1),\"\")","v":68},{"$f":"IFERROR(INDEX($O2:$O986,MATCH(ROWS($Q$2:Q69),$R2:$R986,0)),\"\")","v":"W80019-305-M  W Cascade Trail Mid"},{"$f":"IF(Orders!$B$20=$A$69, 1, \"\")","v":""},{"$f":"IF(T69=1,COUNTIF($T$2:T69,1),\"\")","v":""},{"$f":"IFERROR(INDEX($O2:$O986,MATCH(ROWS($T$2:T69),$U2:$U986,0)),\"\")","v":""}]
[20,"W80019  ","450","M  ","W Cascade Trail Mid","Sky Blue","0-21033-49243-3","          ",6,null,{"v":75,"d":"$75.00"},{"v":150,"d":"$150.00"},{"v":149.95,"d":"$149.95"},0,"W80019-450-M  W Cascade Trail Mid"," ",{"$f":"--ISNUMBER(IFERROR(SEARCH(Orders!$E$18,O70,1),\"\"))","v":1},{"$f":"IF(Q70=1,COUNTIF($Q$2:Q70,1),\"\")","v":69},{"$f":"IFERROR(INDEX($O2:$O986,MATCH(ROWS($Q$2:Q70),$R2:$R986,0)),\"\")","v":"W80019-450-M  W Cascade Trail Mid"},{"$f":"IF(Orders!$B$20=$A$70, 1, \"\")","v":""},{"$f":"IF(T70=1,COUNTIF($T$2:T70,1),\"\")","v":""},{"$f":"IFERROR(INDEX($O2:$O986,MATCH(ROWS($T$2:T70),$U2:$U986,0)),\"\")","v":""}]
[27,"W80020  ","451","M  ","W Lucie Mid","Mist Blue","0-21033-48847-4","          ",5,null,{"v":75,"d":"$75.00"},{"v":150,"d":"$150.00"},{"v":149.95,"d":"$149.95"},0,"W80020-451-M  W Lucie Mid"," ",{"$f":"--ISNUMBER(IFERROR(SEARCH(Orders!$E$18,O71,1),\"\"))","v":1},{"$f":"IF(Q71=1,COUNTIF($Q$2:Q71,1),\"\")","v":70},{"$f":"IFERROR(INDEX($O2:$O986,MATCH(ROWS($Q$2:Q71),$R2:$R986,0)),\"\")","v":"W80020-451-M  W Lucie Mid"},{"$f":"IF(Orders!$B$20=$A$71, 1, \"\")","v":""},{"$f":"IF(T71=1,COUNTIF($T$2:T71,1),\"\")","v":""},{"$f":"IFERROR(INDEX($O2:$O986,MATCH(ROWS($T$2:T71),$U2:$U986,0)),\"\")","v":""}]
[26,"W80021  ","305","M  ","W Lucie Chelsea","Loden","0-21033-48873-3","          ",5,null,{"v":77.5,"d":"$77.50"},{"v":155,"d":"$155.00"},{"v":154.95,"d":"$154.95"},0,"W80021-305-M  W Lucie Chelsea"," ",{"$f":"--ISNUMBER(IFERROR(SEARCH(Orders!$E$18,O72,1),\"\"))","v":1},{"$f":"IF(Q72=1,COUNTIF($Q$2:Q72,1),\"\")","v":71},{"$f":"IFERROR(INDEX($O2:$O986,MATCH(ROWS($Q$2:Q72),$R2:$R986,0)),\"\")","v":"W80021-305-M  W Lucie Chelsea"},{"$f":"IF(Orders!$B$20=$A$72, 1, \"\")","v":""},{"$f":"IF(T72=1,COUNTIF($T$2:T72,1),\"\")","v":""},{"$f":"IFERROR(INDEX($O2:$O986,MATCH(ROWS($T$2:T72),$U2:$U986,0)),\"\")","v":""}]
[26,"W80021  ","337","M  ","W Lucie Chelsea","Green Ash","0-21033-48886-3","          ",5,null,{"v":77.5,"d":"$77.50"},{"v":155,"d":"$155.00"},{"v":154.95,"d":"$154.95"},0,"W80021-337-M  W Lucie Chelsea"," ",{"$f":"--ISNUMBER(IFERROR(SEARCH(Orders!$E$18,O73,1),\"\"))","v":1},{"$f":"IF(Q73=1,COUNTIF($Q$2:Q73,1),\"\")","v":72},{"$f":"IFERROR(INDEX($O2:$O986,MATCH(ROWS($Q$2:Q73),$R2:$R986,0)),\"\")","v":"W80021-337-M  W Lucie Chelsea"},{"$f":"IF(Orders!$B$20=$A$73, 1, \"\")","v":""},{"$f":"IF(T73=1,COUNTIF($T$2:T73,1),\"\")","v":""},{"$f":"IFERROR(INDEX($O2:$O986,MATCH(ROWS($T$2:T73),$U2:$U986,0)),\"\")","v":""}]
[17,"W80024  ","337","M  ","W Thatcher Mid","Green Ash","0-21033-49461-1","          ",6,null,{"v":85,"d":"$85.00"},{"v":170,"d":"$170.00"},{"v":169.95,"d":"$169.95"},0,"W80024-337-M  W Thatcher Mid"," ",{"$f":"--ISNUMBER(IFERROR(SEARCH(Orders!$E$18,O74,1),\"\"))","v":1},{"$f":"IF(Q74=1,COUNTIF($Q$2:Q74,1),\"\")","v":73},{"$f":"IFERROR(INDEX($O2:$O986,MATCH(ROWS($Q$2:Q74),$R2:$R986,0)),\"\")","v":"W80024-337-M  W Thatcher Mid"},{"$f":"IF(Orders!$B$20=$A$74, 1, \"\")","v":""},{"$f":"IF(T74=1,COUNTIF($T$2:T74,1),\"\")","v":""},{"$f":"IFERROR(INDEX($O2:$O986,MATCH(ROWS($T$2:T74),$U2:$U986,0)),\"\")","v":""}]
[23,"W80025  ","030","M  ","W Patch Mid","Pewter","0-21033-49696-7","          ",5,null,{"v":85,"d":"$85.00"},{"v":170,"d":"$170.00"},{"v":169.95,"d":"$169.95"},0,"W80025-030-M  W Patch Mid"," ",{"$f":"--ISNUMBER(IFERROR(SEARCH(Orders!$E$18,O75,1),\"\"))","v":1},{"$f":"IF(Q75=1,COUNTIF($Q$2:Q75,1),\"\")","v":74},{"$f":"IFERROR(INDEX($O2:$O986,MATCH(ROWS($Q$2:Q75),$R2:$R986,0)),\"\")","v":"W80025-030-M  W Patch Mid"},{"$f":"IF(Orders!$B$20=$A$75, 1, \"\")","v":""},{"$f":"IF(T75=1,COUNTIF($T$2:T75,1),\"\")","v":""},{"$f":"IFERROR(INDEX($O2:$O986,MATCH(ROWS($T$2:T75),$U2:$U986,0)),\"\")","v":""}]
[21,"W80027  ","009","M  ","W Cascade Peak Low W","Blk Multi","0-21033-49709-4","          ",6,null,{"v":72.5,"d":"$72.50"},{"v":145,"d":"$145.00"},{"v":144.95,"d":"$144.95"},0,"W80027-009-M  W Cascade Peak Low W"," ",{"$f":"--ISNUMBER(IFERROR(SEARCH(Orders!$E$18,O76,1),\"\"))","v":1},{"$f":"IF(Q76=1,COUNTIF($Q$2:Q76,1),\"\")","v":75},{"$f":"IFERROR(INDEX($O2:$O986,MATCH(ROWS($Q$2:Q76),$R2:$R986,0)),\"\")","v":"W80027-009-M  W Cascade Peak Low W"},{"$f":"IF(Orders!$B$20=$A$76, 1, \"\")","v":""},{"$f":"IF(T76=1,COUNTIF($T$2:T76,1),\"\")","v":""},{"$f":"IFERROR(INDEX($O2:$O986,MATCH(ROWS($T$2:T76),$U2:$U986,0)),\"\")","v":""}]
[21,"W80027  ","275","M  ","W Cascade Peak Low W","Stone","0-21033-49720-9","          ",6,null,{"v":72.5,"d":"$72.50"},{"v":145,"d":"$145.00"},{"v":144.95,"d":"$144.95"},0,"W80027-275-M  W Cascade Peak Low W"," ",{"$f":"--ISNUMBER(IFERROR(SEARCH(Orders!$E$18,O77,1),\"\"))","v":1},{"$f":"IF(Q77=1,COUNTIF($Q$2:Q77,1),\"\")","v":76},{"$f":"IFERROR(INDEX($O2:$O986,MATCH(ROWS($Q$2:Q77),$R2:$R986,0)),\"\")","v":"W80027-275-M  W Cascade Peak Low W"},{"$f":"IF(Orders!$B$20=$A$77, 1, \"\")","v":""},{"$f":"IF(T77=1,COUNTIF($T$2:T77,1),\"\")","v":""},{"$f":"IFERROR(INDEX($O2:$O986,MATCH(ROWS($T$2:T77),$U2:$U986,0)),\"\")","v":""}]
[21,"W80027  ","410","M  ","W Cascade Peak Low W","Navy","0-21033-49731-5","          ",6,null,{"v":72.5,"d":"$72.50"},{"v":145,"d":"$145.00"},{"v":144.95,"d":"$144.95"},0,"W80027-410-M  W Cascade Peak Low W"," ",{"$f":"--ISNUMBER(IFERROR(SEARCH(Orders!$E$18,O78,1),\"\"))","v":1},{"$f":"IF(Q78=1,COUNTIF($Q$2:Q78,1),\"\")","v":77},{"$f":"IFERROR(INDEX($O2:$O986,MATCH(ROWS($Q$2:Q78),$R2:$R986,0)),\"\")","v":"W80027-410-M  W Cascade Peak Low W"},{"$f":"IF(Orders!$B$20=$A$78, 1, \"\")","v":""},{"$f":"IF(T78=1,COUNTIF($T$2:T78,1),\"\")","v":""},{"$f":"IFERROR(INDEX($O2:$O986,MATCH(ROWS($T$2:T78),$U2:$U986,0)),\"\")","v":""}]
[25,"W80029  ","013","M  ","W Rosie Mid","Charcoal","0-21033-49775-9","          ",6,null,{"v":80,"d":"$80.00"},{"v":160,"d":"$160.00"},{"v":159.95,"d":"$159.95"},0,"W80029-013-M  W Rosie Mid"," ",{"$f":"--ISNUMBER(IFERROR(SEARCH(Orders!$E$18,O79,1),\"\"))","v":1},{"$f":"IF(Q79=1,COUNTIF($Q$2:Q79,1),\"\")","v":78},{"$f":"IFERROR(INDEX($O2:$O986,MATCH(ROWS($Q$2:Q79),$R2:$R986,0)),\"\")","v":"W80029-013-M  W Rosie Mid"},{"$f":"IF(Orders!$B$20=$A$79, 1, \"\")","v":""},{"$f":"IF(T79=1,COUNTIF($T$2:T79,1),\"\")","v":""},{"$f":"IFERROR(INDEX($O2:$O986,MATCH(ROWS($T$2:T79),$U2:$U986,0)),\"\")","v":""}]
[25,"W80029  ","235","M  ","W Rosie Mid","Toffee","0-21033-49786-5","          ",6,null,{"v":80,"d":"$80.00"},{"v":160,"d":"$160.00"},{"v":159.95,"d":"$159.95"},0,"W80029-235-M  W Rosie Mid"," ",{"$f":"--ISNUMBER(IFERROR(SEARCH(Orders!$E$18,O80,1),\"\"))","v":1},{"$f":"IF(Q80=1,COUNTIF($Q$2:Q80,1),\"\")","v":79},{"$f":"IFERROR(INDEX($O2:$O986,MATCH(ROWS($Q$2:Q80),$R2:$R986,0)),\"\")","v":"W80029-235-M  W Rosie Mid"},{"$f":"IF(Orders!$B$20=$A$80, 1, \"\")","v":""},{"$f":"IF(T80=1,COUNTIF($T$2:T80,1),\"\")","v":""},{"$f":"IFERROR(INDEX($O2:$O986,MATCH(ROWS($T$2:T80),$U2:$U986,0)),\"\")","v":""}]
[25,"W80029  ","275","M  ","W Rosie Mid","Stone","0-21033-49797-1","          ",6,null,{"v":80,"d":"$80.00"},{"v":160,"d":"$160.00"},{"v":159.95,"d":"$159.95"},0,"W80029-275-M  W Rosie Mid"," ",{"$f":"--ISNUMBER(IFERROR(SEARCH(Orders!$E$18,O81,1),\"\"))","v":1},{"$f":"IF(Q81=1,COUNTIF($Q$2:Q81,1),\"\")","v":80},{"$f":"IFERROR(INDEX($O2:$O986,MATCH(ROWS($Q$2:Q81),$R2:$R986,0)),\"\")","v":"W80029-275-M  W Rosie Mid"},{"$f":"IF(Orders!$B$20=$A$81, 1, \"\")","v":""},{"$f":"IF(T81=1,COUNTIF($T$2:T81,1),\"\")","v":""},{"$f":"IFERROR(INDEX($O2:$O986,MATCH(ROWS($T$2:T81),$U2:$U986,0)),\"\")","v":""}]
[16,"W80036  ","014","M  ","W Wild Sky Mid","Blk Olive","0-21033-50005-3","          ",5,null,{"v":77.5,"d":"$77.50"},{"v":155,"d":"$155.00"},{"v":154.95,"d":"$154.95"},0,"W80036-014-M  W Wild Sky Mid"," ",{"$f":"--ISNUMBER(IFERROR(SEARCH(Orders!$E$18,O82,1),\"\"))","v":1},{"$f":"IF(Q82=1,COUNTIF($Q$2:Q82,1),\"\")","v":81},{"$f":"IFERROR(INDEX($O2:$O986,MATCH(ROWS($Q$2:Q82),$R2:$R986,0)),\"\")","v":"W80036-014-M  W Wild Sky Mid"},{"$f":"IF(Orders!$B$20=$A$82, 1, \"\")","v":""},{"$f":"IF(T82=1,COUNTIF($T$2:T82,1),\"\")","v":""},{"$f":"IFERROR(INDEX($O2:$O986,MATCH(ROWS($T$2:T82),$U2:$U986,0)),\"\")","v":""}]
[16,"W80036  ","240","M  ","W Wild Sky Mid","Tan","0-21033-50020-6","          ",5,null,{"v":77.5,"d":"$77.50"},{"v":155,"d":"$155.00"},{"v":154.95,"d":"$154.95"},0,"W80036-240-M  W Wild Sky Mid"," ",{"$f":"--ISNUMBER(IFERROR(SEARCH(Orders!$E$18,O83,1),\"\"))","v":1},{"$f":"IF(Q83=1,COUNTIF($Q$2:Q83,1),\"\")","v":82},{"$f":"IFERROR(INDEX($O2:$O986,MATCH(ROWS($Q$2:Q83),$R2:$R986,0)),\"\")","v":"W80036-240-M  W Wild Sky Mid"},{"$f":"IF(Orders!$B$20=$A$83, 1, \"\")","v":""},{"$f":"IF(T83=1,COUNTIF($T$2:T83,1),\"\")","v":""},{"$f":"IFERROR(INDEX($O2:$O986,MATCH(ROWS($T$2:T83),$U2:$U986,0)),\"\")","v":""}]
[16,"W80036  ","305","M  ","W Wild Sky Mid","Loden","0-21033-50033-6","          ",5,null,{"v":77.5,"d":"$77.50"},{"v":155,"d":"$155.00"},{"v":154.95,"d":"$154.95"},0,"W80036-305-M  W Wild Sky Mid"," ",{"$f":"--ISNUMBER(IFERROR(SEARCH(Orders!$E$18,O84,1),\"\"))","v":1},{"$f":"IF(Q84=1,COUNTIF($Q$2:Q84,1),\"\")","v":83},{"$f":"IFERROR(INDEX($O2:$O986,MATCH(ROWS($Q$2:Q84),$R2:$R986,0)),\"\")","v":"W80036-305-M  W Wild Sky Mid"},{"$f":"IF(Orders!$B$20=$A$84, 1, \"\")","v":""},{"$f":"IF(T84=1,COUNTIF($T$2:T84,1),\"\")","v":""},{"$f":"IFERROR(INDEX($O2:$O986,MATCH(ROWS($T$2:T84),$U2:$U986,0)),\"\")","v":""}]

{"sheet":"Customer","index":5,"n_rows":420,"n_cols":4,"rows_kept":420}
["Customer","Sold_To","Ship_To","Name"]
["00035","00035","","Brown Shoe Fit"]
["00035-0015","00035","0015","Brown's Shoe Fit No 15"]
["00268","00268","","Red's Shoe Barn Inc"]
["00268-0001","00268","0001","Red's Shoe Barn Inc"]
["00362","00362","","Marshalls/Marmaxx Group"]
["00362-0008","00362","0008","Tjx Companies Inc"]
["02037","02037","","Abelman Co.(The)"]
["02037-0001","02037","0001","Abelman Co.(The)"]
["03005","03005","","Erhco Inc"]
["03005-0013","03005","0013","Burchs Fine Footwear"]
["04156","04156","","Lamey-Wellehan Inc"]
["04156-0001","04156","0001","Lamey Wellehan Shoes"]
["05135","05135","","Lb Pennyworth's"]
["05135-0005","05135","0005","Hyman's Penneyworths"]
["05378","05378","","Lahout's Country Clothing"]
["05378-0001","05378","0001","Lahouts"]
["05378-0003","05378","0003","Lahout's Country Clothing"]
["06016","06016","","Sensible Shoes Inc"]
["09293","09293","","Sam's Department Store"]
["09562","09562","","South Central Athlete"]
["10098","10098","","Simon The Tanner"]
["10098-0003","10098","0003","Simon The Tanner"]
["10098-0005","10098","0005","Simon The Tanner"]
["11094","11094","","Joe King's Shoe Shop"]
["11510","11510","","Kittery Trading Post"]
["11510-0001","11510","0001","Ktp Distribution Center"]
["16024","16024","","Mifflinburg Variety Store"]
["16024-0001","16024","0001","Mifflinburg Variety Store"]
["16024-0002","16024","0002","Mifflinburg Variety Store"]
["23210","23210","","Barrington Outfitters"]
["23273","23273","","Footprints"]
["23503","23503","","Tip Top"]
["23574","23574","","Stride Rite Hk Ventures"]
["30339","30339","","Novus, Inc"]
["30339-0220","30339","0220","La Favorita #220"]
["30339-2010","30339","2010","Novus, Inc."]
["30339-2011","30339","2011","Novus, Inc"]
["30918","30918","","Sierra Trading Post"]
["30918-0001","30918","0001","Sierra Trading Post"]
["30918-0002","30918","0002","Sierra Trading Post"]
["31244","31244","","Treadz"]
["32272","32272","","Fontanas Shoes"]
["72001","72001","","2nd Ave Sports"]
["72002","72002","","3 Rivers Outdoor Co"]
["72003","72003","","88 Gear"]
["72003-0001","72003","0001","88 Gear"]
["72004","72004","","Active Republic"]
["72004-0001","72004","0001","Active Republic"]
["72005","72005","","Appalachian Outdoors"]
["72005-0001","72005","0001","Appalachian Outdoors"]
["72006","72006","","Axalt"]
["72006-0001","72006","0001","Axalt"]
["72006-0002","72006","0002","Axalt"]
["72007","72007","","Beale Afb Outdoor Adv Ctr"]
["72008","72008","","Bespoke Post"]
["72008-0001","72008","0001","Bespoke Post"]
["72009","72009","","Birkenstock Midtown"]
["72010","72010","","Blue Ridge Mtn Outfitters"]
["72011","72011","","Brick & Mortar Iron Mtn"]
["72011-0001","72011","0001","Brick & Mortar Iron Mtn"]
["72012","72012","","Bridge Street Exchange"]
["72013","72013","","Bristlecone Mtn Sports"]
["72014","72014","","Brown Sport Shoe"]
["72014-0001","72014","0001","Brown Sport Shoe"]
["72015","72015","","Carbon2cobalt"]
["72015-0001","72015","0001","Carbon2cobalt"]
["72016","72016","","Centre Boot Company Llc"]
["72017","72017","","Chalet Sports"]
["72017-0001","72017","0001","Chalet Sports"]
["72018","72018","","Confluence Kayaks"]
["72018-0001","72018","0001","Confluence Kayaks"]
["72019","72019","","Danax Sports"]
["72019-0001","72019","0001","Double Diamond Shoes-Pc"]
["72019-0002","72019","0002","Danax Sports"]
["72020","72020","","Desert Wild Corp"]
["72021","72021","","Diamond Brand Outdoors"]
["72022","72022","","Dna Athletics Plainfield"]
["72023","72023","","Down Wind Sports"]
["72024","72024","","Edmond Summit Company"]
["72025","72025","","Empire Shoes"]
["72026","72026","","Evo"]
["72026-0001","72026","0001","Evo"]
["72026-0002","72026","0002","Evo"]
["72026-0003","72026","0003","Evo"]
["72027","72027","","Faherty Brand"]
["72027-0001","72027","0001","Faherty-Web"]
["72027-0002","72027","0002","Faherty-Jackson Hole"]
["72027-0003","72027","0003","Faherty-Big Sky"]
["72027-0004","72027","0004","Faherty-Santana Row"]
["72027-0005","72027","0005","Faherty-Spring Lake"]
["72027-0006","72027","0006","Faherty-Sag Harbor"]
["72027-0007","72027","0007","Faherty-Prince"]
["72027-0008","72027","0008","Faherty-Eweb"]
["72027-0009","72027","0009","Faherty-Venice Beach"]
["72027-0010","72027","0010","Faherty-Nantucket"]
["72027-0011","72027","0011","Faherty-Newbury St"]
["72027-0012","72027","0012","Faherty-Marthas Vineyard"]
["72027-0013","72027","0013","Faherty-Short Hills"]
["72027-0014","72027","0014","Faherty-Univ Village"]
["72027-0015","72027","0015","Faherty-Greenwich"]
["72028","72028","","Gallatin Alpine Sports"]
["72028-0001","72028","0001","Gallatin Alpine Sports"]
["72029","72029","","Gear Port"]
["72030","72030","","Grand Targhee Resort"]
["72030-0001","72030","0001","Habitat"]
["72031","72031","","Granite Chief"]
["72033","72033","","Hamilton Sports"]
["72035","72035","","High Country Outfitters"]
["72036","72036","","Homer Jeans"]
["72036-0001","72036","0001","Pacific Alaska Freightway"]
["72039","72039","","Kinnucans"]
["72039-0001","72039","0001","Kinnucans"]
["72039-0002","72039","0002","Kinnucans"]
["72040","72040","","Local Experience"]
["72040-0001","72040","0001","Local Experience"]
["72041","72041","","Loveland Sport Shop"]
["72041-0001","72041","0001","Loveland Sport Shop"]
["72042","72042","","Montana Supply"]
["72042-0001","72042","0001","Montana Supply"]
["72043","72043","","Mountain Air Sports"]
["72044","72044","","Mountain Goat"]
["72044-0001","72044","0001","Mountain Goat"]
["72044-0002","72044","0002","Mountain Goat"]
["72044-0003","72044","0003","Mountain Goat"]
["72044-0004","72044","0004","Mountain Goat"]
["72045","72045","","Mountain Outfitters"]
["72045-0001","72045","0001","Mountain Outfitters"]
["72046","72046","","Mountain Standard"]
["72047","72047","","Mtn Grl Wyoming"]
["72047-0001","72047","0001","Mtn Grl Wyoming"]
["72048","72048","","Neptune Mountaineering"]
["72048-0001","72048","0001","Neptune Mountaineering"]
["72049","72049","","Never Summer"]
["72049-0001","72049","0001","Never Summer"]
["72050","72050","","Omni Mount Washington"]
["72051","72051","","Back Country"]
["72051-0001","72051","0001","Back Country"]
["72052","72052","","Outsidein Ma"]
["72053","72053","","Outsidein Or"]
["72055","72055","","Pagosa Moountain Sports"]
["72055-0001","72055","0001","Pagosa Moountain Sports"]
["72056","72056","","Pedestrian Shops"]
["72056-0001","72056","0001","Pedestrian Shops"]
["72056-0002","72056","0002","Pedestrian Shops"]
["72056-0003","72056","0003","Pedestrian Shops"]
["72056-0004","72056","0004","Pedestrian Shops"]
["72057","72057","","Riverjack"]
["72058","72058","","Rivers Clothing Co"]
["72058-0001","72058","0001","Rivers Clothing Co"]
["72059","72059","","Salida Mountain Sports"]
["72060","72060","","Seed People's Market"]
["72061","72061","","Sierra Lifestyle"]
["72061-0001","72061","0001","Sierra Lifestyle"]
["72061-0002","72061","0002","Sierra Lifestyle"]
["72062","72062","","Solstice Outdoors"]
["72062-0001","72062","0001","Solstice Outdoors"]
["72063","72063","","Sportique"]
["72063-0001","72063","0001","Sportique"]
["72064","72064","","Steepworld"]
["72065","72065","","Stillwater Summit Co."]
["72066","72066","","Stio"]
["72066-0001","72066","0001","Stio C/O Nri"]
["72066-0002","72066","0002","Stio Boulder Mtn Studio"]
["72066-0003","72066","0003","Stio 403 Warehouse"]
["72066-0004","72066","0004","Stio"]
["72067","72067","","Sunlight Sports"]
["72068","72068","","Switchback Sports"]
["72069","72069","","Thayer's Marine"]
["72070","72070","","Gear Co-Op (The)"]
["72070-0001","72070","0001","Gear Co-Op (The)"]
["72071","72071","","Green Room (The)"]
["72072","72072","","Hike Shack (The)"]
["72073","72073","","Hub (The)"]
["72074","72074","","Little Traveler (The)"]
["72075","72075","","Mountain Goat (The)"]
["72076","72076","","Twisted Tree Pharm"]
["72076-0001","72076","0001","Twisted Tree Pharm"]
["72077","72077","","Uncle Lems Mtn Outfitters"]
["72078","72078","","United By Blue"]
["72078-0001","72078","0001","Ubb C/O Nri Pennsylvania"]
["72079","72079","","Vibram Usa"]
["72079-0001","72079","0001","Vibram Usa - Barrett Dc"]
["72079-0002","72079","0002","Vibram Usa"]
["72080","72080","","Vital Outdoors"]
["72081","72081","","Walking Mod"]
["72081-0001","72081","0001","Walking Mod"]
["72082","72082","","Wilderness Exchange"]
["72083","72083","","Wilderness Sports"]
["72083-0001","72083","0001","Wilderness Sports"]
["72084","72084","","Wildernest"]
["72085","72085","","Willard's Sport Shop"]
["72085-0001","72085","0001","Willard's Sport Shop"]
["72086","72086","","Yosemite Hospitality Llc"]
["72086-0001","72086","0001","Yosemite Hospitality Llc"]
["72087","72087","","Zahners"]
["72089","72089","","Alyeska Resort"]
["72089-0001","72089","0001","Alyeska Resort"]
["72089-0002","72089","0002","Alyeska Resort"]
["72090","72090","","Lithia Park Shoes"]
["72091-0001","72091","0001","Manchester Sports"]
["72093","72093","","Pinnacle Ski & Sport"]
["72093-0001","72093","0001","Pinnacle Ski & Sport"]
["72094","72094","","Shoe Parlor"]
["72094-0001","72094","0001","Shoe Parlor"]
["72095","72095","","Fifth Season (The)"]
["72097","72097","","Rom Shoes"]
["72098","72098","","Fishers Peak Outfitters"]
["72099","72099","","Lock 31 Outfitters"]
["72104","72104","","Kenver"]
["72104-0001","72104","0001","Kenver"]
["72105","72105","","Arvada Army Navy Surplus"]
["72106","72106","","Blue Birch Outfitters"]
["72107","72107","","Winterport Boot"]
["72108","72108","","Camp Catskill"]
["72108-0001","72108","0001","Camp Catskill"]
["72109","72109","","Northland"]
["72109-0001","72109","0001","Northland"]
["72164","72164","","Jax Mercantile"]
["72164-0001","72164","0001","Jax Mercantile"]
["72164-0003","72164","0003","Jax Mercantile"]
["72164-0004","72164","0004","Jax Mercantile"]
["72164-0005","72164","0005","Jax Mercantile"]
["72164-0007","72164","0007","Jax Mercantile"]
["72164-1000","72164","1000","Jax Mercantile"]
["72332","72332","","Leitz Sports Center"]
["72536","72536","","North 40"]
["72536-0004","72536","0004","North 40"]
["72536-0007","72536","0007","North 40"]
["72536-100F","72536","100F","North 40"]
["72536-100G","72536","100G","North 40"]
["72536-1004","72536","1004","North 40"]
["72559","72559","","Sports Lure Inc"]
["80034","80034","","Ski Haus Intl"]
["80034-0001","80034","0001","Ski Haus Intl"]
["80036","80036","","Pacific Outfitters"]
["80049","80049","","Fontana Sports Specialtys"]
["80049-0001","80049","0001","Fontana Sports Specialty"]
["80056","80056","","Redwood Trading Post"]
["80086","80086","","Rusted Moon Outfitters"]
["80209","80209","","Plaza Shoe Shop"]
["80274","80274","","Schnee's Boots & Shoes"]
["80274-0002","80274","0002","Schnee's Boots & Shoes"]
["80275","80275","","Toggery (The )"]
["80275-0001","80275","0001","Toggery (The )"]
["80310","80310","","Outdoor Gear Exchange"]
["80310-0001","80310","0001","Outdoor Gear Exchange"]
["80346","80346","","Johnson Hardware & Rental"]
["80357","80357","","Rei"]
["80357-0001","80357","0001","Rei"]
["80357-0002","80357","0002","Rei"]
["80357-0003","80357","0003","Rei"]
["80389","80389","","Joe's Sporting Goods"]
["80413","80413","","Synergy Sportswear"]
["80413-0002","80413","0002","Synergy Sportswear"]
["80423","80423","","Unfurl Clothing"]
["80423-0001","80423","0001","Unfurl Clothing"]
["80424","80424","","Bob Ward And Sons"]
["80424-0001","80424","0001","Bob Ward And Sons"]
["80440","80440","","Main Street Shoes"]
["80440-0001","80440","0001","Main Street Shoes"]
["80449","80449","","Landsharks"]
["80449-0001","80449","0001","Landsharks"]
["80473","80473","","Boyne Usa Inc."]
["80473-0001","80473","0001","Boyne Usa Inc."]
["80473-0004","80473","0004","Big Sky Sports"]
["80480","80480","","Playmakers Inc."]
["80485","80485","","Plamondon Shoes"]
["80505","80505","","Next Adventure"]
["80505-0001","80505","0001","Next Adventure"]
["80517","80517","","Ebels Family Center"]
["80551","80551","","Arcadian Shop"]
["80629","80629","","Gauthiers Shoes & Repair"]
["80654","80654","","Plymouth Ski & Sports Inc"]
["80656","80656","","Jans Ltd."]
["80656-0001","80656","0001","Jans Ltd."]
["80656-0004","80656","0004","Jans Ltd."]
["80666","80666","","Burington Shoes"]
["80669","80669","","Footwise"]
["80669-0001","80669","0001","Footwise"]
["80669-0004","80669","0004","Footwise"]
["80741","80741","","Huckberry"]
["80741-0001","80741","0001","Receiving Department"]
["80741-0002","80741","0002","Receiving Department"]
["80741-0003","80741","0003","Huckberry"]
["80745","80745","","Mammoth Mountaineering"]
["80745-0001","80745","0001","Mammoth Mountaineering"]
["80813","80813","","Sonoma Outfitters"]
["80834","80834","","Elephant's Perch (The)"]
["80834-0001","80834","0001","Elephant's Perch (The)"]
["80852","80852","","Sole Provisions Llc"]
["80852-0020","80852","0020","Pegasus Footwear #20"]
["80852-0021","80852","0021","Pegasus Footwear #21"]
["80852-0022","80852","0022","Pegasus Footwear #22"]
["80852-0026","80852","0026","Rb Shap Store 26"]
["80886","80886","","Skinny Skis"]
["80886-0001","80886","0001","Skinny Skis"]
["80894","80894","","Townsend Bertam & Co."]
["80906","80906","","Ptarmigan Sports"]
["80906-0001","80906","0001","Ptarmigan Sports"]
["80915","80915","","Mountain Hdwe & Sports"]
["80915-0001","80915","0001","Mountain Hdwe & Sports"]
["80915-0002","80915","0002","Mountain Hdwe & Sports"]
["80933","80933","","Cadillac Mountain Sports"]
["80933-0002","80933","0002","Cadillac Mountain Sports"]
["80957","80957","","Mountainman Outdoor Sply"]
["80957-0002","80957","0002","Mountainman Saratoga"]
["81040","81040","","Crown Enterprises"]
["81040-0001","81040","0001","Tri-State"]
["81040-0002","81040","0002","Sportsman & Ski Haus"]
["81108","81108","","Bahnhof Sport"]
["81108-0003","81108","0003","Bahnhof Sport"]
["81166","81166","","Tradehome Shoes"]
["81273","81273","","Backcountry.Com"]
["81273-0001","81273","0001","Backcountry.Com"]
["81273-0002","81273","0002","Backcountry.Com"]
["81273-0003","81273","0003","Backcountry.Com"]
["81273-0006","81273","0006","Backcountry.Com"]
["81275","81275","","Footloose & Fancy"]
["81275-0002","81275","0002","Footloose & Fancy"]
["81307","81307","","Farm-Way"]
["81320","81320","","Estes Park Mountain Shop"]
["81323","81323","","Summit Canyon"]
["81323-0002","81323","0002","Summit Canyon"]
["81323-0003","81323","0003","Summit Canyon"]
["81357","81357","","Durango Sporting Goods"]
["81369","81369","","H.E. Shaw Co. Inc."]
["81369-0001","81369","0001","H.E. Shaw Co. Inc."]
["81376","81376","","Paradox Footwear"]
["81376-0001","81376","0001","Paradox Footwear"]
["81376-0002","81376","0002","Paradox Footwear"]
["81384","81384","","Highland Hiker, Inc."]
["81384-0002","81384","0002","Highland Hiker, Inc."]
["81406","81406","","Base Camp"]
["81406-0001","81406","0001","Base Camp"]
["81416","81416","","Boone Mountain Sports"]
["81430","81430","","Daff"]
["81430-0001","81430","0001","Daff"]
["81458","81458","","Babbitt's Backcountry"]
["81458-0001","81458","0001","Babbitt's Backcountry"]
["81499","81499","","Getz's Inc."]
["81501","81501","","Evans On The Common"]
["81647","81647","","Yostmark Mountain Equip"]
["81647-0001","81647","0001","Yostmark Mountain Equip"]
["81677","81677","","Tahoe Sports"]
["81765","81765","","Walmart Inc"]
["81765-0004","81765","0004","Moosejaw-Warehouse"]
["81765-0007","81765","0007","Moosejaw-Ann Arbor"]
["81765-0016","81765","0016","Moosejaw"]
["81765-0024","81765","0024","Moosejaw-Ky1"]
["81765-0090","81765","0090","Moosejaw C/O Maersk"]
["81765-0091","81765","0091","Moosejaw C/O Maersk"]
["81770","81770","","Backpackers Shop (The)"]
["81862","81862","","Boot Leg"]
["81968","81968","","Left Lane Sports Inc"]
["81968-0001","81968","0001","Left Lane Sports"]
["81968-0002","81968","0002","Left Lane Sports"]
["82041","82041","","Clothes Horse (The)"]
["82107","82107","","Abraxas Shoes & Leather"]
["82107-0001","82107","0001","Abraxas Shoes & Leather"]
["82107-0002","82107","0002","Abraxas Shoes & Leather"]
["82107-0003","82107","0003","Abraxas Shoes & Leather"]
["82116","82116","","Ute Mountaineer"]
["82207","82207","","Chico Sports Ltd"]
["82380","82380","","Toad & Company"]
["82380-0001","82380","0001","Toad & Company"]
["82380-0002","82380","0002","Toad & Company"]
["82380-0003","82380","0003","Toad & Company"]
["82389","82389","","Lone Mountain Sports"]
["82389-0001","82389","0001","Lone Mountain Sports"]
["82410","82410","","Backcountry Essentials"]
["82460","82460","","Onion River Outdoors"]
["82466","82466","","Redding Sports Ltd"]
["82481","82481","","Leader"]
["82481-0001","82481","0001","Leader"]
["82483","82483","","Aloha Ski & Snowboard"]
["82483-0001","82483","0001","Aloha Ski & Snowboard"]
["82483-0002","82483","0002","Bahnhof Sport"]
["82483-0003","82483","0003","Ptarmigan Sports"]
["82529","82529","","Jagged Edge Mountain Gear"]
["82529-0002","82529","0002","Jagged Edge Mountain Gear"]
["82529-0003","82529","0003","Jagged Edge Mountain Gear"]
["82626","82626","","Coastal"]
["82626-0001","82626","0001","Coastal"]
["82629","82629","","Ouray Mountain Sports Inc"]
["82629-0001","82629","0001","Ouray Mountain Sports"]
["82639","82639","","Bootery Boutique Ltd Llc"]
["82657","82657","","Grupo Sport Panama Sa"]
["82661","82661","","Caiquenx Spa"]
["82688","82688","","Outside Interactive Inc"]
["82688-0001","82688","0001","Outside Interactive Inc"]
["87118","87118","","Jackson Hole Mtn Resort"]
["87118-0001","87118","0001","Teton Village Sports"]
["87118-0002","87118","0002","Jackson Hole Sports"]
["87183","87183","","Campsaver"]
["87208","87208","","Wilderness Voyageurs"]
["87208-0001","87208","0001","Wilderness Voyageurs"]
["87262","87262","","Trailfitters"]
["87290","87290","","Christy Sports"]
["87290-0001","87290","0001","Christy Sports"]
["87290-0002","87290","0002","Christy Sports"]
["87290-0003","87290","0003","Christy Sports"]
["87291","87291","","On Deck Clothing (Nwb)"]
["87291-0001","87291","0001","On Deck Clothing"]
["87294","87294","","Sierra Crest Corp"]
["87300","87300","","Snac"]
["87300-0001","87300","0001","Snac"]
["87309","87309","","Powder House Ski Shop"]
["87309-0001","87309","0001","Powder House Ski Shop"]
["87474","87474","","Sports Den"]
["87477","87477","","Salem Summit Co"]
["87477-0001","87477","0001","Salem Summit Co"]
["87512","87512","","Squaw Valley"]
["87512-0001","87512","0001","Squaw Valley"]
["87522","87522","","Great Lakes Outpost"]
["87522-0001","87522","0001","Great Lakes Outpost"]
["87522-0002","87522","0002","Great Lakes Outpost"]
["87522-0003","87522","0003","Great Lakes Outpost"]
["87622","87622","","Leadville Outdoors &"]
["89107-0027","89107","0027","Wilco Farmers - Pasco"]